John Smith;12.61;5.00;9.22;1.50;60.39;16.43;21.60;2.60;35.81;5.25.72
Jane Doe;13.04;4.53;7.79;1.55;64.72;18.74;24.20;2.40;28.20;6.50
Jaan Lepp;13.75;4.84;10.12;1.50;68.44;19.18;30.85;2.80;33.88;6.22
Foo Bar;13.43;4.35;8.64;1.50;66.06;19.05;24.89;2.20;33.48;6.51

Foo Bar2;13.43;4.35;8.64;1.50;66.06;19.05;24.89;2.20;33.48;6.51