%YAML 1.1
%TAG !u! tag:unity3d.com,2011:
--- !u!114 &11400000
MonoBehaviour:
  m_ObjectHideFlags: 0
  m_CorrespondingSourceObject: {fileID: 0}
  m_PrefabInstance: {fileID: 0}
  m_PrefabAsset: {fileID: 0}
  m_GameObject: {fileID: 0}
  m_Enabled: 1
  m_EditorHideFlags: 0
  m_Script: {fileID: 11500000, guid: 54d44ebde6e96ee43a042962ec6d03e3, type: 3}
  m_Name: 3-1
  m_EditorClassIdentifier: 
  question: "\u0421\u043A\u0456\u043B\u044C\u043A\u0438 \u0431\u0443\u0434\u0435
    3 x 1?"
  answers:
  - 1
  - 3
  - 6
  - 18
  correctAnswerIndex: 1
