(footprint "MSOP-10_L3.0-W3.0-P0.50-LS5.0-BL-EP"
	(version 20240108)
	(generator "pcbnew")
	(generator_version "8.0")
	(layer "F.Cu")
	(property "Reference" "REF**"
		(at 0 -6.11 0)
		(layer "F.SilkS")
		(uuid "5616dcdb-0d0f-4400-82a1-691fc31ad2b9")
		(effects
			(font
				(size 1 1)
				(thickness 0.15)
			)
		)
	)
	(property "Value" "MSOP-10_L3.0-W3.0-P0.50-LS5.0-BL-EP"
		(at 0 6.11 0)
		(layer "F.Fab")
		(uuid "4066acd1-c442-4ce5-b509-15a2baa6876c")
		(effects
			(font
				(size 1 1)
				(thickness 0.15)
			)
		)
	)
	(property "Footprint" "MSOP-10_L3.0-W3.0-P0.50-LS5.0-BL-EP"
		(at 0 0 0)
		(unlocked yes)
		(layer "F.Fab")
		(hide yes)
		(uuid "e45f9853-5150-4a5b-9cbc-a7b7dc24a9a8")
		(effects
			(font
				(size 1.27 1.27)
			)
		)
	)
	(property "Datasheet" ""
		(at 0 0 0)
		(unlocked yes)
		(layer "F.Fab")
		(hide yes)
		(uuid "0bbce2c4-bee4-4307-bee6-42526acc030f")
		(effects
			(font
				(size 1.27 1.27)
			)
		)
	)
	(property "Description" ""
		(at 0 0 0)
		(unlocked yes)
		(layer "F.Fab")
		(hide yes)
		(uuid "c5452b11-d0b0-482d-9cdd-36aa0b3805bc")
		(effects
			(font
				(size 1.27 1.27)
			)
		)
	)
	(attr smd)
	(fp_line
		(start -1.52 -1.52)
		(end -1.52 -0.42)
		(stroke
			(width 0.15)
			(type solid)
		)
		(layer "F.SilkS")
		(uuid "08e8fa23-405a-4e4b-83e7-27801df3adc0")
	)
	(fp_line
		(start -1.52 1.52)
		(end -1.52 0.42)
		(stroke
			(width 0.15)
			(type solid)
		)
		(layer "F.SilkS")
		(uuid "1b907726-1b35-4a92-9f10-e1cbbbf02018")
	)
	(fp_line
		(start -1.52 1.52)
		(end -1.32 1.52)
		(stroke
			(width 0.15)
			(type solid)
		)
		(layer "F.SilkS")
		(uuid "49ad8f10-1d0d-4d9e-b7c6-41ea825962b4")
	)
	(fp_line
		(start -1.32 -1.52)
		(end -1.52 -1.52)
		(stroke
			(width 0.15)
			(type solid)
		)
		(layer "F.SilkS")
		(uuid "b52be5b0-f446-44db-b770-01e881f215b4")
	)
	(fp_line
		(start 1.32 1.52)
		(end 1.52 1.52)
		(stroke
			(width 0.15)
			(type solid)
		)
		(layer "F.SilkS")
		(uuid "59a2de9e-8096-4731-84b5-8302c5071593")
	)
	(fp_line
		(start 1.52 -1.52)
		(end 1.32 -1.52)
		(stroke
			(width 0.15)
			(type solid)
		)
		(layer "F.SilkS")
		(uuid "4bd33d5a-5033-4dc6-b2c4-70d502a5c88f")
	)
	(fp_line
		(start 1.52 1.52)
		(end 1.52 -1.52)
		(stroke
			(width 0.15)
			(type solid)
		)
		(layer "F.SilkS")
		(uuid "52032f44-0a01-4791-9b2f-65e9939b5fb2")
	)
	(fp_arc
		(start -1.52 -0.42)
		(mid -1.260427 -0.00086)
		(end -1.518463 0.419228)
		(stroke
			(width 0.15)
			(type solid)
		)
		(layer "F.SilkS")
		(uuid "a3bae1b7-e53b-42ce-a82c-25529ce62a6f")
	)
	(fp_circle
		(center -1.69 2.2)
		(end -1.54 2.2)
		(stroke
			(width 0.3)
			(type solid)
		)
		(fill none)
		(layer "F.SilkS")
		(uuid "ad96b970-006c-4e19-851e-1b930c244e69")
	)
	(fp_circle
		(center -1 2.85)
		(end -0.85 2.85)
		(stroke
			(width 0.3)
			(type solid)
		)
		(fill none)
		(layer "Cmts.User")
		(uuid "d91f287a-2606-4d0e-b8ca-6cc5f258d1d4")
	)
	(fp_circle
		(center -1.5 2.45)
		(end -1.47 2.45)
		(stroke
			(width 0.06)
			(type solid)
		)
		(fill none)
		(layer "F.Fab")
		(uuid "70a4cfdb-9cf3-4d05-8382-60e88926e89d")
	)
	(fp_text user "${REFERENCE}"
		(at 0 0 0)
		(layer "F.Fab")
		(uuid "f7777184-b9b0-4196-b7ff-2c3ea718a66d")
		(effects
			(font
				(size 1 1)
				(thickness 0.15)
			)
		)
	)
	(pad "1" smd oval
		(at -1 2.11)
		(size 0.28 1.62)
		(layers "F.Cu" "F.Paste" "F.Mask")
		(uuid "1d40acdd-bdff-42bb-9334-ab908e3bd145")
	)
	(pad "2" smd oval
		(at -0.5 2.11)
		(size 0.28 1.62)
		(layers "F.Cu" "F.Paste" "F.Mask")
		(uuid "aae534cd-c8fa-4fe1-bcc7-5f6399c8d8b6")
	)
	(pad "3" smd oval
		(at 0 2.11)
		(size 0.28 1.62)
		(layers "F.Cu" "F.Paste" "F.Mask")
		(uuid "a650c017-2b9f-413d-a31d-858d92f85190")
	)
	(pad "4" smd oval
		(at 0.5 2.11)
		(size 0.28 1.62)
		(layers "F.Cu" "F.Paste" "F.Mask")
		(uuid "3f2c6205-db01-45cb-bd93-79851166e52c")
	)
	(pad "5" smd oval
		(at 1 2.11)
		(size 0.28 1.62)
		(layers "F.Cu" "F.Paste" "F.Mask")
		(uuid "bc9a8f4b-1fac-451d-8449-26afa8f1d884")
	)
	(pad "6" smd oval
		(at 1 -2.11)
		(size 0.28 1.62)
		(layers "F.Cu" "F.Paste" "F.Mask")
		(uuid "39991ec7-5f61-4711-a0f4-0667779f8fad")
	)
	(pad "7" smd oval
		(at 0.5 -2.11)
		(size 0.28 1.62)
		(layers "F.Cu" "F.Paste" "F.Mask")
		(uuid "f4b31258-3344-40fb-9c10-b7d2c55db78f")
	)
	(pad "8" smd oval
		(at 0 -2.11)
		(size 0.28 1.62)
		(layers "F.Cu" "F.Paste" "F.Mask")
		(uuid "2b5fb1ad-7e6a-4bea-aabd-38417b4e11ec")
	)
	(pad "9" smd oval
		(at -0.5 -2.11)
		(size 0.28 1.62)
		(layers "F.Cu" "F.Paste" "F.Mask")
		(uuid "614dc268-f6b5-48d6-87c6-ddc868362422")
	)
	(pad "10" smd oval
		(at -1 -2.11)
		(size 0.28 1.62)
		(layers "F.Cu" "F.Paste" "F.Mask")
		(uuid "c8ee1fff-c31c-4530-9409-79482632f51f")
	)
	(pad "11" smd rect
		(at 0 0)
		(size 2.1 1.83)
		(layers "F.Cu" "F.Paste" "F.Mask")
		(uuid "1de16a45-8854-4a4f-89fb-f8f16c923752")
	)
	(model "${DOWNLOADED_COMPONENTS}/lcsc_downloads.3dshapes/MSOP-10_L3.0-W3.0-H1.1-LS5.0-P0.50.step"
		(offset
			(xyz 0 0 0)
		)
		(scale
			(xyz 1 1 1)
		)
		(rotate
			(xyz 0 0 0)
		)
	)
)
