module gitlab.com/juha.ristolainen/cryptovalues

require (
	github.com/Jeffail/gabs v1.1.0
	github.com/fsnotify/fsnotify v1.4.7
	github.com/hashicorp/hcl v0.0.0-20180404174102-ef8a98b0bbce
	github.com/inconshreveable/mousetrap v1.0.0
	github.com/magiconair/properties v1.8.0
	github.com/mitchellh/go-homedir v0.0.0-20180523094522-3864e76763d9
	github.com/mitchellh/mapstructure v0.0.0-20180511142126-bb74f1db0675
	github.com/pelletier/go-toml v1.2.0
	github.com/ramya-rao-a/go-outline v0.0.0-20181122025142-7182a932836a // indirect
	github.com/spf13/afero v1.1.1
	github.com/spf13/cast v1.2.0
	github.com/spf13/cobra v0.0.3
	github.com/spf13/jwalterweatherman v0.0.0-20180109140146-7c0cea34c8ec
	github.com/spf13/pflag v1.0.1
	github.com/spf13/viper v1.0.2
	golang.org/x/sys v0.0.0-20180627142611-7138fd3d9dc8
	golang.org/x/text v0.3.0
	golang.org/x/tools v0.0.0-20181205014116-22934f0fdb62 // indirect
	gopkg.in/yaml.v2 v2.2.1
)
