{
    "pca_light" : {
        "i2c_address": 31,
        "analog_outputs" : [
            { "out0" : 2 },
            { "out1" : 3 },
            { "out2" : 4 },
            { "out3" : 5 },
            { "out4" : 6 },
            { "out5" : 7 },
            { "out6" : 8 },
            { "out7" : 9 },
            { "out8" : 10 },
            { "out9" : 11 },
            { "out10" : 12 },
            { "out11" : 13 },
            { "out12" : 14 },
            { "out13" : 15 },
            { "out14" : 16 },
            { "out15" : 17 }
        ]
    },
    "pca_fan" : {
        "i2c_address": 7,
        "analog_outputs" : [
            { "out0" : 2 },
            { "out1" : 3 },
            { "out2" : 4 },
            { "out3" : 5 },
            { "out4" : 6 },
            { "out5" : 7 },
            { "out6" : 8 },
            { "out7" : 9 },
            { "out8" : 10 },
            { "out9" : 11 },
            { "out10" : 12 },
            { "out11" : 13 },
            { "out12" : 14 },
            { "out13" : 15 },
            { "out14" : 16 },
            { "out15" : 17 }
        ]
    },
    "portexpander" : {
        "i2c_address": 32,
        "digital_outputs" : [
            { "out0": { "port": 18, "pin": 0 } },
            { "out1": { "port": 18, "pin": 1 } },
            { "out2": { "port": 18, "pin": 2 } },
            { "out3": { "port": 18, "pin": 3 } },
            { "out4": { "port": 18, "pin": 4 } },
            { "out5": { "port": 18, "pin": 5 } },
            { "out6": { "port": 18, "pin": 6 } },
            { "out7": { "port": 18, "pin": 7 } },
            { "out8": { "port": 19, "pin": 0 } },
            { "out9": { "port": 19, "pin": 1 } },
            { "out10": { "port": 19, "pin": 2 } },
            { "out11": { "port": 19, "pin": 3 } }
        ],
        "digital_inputs" : [
            { "in0": { "port": 19, "pin": 4 } },
            { "in1": { "port": 19, "pin": 5 } },
            { "in2": { "port": 19, "pin": 6 } },
            { "in3": { "port": 19, "pin": 7 } }
        ]
    },
    "temperature_udp": {
        "host": "192.168.188.202",
        "port": 9999,
        "timeout_ms": 1000,
        "analog_inputs" : [
            { "in0": 0 },
            { "in1": 1 },
            { "in2": 2 },
            { "in3": 3 },
            { "in4": 4 },
            { "in5": 5 }
        ]
    },
    "artnet_controller" : {
        "port" : 6454,
        "poll_interval_ms" : 3000,
        "max_node_timeout_events" : 3,
        "default_node_config": {
            "num_universes" : 1,
            "max_fps" : 40,
            "keepalive_interval_ms" : 1000
        },
        "ultim8_config" : {
            "num_universes" : 2,
            "max_fps" : 25,
            "keepalive_interval_ms" : 1000
        },
        "nodes" : [
            {"ultim8_1" : {
                "host": "192.168.188.21",
                "port": 6454,
                "analog_outputs" : [
                    { "out0" : { "universe": 0, "address": 3 } },
                    { "out1" : { "universe": 0, "address": 4 } },
                    { "out2" : { "universe": 0, "address": 5 } },
                    { "out3" : { "universe": 0, "address": 6 } },
                    { "out4" : { "universe": 0, "address": 7 } },
                    { "out5" : { "universe": 0, "address": 8 } },
                    { "out6" : { "universe": 0, "address": 9 } },
                    { "out7" : { "universe": 0, "address": 10 } },
                    { "out8" : { "universe": 0, "address": 11 } },
                    { "out9" : { "universe": 0, "address": 12 } },
                    { "out10" : { "universe": 0, "address": 13 } },
                    { "out11" : { "universe": 0, "address": 14 } },
                    { "out12" : { "universe": 0, "address": 15 } },
                    { "out13" : { "universe": 0, "address": 16 } },
                    { "out14" : { "universe": 0, "address": 17 } },
                    { "out15" : { "universe": 0, "address": 18 } },
                    { "out16" : { "universe": 1, "address": 19 } },
                    { "out17" : { "universe": 1, "address": 20 } },
                    { "out18" : { "universe": 1, "address": 21 } },
                    { "out19" : { "universe": 1, "address": 22 } },
                    { "out20" : { "universe": 1, "address": 23 } },
                    { "out21" : { "universe": 1, "address": 24 } },
                    { "out22" : { "universe": 1, "address": 25 } },
                    { "out23" : { "universe": 1, "address": 26 } },
                    { "out24" : { "universe": 1, "address": 27 } },
                    { "out25" : { "universe": 1, "address": 28 } },
                    { "out26" : { "universe": 1, "address": 29 } },
                    { "out27" : { "universe": 1, "address": 30 } },
                    { "out28" : { "universe": 1, "address": 31 } },
                    { "out29" : { "universe": 1, "address": 32 } }
                ]
            }},
            {"ultim8_2" : {
                "host": "192.168.188.22",
                "port": 6454,
                "analog_outputs" : [
                    { "out0" : { "universe": 0, "address": 33 } },
                    { "out1" : { "universe": 0, "address": 34 } },
                    { "out2" : { "universe": 0, "address": 35 } },
                    { "out3" : { "universe": 0, "address": 36 } },
                    { "out4" : { "universe": 0, "address": 37 } },
                    { "out5" : { "universe": 0, "address": 38 } },
                    { "out6" : { "universe": 0, "address": 39 } },
                    { "out7" : { "universe": 0, "address": 40 } },
                    { "out8" : { "universe": 0, "address": 41 } },
                    { "out9" : { "universe": 0, "address": 42 } },
                    { "out10" : { "universe": 0, "address": 43 } },
                    { "out11" : { "universe": 0, "address": 44 } },
                    { "out12" : { "universe": 1, "address": 45 } },
                    { "out13" : { "universe": 1, "address": 46 } },
                    { "out14" : { "universe": 1, "address": 47 } },
                    { "out15" : { "universe": 1, "address": 48 } },
                    { "out16" : { "universe": 1, "address": 49 } },
                    { "out17" : { "universe": 1, "address": 50 } },
                    { "out18" : { "universe": 1, "address": 51 } },
                    { "out19" : { "universe": 1, "address": 52 } },
                    { "out20" : { "universe": 1, "address": 53 } },
                    { "out21" : { "universe": 1, "address": 54 } },
                    { "out22" : { "universe": 1, "address": 55 } },
                    { "out23" : { "universe": 1, "address": 56 } }
                ]
            }}
        ]
    },
    "wallswitch": {
        "pin_1": 20,
        "pin_2": 21,
        "debounce_time_ms": 200
    },
    "ps_12V" : {
        "digital_output": "portexpander.out1",
        "startup_delay_ms": 500,
        "shutdown_delay_ms": 5000
    },
    "ps_48V" : {
        "digital_output": "portexpander.out0",
        "startup_delay_ms": 500,
        "shutdown_delay_ms": 5000
    },
    "pc" : {
        "digital_output": "portexpander.out4"
    },
    "indicator_relais": {
        "digital_output": "portexpander.out6"
    },
    "empty_relais_1": {
        "digital_output": "portexpander.out7"
    },
    "empty_relais_2": {
        "digital_output": "portexpander.out8"
    },
    "system_monitor": {
        "update_interval": 3,
        "analog_inputs" : [
            "cpu_temperature"
        ]
    }
}
