{
    "cabin" : {
        "temperature_sensor" : "temperature_udp.in1",
        "fan" : "pca_fan.out10"
    },
    "onkyo" : {
        "temperature_sensor" : "temperature_udp.in2",
        "fan" : "pca_fan.out11"
    },
    "powersupply" : {
        "temperature_sensor" : "temperature_udp.in4",
        "fan" : "pca_fan.out12"
    },
    "pi" : {
        "temperature_sensor": "system_monitor.cpu_temperature",
        "fan" : "pca_fan.out13"
    },
    "pc" : {
        "temperature_sensor" : "temperature_udp.in0"
    }
}
