EESchema Schematic File Version 4
EELAYER 30 0
EELAYER END
$Descr A4 11693 8268
encoding utf-8
Sheet 5 7
Title "SliderRGBShield"
Date "2020-12-29"
Rev "1.0"
Comp ""
Comment1 ""
Comment2 ""
Comment3 ""
Comment4 ""
$EndDescr
$Comp
L Driver_LED:PCA9685PW U2
U 1 1 5FEA8BFD
P 2900 3750
F 0 "U2" H 3300 2800 50  0000 C CNN
F 1 "PCA9685PW" H 2900 3750 50  0000 C CNN
F 2 "Package_SO:TSSOP-28_4.4x9.7mm_P0.65mm" H 2925 2775 50  0001 L CNN
F 3 "http://www.nxp.com/documents/data_sheet/PCA9685.pdf" H 2500 4450 50  0001 C CNN
	1    2900 3750
	1    0    0    -1  
$EndComp
$Comp
L Driver_Motor:TB6612FNG U3
U 1 1 5FEA99E9
P 5050 2300
F 0 "U3" H 5550 1550 50  0000 C CNN
F 1 "TB6612FNG" H 5050 2300 50  0000 C CNN
F 2 "Package_SO:SSOP-24_5.3x8.2mm_P0.65mm" H 6350 1400 50  0001 C CNN
F 3 "https://toshiba.semicon-storage.com/us/product/linear/motordriver/detail.TB6612FNG.html" H 5500 2900 50  0001 C CNN
	1    5050 2300
	1    0    0    -1  
$EndComp
$Comp
L Driver_Motor:TB6612FNG U4
U 1 1 5FEAA442
P 5050 5300
F 0 "U4" H 5550 4550 50  0000 C CNN
F 1 "TB6612FNG" H 5050 5300 50  0000 C CNN
F 2 "Package_SO:SSOP-24_5.3x8.2mm_P0.65mm" H 6350 4400 50  0001 C CNN
F 3 "https://toshiba.semicon-storage.com/us/product/linear/motordriver/detail.TB6612FNG.html" H 5500 5900 50  0001 C CNN
	1    5050 5300
	1    0    0    -1  
$EndComp
Text HLabel 5750 1900 2    50   Output ~ 0
M1_A
Text HLabel 5750 2100 2    50   Output ~ 0
M1_B
Text HLabel 5750 2400 2    50   Output ~ 0
M2_A
Text HLabel 5750 2600 2    50   Output ~ 0
M2_B
Text HLabel 5750 4900 2    50   Output ~ 0
M3_A
Text HLabel 5750 5100 2    50   Output ~ 0
M3_B
Text HLabel 5750 5400 2    50   Output ~ 0
M4_A
Text HLabel 5750 5600 2    50   Output ~ 0
M4_B
Wire Wire Line
	5650 1900 5750 1900
Wire Wire Line
	5650 2100 5750 2100
Wire Wire Line
	5650 2400 5750 2400
Wire Wire Line
	5650 2600 5750 2600
Wire Wire Line
	5650 5600 5750 5600
Wire Wire Line
	5650 5400 5750 5400
Wire Wire Line
	5650 5100 5750 5100
Wire Wire Line
	5650 4900 5750 4900
Wire Wire Line
	5150 4300 5150 4250
Wire Wire Line
	5150 4250 5250 4250
Wire Wire Line
	5350 4250 5350 4300
Wire Wire Line
	5250 4300 5250 4250
Connection ~ 5250 4250
Wire Wire Line
	5250 4250 5350 4250
$Comp
L power:GND #PWR0103
U 1 1 5FEB397E
P 5250 6400
F 0 "#PWR0103" H 5250 6150 50  0001 C CNN
F 1 "GND" H 5255 6227 50  0000 C CNN
F 2 "" H 5250 6400 50  0001 C CNN
F 3 "" H 5250 6400 50  0001 C CNN
	1    5250 6400
	1    0    0    -1  
$EndComp
Wire Wire Line
	5150 6300 5150 6350
Wire Wire Line
	5150 6350 5250 6350
Wire Wire Line
	5350 6350 5350 6300
Wire Wire Line
	5250 6350 5250 6400
Connection ~ 5250 6350
Wire Wire Line
	5250 6350 5350 6350
$Comp
L power:GND #PWR0104
U 1 1 5FEB4C0C
P 4750 6400
F 0 "#PWR0104" H 4750 6150 50  0001 C CNN
F 1 "GND" H 4755 6227 50  0000 C CNN
F 2 "" H 4750 6400 50  0001 C CNN
F 3 "" H 4750 6400 50  0001 C CNN
	1    4750 6400
	1    0    0    -1  
$EndComp
Wire Wire Line
	4750 6300 4750 6400
$Comp
L power:GND #PWR0105
U 1 1 5FEC1E33
P 5250 3400
F 0 "#PWR0105" H 5250 3150 50  0001 C CNN
F 1 "GND" H 5255 3227 50  0000 C CNN
F 2 "" H 5250 3400 50  0001 C CNN
F 3 "" H 5250 3400 50  0001 C CNN
	1    5250 3400
	1    0    0    -1  
$EndComp
Wire Wire Line
	5150 3300 5150 3350
Wire Wire Line
	5150 3350 5250 3350
Wire Wire Line
	5350 3350 5350 3300
Wire Wire Line
	5250 3350 5250 3400
Connection ~ 5250 3350
Wire Wire Line
	5250 3350 5350 3350
$Comp
L power:GND #PWR0106
U 1 1 5FEC2D0C
P 4750 3400
F 0 "#PWR0106" H 4750 3150 50  0001 C CNN
F 1 "GND" H 4755 3227 50  0000 C CNN
F 2 "" H 4750 3400 50  0001 C CNN
F 3 "" H 4750 3400 50  0001 C CNN
	1    4750 3400
	1    0    0    -1  
$EndComp
Wire Wire Line
	4750 3400 4750 3300
$Comp
L power:+5V #PWR0107
U 1 1 5FEC3E5C
P 4750 4200
F 0 "#PWR0107" H 4750 4050 50  0001 C CNN
F 1 "+5V" H 4765 4373 50  0000 C CNN
F 2 "" H 4750 4200 50  0001 C CNN
F 3 "" H 4750 4200 50  0001 C CNN
	1    4750 4200
	1    0    0    -1  
$EndComp
Wire Wire Line
	4750 4200 4750 4300
$Comp
L power:+5V #PWR0108
U 1 1 5FEC4D4B
P 4400 4850
F 0 "#PWR0108" H 4400 4700 50  0001 C CNN
F 1 "+5V" H 4415 5023 50  0000 C CNN
F 2 "" H 4400 4850 50  0001 C CNN
F 3 "" H 4400 4850 50  0001 C CNN
	1    4400 4850
	1    0    0    -1  
$EndComp
$Comp
L power:+5V #PWR0109
U 1 1 5FEC518F
P 4400 1850
F 0 "#PWR0109" H 4400 1700 50  0001 C CNN
F 1 "+5V" H 4415 2023 50  0000 C CNN
F 2 "" H 4400 1850 50  0001 C CNN
F 3 "" H 4400 1850 50  0001 C CNN
	1    4400 1850
	1    0    0    -1  
$EndComp
$Comp
L power:+5V #PWR0110
U 1 1 5FEC594F
P 4750 1200
F 0 "#PWR0110" H 4750 1050 50  0001 C CNN
F 1 "+5V" H 4765 1373 50  0000 C CNN
F 2 "" H 4750 1200 50  0001 C CNN
F 3 "" H 4750 1200 50  0001 C CNN
	1    4750 1200
	1    0    0    -1  
$EndComp
Wire Wire Line
	4750 1200 4750 1300
Wire Wire Line
	4400 1850 4400 1900
Wire Wire Line
	4400 1900 4450 1900
Wire Wire Line
	4400 4850 4400 4900
Wire Wire Line
	4400 4900 4450 4900
Wire Wire Line
	3600 3250 3800 3250
Wire Wire Line
	3800 3250 3800 2100
Wire Wire Line
	3800 2100 4450 2100
Wire Wire Line
	3600 3350 3900 3350
Wire Wire Line
	3900 3350 3900 2500
Wire Wire Line
	3900 2500 4450 2500
Wire Wire Line
	3600 3450 4000 3450
Wire Wire Line
	4000 3450 4000 2400
Wire Wire Line
	4000 2400 4450 2400
Wire Wire Line
	3600 3550 4100 3550
Wire Wire Line
	4100 3550 4100 2600
Wire Wire Line
	4100 2600 4450 2600
Wire Wire Line
	3600 3650 4200 3650
Wire Wire Line
	4200 3650 4200 2700
Wire Wire Line
	4200 2700 4450 2700
Wire Wire Line
	3600 3750 4300 3750
Wire Wire Line
	4300 3750 4300 2200
Wire Wire Line
	4300 2200 4450 2200
Wire Wire Line
	3600 3850 4300 3850
Wire Wire Line
	4300 3850 4300 5100
Wire Wire Line
	4300 5100 4450 5100
Wire Wire Line
	3600 3950 4200 3950
Wire Wire Line
	4200 3950 4200 5500
Wire Wire Line
	4200 5500 4450 5500
Wire Wire Line
	3600 4050 4100 4050
Wire Wire Line
	4100 4050 4100 5400
Wire Wire Line
	4100 5400 4450 5400
Wire Wire Line
	3600 4150 4000 4150
Wire Wire Line
	4000 4150 4000 5600
Wire Wire Line
	4000 5600 4450 5600
Wire Wire Line
	3600 4250 3900 4250
Wire Wire Line
	3900 4250 3900 5700
Wire Wire Line
	3900 5700 4450 5700
Wire Wire Line
	3600 4350 3800 4350
Wire Wire Line
	3800 4350 3800 5200
Wire Wire Line
	3800 5200 4450 5200
$Comp
L Device:R_Small R53
U 1 1 5FEEDEFE
P 2000 4650
F 0 "R53" V 2000 4600 50  0000 L CNN
F 1 "10k" V 1950 4700 50  0000 L CNN
F 2 "Resistor_SMD:R_0805_2012Metric_Pad1.20x1.40mm_HandSolder" H 2000 4650 50  0001 C CNN
F 3 "~" H 2000 4650 50  0001 C CNN
	1    2000 4650
	1    0    0    -1  
$EndComp
$Comp
L Device:R_Small R52
U 1 1 5FEEF181
P 1900 4650
F 0 "R52" V 1900 4600 50  0000 L CNN
F 1 "10k" V 1850 4700 50  0000 L CNN
F 2 "Resistor_SMD:R_0805_2012Metric_Pad1.20x1.40mm_HandSolder" H 1900 4650 50  0001 C CNN
F 3 "~" H 1900 4650 50  0001 C CNN
	1    1900 4650
	1    0    0    -1  
$EndComp
$Comp
L Device:R_Small R51
U 1 1 5FEEF459
P 1800 4650
F 0 "R51" V 1800 4600 50  0000 L CNN
F 1 "10k" V 1750 4700 50  0000 L CNN
F 2 "Resistor_SMD:R_0805_2012Metric_Pad1.20x1.40mm_HandSolder" H 1800 4650 50  0001 C CNN
F 3 "~" H 1800 4650 50  0001 C CNN
	1    1800 4650
	1    0    0    -1  
$EndComp
$Comp
L Device:R_Small R50
U 1 1 5FEEF612
P 1700 4650
F 0 "R50" V 1700 4600 50  0000 L CNN
F 1 "10k" V 1650 4700 50  0000 L CNN
F 2 "Resistor_SMD:R_0805_2012Metric_Pad1.20x1.40mm_HandSolder" H 1700 4650 50  0001 C CNN
F 3 "~" H 1700 4650 50  0001 C CNN
	1    1700 4650
	1    0    0    -1  
$EndComp
$Comp
L Device:R_Small R49
U 1 1 5FEEF796
P 1600 4650
F 0 "R49" V 1600 4600 50  0000 L CNN
F 1 "10k" V 1550 4700 50  0000 L CNN
F 2 "Resistor_SMD:R_0805_2012Metric_Pad1.20x1.40mm_HandSolder" H 1600 4650 50  0001 C CNN
F 3 "~" H 1600 4650 50  0001 C CNN
	1    1600 4650
	1    0    0    -1  
$EndComp
Wire Wire Line
	2200 4450 2100 4450
Wire Wire Line
	2200 4350 2000 4350
Wire Wire Line
	2000 4350 2000 4550
Wire Wire Line
	2200 4250 1900 4250
Wire Wire Line
	1900 4250 1900 4550
Wire Wire Line
	2200 4150 1800 4150
Wire Wire Line
	1800 4150 1800 4550
Wire Wire Line
	2200 4050 1700 4050
Wire Wire Line
	1700 4050 1700 4550
Wire Wire Line
	2200 3950 1600 3950
Wire Wire Line
	1600 3950 1600 4550
$Comp
L power:GND #PWR0111
U 1 1 5FF00201
P 1600 4850
F 0 "#PWR0111" H 1600 4600 50  0001 C CNN
F 1 "GND" H 1605 4677 50  0000 C CNN
F 2 "" H 1600 4850 50  0001 C CNN
F 3 "" H 1600 4850 50  0001 C CNN
	1    1600 4850
	1    0    0    -1  
$EndComp
Wire Wire Line
	1600 4750 1600 4800
Wire Wire Line
	1600 4800 1700 4800
Wire Wire Line
	1700 4750 1700 4800
Connection ~ 1700 4800
Wire Wire Line
	1700 4800 1800 4800
Wire Wire Line
	1800 4750 1800 4800
Connection ~ 1800 4800
Wire Wire Line
	1900 4750 1900 4800
Connection ~ 1900 4800
Wire Wire Line
	1900 4800 2000 4800
Wire Wire Line
	2000 4750 2000 4800
Wire Wire Line
	1800 4800 1900 4800
Wire Wire Line
	1600 4800 1600 4850
Connection ~ 1600 4800
$Comp
L Jumper:SolderJumper_2_Open JP1
U 1 1 5FF173A3
P 1300 3950
F 0 "JP1" H 1150 4000 50  0000 C CNN
F 1 "SolderJumper_2_Open" H 1300 4064 50  0001 C CNN
F 2 "Jumper:SolderJumper-2_P1.3mm_Open_RoundedPad1.0x1.5mm" H 1300 3950 50  0001 C CNN
F 3 "~" H 1300 3950 50  0001 C CNN
	1    1300 3950
	1    0    0    -1  
$EndComp
$Comp
L Jumper:SolderJumper_2_Open JP2
U 1 1 5FF18277
P 1300 4050
F 0 "JP2" H 1150 4100 50  0000 C CNN
F 1 "SolderJumper_2_Open" H 1300 4164 50  0001 C CNN
F 2 "Jumper:SolderJumper-2_P1.3mm_Open_RoundedPad1.0x1.5mm" H 1300 4050 50  0001 C CNN
F 3 "~" H 1300 4050 50  0001 C CNN
	1    1300 4050
	1    0    0    -1  
$EndComp
$Comp
L Jumper:SolderJumper_2_Open JP3
U 1 1 5FF186A8
P 1300 4150
F 0 "JP3" H 1150 4200 50  0000 C CNN
F 1 "SolderJumper_2_Open" H 1300 4264 50  0001 C CNN
F 2 "Jumper:SolderJumper-2_P1.3mm_Open_RoundedPad1.0x1.5mm" H 1300 4150 50  0001 C CNN
F 3 "~" H 1300 4150 50  0001 C CNN
	1    1300 4150
	1    0    0    -1  
$EndComp
$Comp
L Jumper:SolderJumper_2_Open JP4
U 1 1 5FF1892C
P 1300 4250
F 0 "JP4" H 1150 4300 50  0000 C CNN
F 1 "SolderJumper_2_Open" H 1300 4364 50  0001 C CNN
F 2 "Jumper:SolderJumper-2_P1.3mm_Open_RoundedPad1.0x1.5mm" H 1300 4250 50  0001 C CNN
F 3 "~" H 1300 4250 50  0001 C CNN
	1    1300 4250
	1    0    0    -1  
$EndComp
$Comp
L Jumper:SolderJumper_2_Open JP5
U 1 1 5FF18CA8
P 1300 4350
F 0 "JP5" H 1150 4400 50  0000 C CNN
F 1 "SolderJumper_2_Open" H 1300 4464 50  0001 C CNN
F 2 "Jumper:SolderJumper-2_P1.3mm_Open_RoundedPad1.0x1.5mm" H 1300 4350 50  0001 C CNN
F 3 "~" H 1300 4350 50  0001 C CNN
	1    1300 4350
	1    0    0    -1  
$EndComp
Wire Wire Line
	1450 3950 1600 3950
Connection ~ 1600 3950
Wire Wire Line
	1450 4050 1700 4050
Connection ~ 1700 4050
Wire Wire Line
	1450 4150 1800 4150
Connection ~ 1800 4150
Wire Wire Line
	1450 4250 1900 4250
Connection ~ 1900 4250
Wire Wire Line
	1450 4350 2000 4350
Connection ~ 2000 4350
$Comp
L power:+5V #PWR0112
U 1 1 5FF35809
P 1050 3850
F 0 "#PWR0112" H 1050 3700 50  0001 C CNN
F 1 "+5V" H 1065 4023 50  0000 C CNN
F 2 "" H 1050 3850 50  0001 C CNN
F 3 "" H 1050 3850 50  0001 C CNN
	1    1050 3850
	1    0    0    -1  
$EndComp
Wire Wire Line
	1050 3850 1050 3950
Wire Wire Line
	1050 3950 1150 3950
Wire Wire Line
	1050 3950 1050 4050
Wire Wire Line
	1050 4050 1150 4050
Connection ~ 1050 3950
Wire Wire Line
	1050 4050 1050 4150
Connection ~ 1050 4050
Wire Wire Line
	1150 4350 1050 4350
Wire Wire Line
	1050 4250 1150 4250
Connection ~ 1050 4250
Wire Wire Line
	1050 4250 1050 4350
Wire Wire Line
	1150 4150 1050 4150
Connection ~ 1050 4150
Wire Wire Line
	1050 4150 1050 4250
$Comp
L power:GND #PWR0113
U 1 1 5FF58B8A
P 2900 4900
F 0 "#PWR0113" H 2900 4650 50  0001 C CNN
F 1 "GND" H 2905 4727 50  0000 C CNN
F 2 "" H 2900 4900 50  0001 C CNN
F 3 "" H 2900 4900 50  0001 C CNN
	1    2900 4900
	1    0    0    -1  
$EndComp
$Comp
L power:GND #PWR0114
U 1 1 5FF58FF5
P 2100 3450
F 0 "#PWR0114" H 2100 3200 50  0001 C CNN
F 1 "GND" H 2105 3277 50  0000 C CNN
F 2 "" H 2100 3450 50  0001 C CNN
F 3 "" H 2100 3450 50  0001 C CNN
	1    2100 3450
	1    0    0    -1  
$EndComp
Wire Wire Line
	2100 3450 2100 3350
Wire Wire Line
	2100 3250 2200 3250
Wire Wire Line
	2200 3350 2100 3350
Connection ~ 2100 3350
Wire Wire Line
	2100 3350 2100 3250
Wire Wire Line
	2900 4850 2900 4900
$Comp
L power:+5V #PWR0115
U 1 1 5FF68675
P 2900 2650
F 0 "#PWR0115" H 2900 2500 50  0001 C CNN
F 1 "+5V" H 2915 2823 50  0000 C CNN
F 2 "" H 2900 2650 50  0001 C CNN
F 3 "" H 2900 2650 50  0001 C CNN
	1    2900 2650
	1    0    0    -1  
$EndComp
Wire Wire Line
	2900 2650 2900 2750
Text HLabel 2100 3050 0    50   Input ~ 0
SDA
Text HLabel 2100 3150 0    50   Input ~ 0
SCL
Wire Wire Line
	2100 3050 2200 3050
Wire Wire Line
	2100 3150 2200 3150
Text HLabel 5900 1200 2    50   UnSpc ~ 0
V_MOT
Wire Wire Line
	5350 4250 5750 4250
Connection ~ 5350 4250
$Comp
L Device:C C3
U 1 1 601A64F1
P 8850 1500
F 0 "C3" H 8965 1546 50  0000 L CNN
F 1 "10u" H 8965 1455 50  0000 L CNN
F 2 "Capacitor_SMD:C_0805_2012Metric_Pad1.18x1.45mm_HandSolder" H 8888 1350 50  0001 C CNN
F 3 "~" H 8850 1500 50  0001 C CNN
	1    8850 1500
	1    0    0    -1  
$EndComp
$Comp
L Device:C C4
U 1 1 601A6E76
P 9250 1500
F 0 "C4" H 9365 1546 50  0000 L CNN
F 1 "100n" H 9365 1455 50  0000 L CNN
F 2 "Capacitor_SMD:C_0805_2012Metric_Pad1.18x1.45mm_HandSolder" H 9288 1350 50  0001 C CNN
F 3 "~" H 9250 1500 50  0001 C CNN
	1    9250 1500
	1    0    0    -1  
$EndComp
$Comp
L power:+5V #PWR0134
U 1 1 601A737C
P 9250 1250
F 0 "#PWR0134" H 9250 1100 50  0001 C CNN
F 1 "+5V" H 9265 1423 50  0000 C CNN
F 2 "" H 9250 1250 50  0001 C CNN
F 3 "" H 9250 1250 50  0001 C CNN
	1    9250 1250
	1    0    0    -1  
$EndComp
$Comp
L power:+5V #PWR0135
U 1 1 601A79A7
P 8850 1250
F 0 "#PWR0135" H 8850 1100 50  0001 C CNN
F 1 "+5V" H 8865 1423 50  0000 C CNN
F 2 "" H 8850 1250 50  0001 C CNN
F 3 "" H 8850 1250 50  0001 C CNN
	1    8850 1250
	1    0    0    -1  
$EndComp
$Comp
L power:GND #PWR0136
U 1 1 601A7C14
P 8850 1750
F 0 "#PWR0136" H 8850 1500 50  0001 C CNN
F 1 "GND" H 8855 1577 50  0000 C CNN
F 2 "" H 8850 1750 50  0001 C CNN
F 3 "" H 8850 1750 50  0001 C CNN
	1    8850 1750
	1    0    0    -1  
$EndComp
$Comp
L power:GND #PWR0137
U 1 1 601A7F57
P 9250 1750
F 0 "#PWR0137" H 9250 1500 50  0001 C CNN
F 1 "GND" H 9255 1577 50  0000 C CNN
F 2 "" H 9250 1750 50  0001 C CNN
F 3 "" H 9250 1750 50  0001 C CNN
	1    9250 1750
	1    0    0    -1  
$EndComp
Wire Wire Line
	8850 1250 8850 1350
Wire Wire Line
	9250 1250 9250 1350
Wire Wire Line
	9250 1750 9250 1650
Wire Wire Line
	8850 1650 8850 1750
Text HLabel 5750 4250 2    50   UnSpc ~ 0
V_MOT
Wire Wire Line
	5150 1200 5250 1200
Wire Wire Line
	5150 1200 5150 1300
Wire Wire Line
	5350 1200 5350 1300
Wire Wire Line
	5250 1200 5250 1300
Connection ~ 5250 1200
Wire Wire Line
	5250 1200 5350 1200
Wire Wire Line
	5350 1200 5900 1200
Connection ~ 5350 1200
$Comp
L Device:C C5
U 1 1 601E9438
P 9650 1500
F 0 "C5" H 9765 1546 50  0000 L CNN
F 1 "100n" H 9765 1455 50  0000 L CNN
F 2 "Capacitor_SMD:C_0805_2012Metric_Pad1.18x1.45mm_HandSolder" H 9688 1350 50  0001 C CNN
F 3 "~" H 9650 1500 50  0001 C CNN
	1    9650 1500
	1    0    0    -1  
$EndComp
$Comp
L power:+5V #PWR0138
U 1 1 601E9718
P 9650 1250
F 0 "#PWR0138" H 9650 1100 50  0001 C CNN
F 1 "+5V" H 9665 1423 50  0000 C CNN
F 2 "" H 9650 1250 50  0001 C CNN
F 3 "" H 9650 1250 50  0001 C CNN
	1    9650 1250
	1    0    0    -1  
$EndComp
$Comp
L power:GND #PWR0139
U 1 1 601E9722
P 9650 1750
F 0 "#PWR0139" H 9650 1500 50  0001 C CNN
F 1 "GND" H 9655 1577 50  0000 C CNN
F 2 "" H 9650 1750 50  0001 C CNN
F 3 "" H 9650 1750 50  0001 C CNN
	1    9650 1750
	1    0    0    -1  
$EndComp
Wire Wire Line
	9650 1250 9650 1350
Wire Wire Line
	9650 1750 9650 1650
$Comp
L Device:C C6
U 1 1 601F00AA
P 10050 1500
F 0 "C6" H 10165 1546 50  0000 L CNN
F 1 "100n" H 10165 1455 50  0000 L CNN
F 2 "Capacitor_SMD:C_0805_2012Metric_Pad1.18x1.45mm_HandSolder" H 10088 1350 50  0001 C CNN
F 3 "~" H 10050 1500 50  0001 C CNN
	1    10050 1500
	1    0    0    -1  
$EndComp
$Comp
L power:+5V #PWR0140
U 1 1 601F03B8
P 10050 1250
F 0 "#PWR0140" H 10050 1100 50  0001 C CNN
F 1 "+5V" H 10065 1423 50  0000 C CNN
F 2 "" H 10050 1250 50  0001 C CNN
F 3 "" H 10050 1250 50  0001 C CNN
	1    10050 1250
	1    0    0    -1  
$EndComp
$Comp
L power:GND #PWR0141
U 1 1 601F03C2
P 10050 1750
F 0 "#PWR0141" H 10050 1500 50  0001 C CNN
F 1 "GND" H 10055 1577 50  0000 C CNN
F 2 "" H 10050 1750 50  0001 C CNN
F 3 "" H 10050 1750 50  0001 C CNN
	1    10050 1750
	1    0    0    -1  
$EndComp
Wire Wire Line
	10050 1250 10050 1350
Wire Wire Line
	10050 1750 10050 1650
$Comp
L Device:CP C1
U 1 1 60217C78
P 8450 1500
F 0 "C1" H 8568 1546 50  0000 L CNN
F 1 "22u" H 8568 1455 50  0000 L CNN
F 2 "Capacitor_SMD:CP_Elec_5x5.7" H 8488 1350 50  0001 C CNN
F 3 "~" H 8450 1500 50  0001 C CNN
	1    8450 1500
	1    0    0    -1  
$EndComp
$Comp
L power:GND #PWR0142
U 1 1 6021F760
P 8450 1750
F 0 "#PWR0142" H 8450 1500 50  0001 C CNN
F 1 "GND" H 8455 1577 50  0000 C CNN
F 2 "" H 8450 1750 50  0001 C CNN
F 3 "" H 8450 1750 50  0001 C CNN
	1    8450 1750
	1    0    0    -1  
$EndComp
Wire Wire Line
	8450 1650 8450 1750
Text HLabel 8450 1250 1    50   UnSpc ~ 0
V_MOT
Wire Wire Line
	8450 1250 8450 1350
Wire Wire Line
	2100 4450 2100 4800
Wire Wire Line
	2100 4800 2000 4800
Connection ~ 2000 4800
$EndSCHEMATC
