EESchema Schematic File Version 4
EELAYER 30 0
EELAYER END
$Descr A4 11693 8268
encoding utf-8
Sheet 1 7
Title "SliderRGBShield"
Date "2020-12-29"
Rev "1.0"
Comp ""
Comment1 ""
Comment2 ""
Comment3 ""
Comment4 ""
$EndDescr
$Sheet
S 3200 750  550  650 
U 601FCB8D
F0 "RGB1" 50
F1 "RGB1.sch" 50
F2 "B" I L 3200 1250 50 
F3 "R" I L 3200 1050 50 
F4 "G" I L 3200 1150 50 
F5 "V_LED" I L 3200 900 50 
$EndSheet
$Sheet
S 3200 1600 550  650 
U 603247A9
F0 "RGB2" 50
F1 "RGB1.sch" 50
F2 "B" I L 3200 2100 50 
F3 "R" I L 3200 1900 50 
F4 "G" I L 3200 2000 50 
F5 "V_LED" I L 3200 1750 50 
$EndSheet
$Sheet
S 3200 2450 550  650 
U 6033974E
F0 "RGB3" 50
F1 "RGB1.sch" 50
F2 "B" I L 3200 2950 50 
F3 "R" I L 3200 2750 50 
F4 "G" I L 3200 2850 50 
F5 "V_LED" I L 3200 2600 50 
$EndSheet
$Comp
L slider_rgb:RS60N11MT0B502 SLIDER1
U 1 1 604B6FD9
P 3050 5450
F 0 "SLIDER1" H 2900 6100 50  0000 L CNN
F 1 "RS60N11MT0B502" V 3200 5100 50  0000 L CNN
F 2 "slider_rgb:RS60N11MT0B502" H 3750 5350 50  0001 C CNN
F 3 "" H 3750 5350 50  0001 C CNN
	1    3050 5450
	1    0    0    -1  
$EndComp
$Comp
L slider_rgb:RS60N11MT0B502 SLIDER2
U 1 1 604B8CBF
P 3650 5700
F 0 "SLIDER2" H 3500 6350 50  0000 L CNN
F 1 "RS60N11MT0B502" V 3800 5350 50  0000 L CNN
F 2 "slider_rgb:RS60N11MT0B502" H 4350 5600 50  0001 C CNN
F 3 "" H 4350 5600 50  0001 C CNN
	1    3650 5700
	1    0    0    -1  
$EndComp
$Comp
L slider_rgb:RS60N11MT0B502 SLIDER3
U 1 1 604B9D09
P 4250 5950
F 0 "SLIDER3" H 4100 6600 50  0000 L CNN
F 1 "RS60N11MT0B502" V 4400 5600 50  0000 L CNN
F 2 "slider_rgb:RS60N11MT0B502" H 4950 5850 50  0001 C CNN
F 3 "" H 4950 5850 50  0001 C CNN
	1    4250 5950
	1    0    0    -1  
$EndComp
$Comp
L slider_rgb:RS60N11MT0B502 SLIDER4
U 1 1 604BA7D2
P 4850 6200
F 0 "SLIDER4" H 4700 6850 50  0000 L CNN
F 1 "RS60N11MT0B502" V 5000 5850 50  0000 L CNN
F 2 "slider_rgb:RS60N11MT0B502" H 5550 6100 50  0001 C CNN
F 3 "" H 5550 6100 50  0001 C CNN
	1    4850 6200
	1    0    0    -1  
$EndComp
$Sheet
S 1800 5650 650  1350
U 5FEA853D
F0 "MotorDriver" 50
F1 "motor_driver.sch" 50
F2 "M1_A" O R 2450 5900 50 
F3 "M1_B" O R 2450 6000 50 
F4 "M2_A" O R 2450 6150 50 
F5 "M2_B" O R 2450 6250 50 
F6 "M3_A" O R 2450 6400 50 
F7 "M3_B" O R 2450 6500 50 
F8 "M4_A" O R 2450 6650 50 
F9 "M4_B" O R 2450 6750 50 
F10 "SDA" I L 1800 6300 50 
F11 "SCL" I L 1800 6400 50 
F12 "V_MOT" U L 1800 6150 50 
$EndSheet
Wire Wire Line
	2450 5900 2850 5900
Wire Wire Line
	2450 6000 2850 6000
Wire Wire Line
	2450 6150 3450 6150
Wire Wire Line
	2450 6250 3450 6250
Wire Wire Line
	2450 6400 4050 6400
Wire Wire Line
	2450 6500 4050 6500
Wire Wire Line
	2450 6650 4650 6650
Wire Wire Line
	2450 6750 4650 6750
$Comp
L MCU_Module:Arduino_UNO_R2 A1
U 1 1 5FEAF13D
P 8100 2150
F 0 "A1" H 8450 1100 50  0000 C CNN
F 1 "Arduino_UNO_R2" V 8100 2150 50  0000 C CNN
F 2 "Module:Arduino_UNO_R2" H 8100 2150 50  0001 C CIN
F 3 "https://www.arduino.cc/en/Main/arduinoBoardUno" H 8100 2150 50  0001 C CNN
	1    8100 2150
	1    0    0    -1  
$EndComp
$Comp
L power:GND #PWR0101
U 1 1 5FECC638
P 8100 3450
F 0 "#PWR0101" H 8100 3200 50  0001 C CNN
F 1 "GND" H 8105 3277 50  0000 C CNN
F 2 "" H 8100 3450 50  0001 C CNN
F 3 "" H 8100 3450 50  0001 C CNN
	1    8100 3450
	1    0    0    -1  
$EndComp
Wire Wire Line
	8000 3250 8000 3350
Wire Wire Line
	8000 3350 8100 3350
Wire Wire Line
	8200 3350 8200 3250
Wire Wire Line
	8100 3350 8100 3450
Connection ~ 8100 3350
Wire Wire Line
	8100 3350 8200 3350
Wire Wire Line
	8100 3250 8100 3350
$Comp
L power:GND #PWR0102
U 1 1 5FECD830
P 2800 5150
F 0 "#PWR0102" H 2800 4900 50  0001 C CNN
F 1 "GND" H 2805 4977 50  0000 C CNN
F 2 "" H 2800 5150 50  0001 C CNN
F 3 "" H 2800 5150 50  0001 C CNN
	1    2800 5150
	1    0    0    -1  
$EndComp
$Comp
L power:GND #PWR0116
U 1 1 5FECDD48
P 3400 5400
F 0 "#PWR0116" H 3400 5150 50  0001 C CNN
F 1 "GND" H 3405 5227 50  0000 C CNN
F 2 "" H 3400 5400 50  0001 C CNN
F 3 "" H 3400 5400 50  0001 C CNN
	1    3400 5400
	1    0    0    -1  
$EndComp
$Comp
L power:GND #PWR0117
U 1 1 5FECE456
P 4000 5650
F 0 "#PWR0117" H 4000 5400 50  0001 C CNN
F 1 "GND" H 4005 5477 50  0000 C CNN
F 2 "" H 4000 5650 50  0001 C CNN
F 3 "" H 4000 5650 50  0001 C CNN
	1    4000 5650
	1    0    0    -1  
$EndComp
$Comp
L power:GND #PWR0118
U 1 1 5FECE706
P 4600 5900
F 0 "#PWR0118" H 4600 5650 50  0001 C CNN
F 1 "GND" H 4605 5727 50  0000 C CNN
F 2 "" H 4600 5900 50  0001 C CNN
F 3 "" H 4600 5900 50  0001 C CNN
	1    4600 5900
	1    0    0    -1  
$EndComp
Wire Wire Line
	2800 5150 2800 5100
Wire Wire Line
	2800 5100 2850 5100
Wire Wire Line
	3400 5400 3400 5350
Wire Wire Line
	3400 5350 3450 5350
Wire Wire Line
	4000 5650 4000 5600
Wire Wire Line
	4000 5600 4050 5600
Wire Wire Line
	4600 5900 4600 5850
Wire Wire Line
	4600 5850 4650 5850
Wire Wire Line
	2800 4900 2850 4900
Wire Wire Line
	3400 5150 3450 5150
Wire Wire Line
	4000 5400 4050 5400
Wire Wire Line
	4600 5650 4650 5650
Wire Wire Line
	2700 5000 2850 5000
Wire Wire Line
	3300 5250 3450 5250
Wire Wire Line
	3900 5500 4050 5500
Wire Wire Line
	4500 5750 4650 5750
Text Label 2700 5000 0    50   ~ 0
A0
Text Label 3300 5250 0    50   ~ 0
A1
Text Label 3900 5500 0    50   ~ 0
A2
Text Label 4500 5750 0    50   ~ 0
A3
Wire Wire Line
	2800 4700 3400 4700
Wire Wire Line
	2800 4700 2800 4900
Wire Wire Line
	4600 4700 4600 5650
Wire Wire Line
	4000 4700 4000 5400
Connection ~ 4000 4700
Wire Wire Line
	4000 4700 4600 4700
Wire Wire Line
	3400 4700 3400 5150
Connection ~ 3400 4700
Wire Wire Line
	3400 4700 4000 4700
Wire Wire Line
	8600 2150 8800 2150
Wire Wire Line
	8600 2250 8800 2250
Wire Wire Line
	8600 2350 8800 2350
Wire Wire Line
	8600 2450 8800 2450
Text Label 8800 2150 2    50   ~ 0
A0
Text Label 8800 2250 2    50   ~ 0
A1
Text Label 8800 2350 2    50   ~ 0
A2
Text Label 8800 2450 2    50   ~ 0
A3
Text Label 9350 2550 2    50   ~ 0
SDA
Text Label 9350 2650 2    50   ~ 0
SCL
Wire Wire Line
	8600 1950 8650 1950
Text Label 8900 1950 2    50   ~ 0
V_REF
Wire Wire Line
	8600 2550 9000 2550
Wire Wire Line
	8600 2650 9150 2650
$Comp
L Device:R_Small R60
U 1 1 5FEE34C8
P 9150 2400
F 0 "R60" V 9150 2350 50  0000 L CNN
F 1 "10k" H 9000 2300 50  0000 L CNN
F 2 "Resistor_SMD:R_0805_2012Metric_Pad1.20x1.40mm_HandSolder" H 9150 2400 50  0001 C CNN
F 3 "~" H 9150 2400 50  0001 C CNN
	1    9150 2400
	1    0    0    -1  
$EndComp
$Comp
L Device:R_Small R59
U 1 1 5FEE38FF
P 9000 2400
F 0 "R59" V 9000 2350 50  0000 L CNN
F 1 "10k" H 8850 2300 50  0000 L CNN
F 2 "Resistor_SMD:R_0805_2012Metric_Pad1.20x1.40mm_HandSolder" H 9000 2400 50  0001 C CNN
F 3 "~" H 9000 2400 50  0001 C CNN
	1    9000 2400
	1    0    0    -1  
$EndComp
Wire Wire Line
	9000 2550 9000 2500
$Comp
L power:+5V #PWR0119
U 1 1 5FEE7216
P 8300 1100
F 0 "#PWR0119" H 8300 950 50  0001 C CNN
F 1 "+5V" H 8315 1273 50  0000 C CNN
F 2 "" H 8300 1100 50  0001 C CNN
F 3 "" H 8300 1100 50  0001 C CNN
	1    8300 1100
	1    0    0    -1  
$EndComp
Wire Wire Line
	8300 1100 8300 1150
$Comp
L power:+5V #PWR0120
U 1 1 5FEEAD92
P 9000 2250
F 0 "#PWR0120" H 9000 2100 50  0001 C CNN
F 1 "+5V" H 9015 2423 50  0000 C CNN
F 2 "" H 9000 2250 50  0001 C CNN
F 3 "" H 9000 2250 50  0001 C CNN
	1    9000 2250
	1    0    0    -1  
$EndComp
$Comp
L power:+5V #PWR0121
U 1 1 5FEEB316
P 9150 2250
F 0 "#PWR0121" H 9150 2100 50  0001 C CNN
F 1 "+5V" H 9165 2423 50  0000 C CNN
F 2 "" H 9150 2250 50  0001 C CNN
F 3 "" H 9150 2250 50  0001 C CNN
	1    9150 2250
	1    0    0    -1  
$EndComp
Wire Wire Line
	9000 2250 9000 2300
Wire Wire Line
	9150 2250 9150 2300
Text Label 1600 6300 0    50   ~ 0
SDA
Text Label 1600 6400 0    50   ~ 0
SCL
Wire Wire Line
	1600 6400 1800 6400
Wire Wire Line
	1600 6300 1800 6300
$Sheet
S 1400 1600 800  1550
U 5FF0C69B
F0 "RGBDriver" 50
F1 "rgb_driver.sch" 50
F2 "SDA" I L 1400 1900 50 
F3 "SCL" I L 1400 2000 50 
F4 "R1" O R 2200 1750 50 
F5 "B1" O R 2200 1850 50 
F6 "G1" O R 2200 1950 50 
F7 "R2" O R 2200 2100 50 
F8 "G2" O R 2200 2200 50 
F9 "B2" O R 2200 2300 50 
F10 "R3" O R 2200 2450 50 
F11 "G3" O R 2200 2550 50 
F12 "B3" O R 2200 2650 50 
F13 "R4" O R 2200 2800 50 
F14 "G4" O R 2200 2900 50 
F15 "B4" O R 2200 3000 50 
F16 "V_LED" I L 1400 1750 50 
$EndSheet
$Sheet
S 3200 3300 550  650 
U 6033A592
F0 "RGB4" 50
F1 "RGB1.sch" 50
F2 "B" I L 3200 3800 50 
F3 "R" I L 3200 3600 50 
F4 "G" I L 3200 3700 50 
F5 "V_LED" I L 3200 3450 50 
$EndSheet
Wire Wire Line
	2200 1750 2500 1750
Wire Wire Line
	2500 1750 2500 1050
Wire Wire Line
	2500 1050 3200 1050
Wire Wire Line
	2200 1850 2600 1850
Wire Wire Line
	2600 1850 2600 1150
Wire Wire Line
	2600 1150 3200 1150
Wire Wire Line
	2200 1950 2700 1950
Wire Wire Line
	2700 1950 2700 1250
Wire Wire Line
	2700 1250 3200 1250
Wire Wire Line
	2200 2100 2800 2100
Wire Wire Line
	2800 2100 2800 1900
Wire Wire Line
	2800 1900 3200 1900
Wire Wire Line
	2200 2200 2900 2200
Wire Wire Line
	2900 2200 2900 2000
Wire Wire Line
	2900 2000 3200 2000
Wire Wire Line
	2200 2300 3000 2300
Wire Wire Line
	3000 2300 3000 2100
Wire Wire Line
	3000 2100 3200 2100
Wire Wire Line
	2200 2450 3000 2450
Wire Wire Line
	3000 2450 3000 2750
Wire Wire Line
	3000 2750 3200 2750
Wire Wire Line
	2200 2550 2900 2550
Wire Wire Line
	2900 2550 2900 2850
Wire Wire Line
	2900 2850 3200 2850
Wire Wire Line
	2200 2650 2800 2650
Wire Wire Line
	2800 2650 2800 2950
Wire Wire Line
	2800 2950 3200 2950
Wire Wire Line
	2200 2800 2700 2800
Wire Wire Line
	2700 2800 2700 3600
Wire Wire Line
	2700 3600 3200 3600
Wire Wire Line
	2200 2900 2600 2900
Wire Wire Line
	2600 2900 2600 3700
Wire Wire Line
	2600 3700 3200 3700
Wire Wire Line
	2200 3000 2500 3000
Wire Wire Line
	2500 3000 2500 3800
Wire Wire Line
	2500 3800 3200 3800
Wire Wire Line
	9150 2500 9150 2650
Wire Wire Line
	9150 2650 9350 2650
Connection ~ 9150 2650
Wire Wire Line
	9000 2550 9350 2550
Connection ~ 9000 2550
$Comp
L Jumper:SolderJumper_2_Open JP7
U 1 1 6000BA3E
P 10050 5150
F 0 "JP7" H 10050 5263 50  0000 C CNN
F 1 "SolderJumper_2_Open" H 10050 5264 50  0001 C CNN
F 2 "Jumper:SolderJumper-2_P1.3mm_Open_RoundedPad1.0x1.5mm" H 10050 5150 50  0001 C CNN
F 3 "~" H 10050 5150 50  0001 C CNN
	1    10050 5150
	0    -1   -1   0   
$EndComp
$Comp
L power:GND #PWR0122
U 1 1 6000C856
P 10450 5200
F 0 "#PWR0122" H 10450 4950 50  0001 C CNN
F 1 "GND" H 10455 5027 50  0000 C CNN
F 2 "" H 10450 5200 50  0001 C CNN
F 3 "" H 10450 5200 50  0001 C CNN
	1    10450 5200
	0    1    1    0   
$EndComp
$Comp
L power:GND #PWR0123
U 1 1 6000F96E
P 10450 5000
F 0 "#PWR0123" H 10450 4750 50  0001 C CNN
F 1 "GND" H 10455 4827 50  0000 C CNN
F 2 "" H 10450 5000 50  0001 C CNN
F 3 "" H 10450 5000 50  0001 C CNN
	1    10450 5000
	0    1    1    0   
$EndComp
Wire Wire Line
	10050 5000 10050 4900
Wire Wire Line
	10050 4900 9750 4900
Text Label 9750 4900 0    50   ~ 0
V_MOT
Wire Wire Line
	10050 5300 10050 5400
Wire Wire Line
	9650 5400 10050 5400
Wire Wire Line
	8600 1750 8650 1750
Wire Wire Line
	8650 1750 8650 1950
Connection ~ 8650 1950
Wire Wire Line
	8650 1950 8900 1950
Wire Wire Line
	8200 1150 8200 950 
$Comp
L power:+3.3V #PWR0124
U 1 1 6004DEA9
P 8200 950
F 0 "#PWR0124" H 8200 800 50  0001 C CNN
F 1 "+3.3V" H 8215 1123 50  0000 C CNN
F 2 "" H 8200 950 50  0001 C CNN
F 3 "" H 8200 950 50  0001 C CNN
	1    8200 950 
	1    0    0    -1  
$EndComp
$Comp
L power:+12V #PWR0125
U 1 1 600522B0
P 9650 5350
F 0 "#PWR0125" H 9650 5200 50  0001 C CNN
F 1 "+12V" H 9665 5523 50  0000 C CNN
F 2 "" H 9650 5350 50  0001 C CNN
F 3 "" H 9650 5350 50  0001 C CNN
	1    9650 5350
	1    0    0    -1  
$EndComp
Wire Wire Line
	9650 5350 9650 5400
Text Label 1550 6150 0    50   ~ 0
V_MOT
Wire Wire Line
	1550 6150 1800 6150
Text Label 2550 4700 0    50   ~ 0
V_REF
Wire Wire Line
	2550 4700 2800 4700
Connection ~ 2800 4700
Text Label 2950 900  0    50   ~ 0
V_LED
Text Label 2950 1750 0    50   ~ 0
V_LED
Text Label 3150 2550 1    50   ~ 0
V_LED
Text Label 2950 3450 0    50   ~ 0
V_LED
Wire Wire Line
	2950 3450 3200 3450
Wire Wire Line
	3150 2550 3150 2600
Wire Wire Line
	3150 2600 3200 2600
Wire Wire Line
	2950 1750 3200 1750
Wire Wire Line
	2950 900  3200 900 
Text Label 1150 1750 0    50   ~ 0
V_LED
Wire Wire Line
	1150 1750 1400 1750
Wire Wire Line
	1150 1900 1400 1900
Wire Wire Line
	1150 2000 1400 2000
Text Label 1150 1900 0    50   ~ 0
SDA
Text Label 1150 2000 0    50   ~ 0
SCL
$Comp
L Device:LED_Small D52
U 1 1 6011279C
P 6400 1900
F 0 "D52" V 6400 1830 50  0000 R CNN
F 1 "LED_Small" V 6355 1830 50  0001 R CNN
F 2 "LED_SMD:LED_0805_2012Metric_Castellated" V 6400 1900 50  0001 C CNN
F 3 "~" V 6400 1900 50  0001 C CNN
	1    6400 1900
	0    -1   -1   0   
$EndComp
$Comp
L Device:R_Small R58
U 1 1 60113214
P 6400 1650
F 0 "R58" H 6459 1696 50  0000 L CNN
F 1 "2k" H 6459 1605 50  0000 L CNN
F 2 "Resistor_SMD:R_0805_2012Metric_Pad1.20x1.40mm_HandSolder" H 6400 1650 50  0001 C CNN
F 3 "~" H 6400 1650 50  0001 C CNN
	1    6400 1650
	1    0    0    -1  
$EndComp
Wire Wire Line
	6400 1800 6400 1750
Wire Wire Line
	6400 1500 6400 1550
$Comp
L Device:LED_Small D51
U 1 1 6016D13D
P 6100 1900
F 0 "D51" V 6100 1830 50  0000 R CNN
F 1 "LED_Small" V 6055 1830 50  0001 R CNN
F 2 "LED_SMD:LED_0805_2012Metric_Castellated" V 6100 1900 50  0001 C CNN
F 3 "~" V 6100 1900 50  0001 C CNN
	1    6100 1900
	0    -1   -1   0   
$EndComp
$Comp
L Device:R_Small R57
U 1 1 6016D3BB
P 6100 1650
F 0 "R57" H 6159 1696 50  0000 L CNN
F 1 "2k" H 6159 1605 50  0000 L CNN
F 2 "Resistor_SMD:R_0805_2012Metric_Pad1.20x1.40mm_HandSolder" H 6100 1650 50  0001 C CNN
F 3 "~" H 6100 1650 50  0001 C CNN
	1    6100 1650
	1    0    0    -1  
$EndComp
Wire Wire Line
	6100 1800 6100 1750
Wire Wire Line
	6100 1500 6100 1550
$Comp
L Device:LED_Small D50
U 1 1 601724ED
P 5800 1900
F 0 "D50" V 5800 1830 50  0000 R CNN
F 1 "LED_Small" V 5755 1830 50  0001 R CNN
F 2 "LED_SMD:LED_0805_2012Metric_Castellated" V 5800 1900 50  0001 C CNN
F 3 "~" V 5800 1900 50  0001 C CNN
	1    5800 1900
	0    -1   -1   0   
$EndComp
Wire Wire Line
	5800 1800 5800 1750
Wire Wire Line
	5800 1500 5800 1550
$Comp
L Device:LED_Small D49
U 1 1 601727A0
P 5500 1900
F 0 "D49" V 5500 1830 50  0000 R CNN
F 1 "LED_Small" V 5455 1830 50  0001 R CNN
F 2 "LED_SMD:LED_0805_2012Metric_Castellated" V 5500 1900 50  0001 C CNN
F 3 "~" V 5500 1900 50  0001 C CNN
	1    5500 1900
	0    -1   -1   0   
$EndComp
Wire Wire Line
	5500 1800 5500 1750
Wire Wire Line
	5500 1500 5500 1550
$Comp
L power:+5V #PWR0126
U 1 1 6018885C
P 6400 1500
F 0 "#PWR0126" H 6400 1350 50  0001 C CNN
F 1 "+5V" H 6415 1673 50  0000 C CNN
F 2 "" H 6400 1500 50  0001 C CNN
F 3 "" H 6400 1500 50  0001 C CNN
	1    6400 1500
	1    0    0    -1  
$EndComp
$Comp
L power:+12V #PWR0127
U 1 1 60188F83
P 6100 1500
F 0 "#PWR0127" H 6100 1350 50  0001 C CNN
F 1 "+12V" H 6115 1673 50  0000 C CNN
F 2 "" H 6100 1500 50  0001 C CNN
F 3 "" H 6100 1500 50  0001 C CNN
	1    6100 1500
	1    0    0    -1  
$EndComp
Text Label 5800 1500 1    50   ~ 0
V_MOT
Text Label 5500 1500 1    50   ~ 0
V_LED
$Comp
L power:GND #PWR0128
U 1 1 60189854
P 5500 2100
F 0 "#PWR0128" H 5500 1850 50  0001 C CNN
F 1 "GND" H 5505 1927 50  0000 C CNN
F 2 "" H 5500 2100 50  0001 C CNN
F 3 "" H 5500 2100 50  0001 C CNN
	1    5500 2100
	1    0    0    -1  
$EndComp
$Comp
L power:GND #PWR0129
U 1 1 60189FA4
P 5800 2100
F 0 "#PWR0129" H 5800 1850 50  0001 C CNN
F 1 "GND" H 5805 1927 50  0000 C CNN
F 2 "" H 5800 2100 50  0001 C CNN
F 3 "" H 5800 2100 50  0001 C CNN
	1    5800 2100
	1    0    0    -1  
$EndComp
$Comp
L power:GND #PWR0130
U 1 1 6018A10C
P 6100 2100
F 0 "#PWR0130" H 6100 1850 50  0001 C CNN
F 1 "GND" H 6105 1927 50  0000 C CNN
F 2 "" H 6100 2100 50  0001 C CNN
F 3 "" H 6100 2100 50  0001 C CNN
	1    6100 2100
	1    0    0    -1  
$EndComp
$Comp
L power:GND #PWR0131
U 1 1 6018A2F5
P 6400 2100
F 0 "#PWR0131" H 6400 1850 50  0001 C CNN
F 1 "GND" H 6405 1927 50  0000 C CNN
F 2 "" H 6400 2100 50  0001 C CNN
F 3 "" H 6400 2100 50  0001 C CNN
	1    6400 2100
	1    0    0    -1  
$EndComp
Wire Wire Line
	5500 2000 5500 2100
Wire Wire Line
	5800 2000 5800 2100
Wire Wire Line
	6100 2000 6100 2100
Wire Wire Line
	6400 2000 6400 2100
$Comp
L power:+12V #PWR0132
U 1 1 6019F7BA
P 8000 1100
F 0 "#PWR0132" H 8000 950 50  0001 C CNN
F 1 "+12V" H 8015 1273 50  0000 C CNN
F 2 "" H 8000 1100 50  0001 C CNN
F 3 "" H 8000 1100 50  0001 C CNN
	1    8000 1100
	1    0    0    -1  
$EndComp
Wire Wire Line
	8000 1100 8000 1150
Text Label 9500 5400 2    50   ~ 0
V_LED
Wire Wire Line
	9500 5400 9650 5400
Connection ~ 9650 5400
Text Label 9550 4600 2    50   ~ 0
V_REF
$Comp
L power:+5V #PWR0133
U 1 1 60238545
P 9800 4550
F 0 "#PWR0133" H 9800 4400 50  0001 C CNN
F 1 "+5V" H 9815 4723 50  0000 C CNN
F 2 "" H 9800 4550 50  0001 C CNN
F 3 "" H 9800 4550 50  0001 C CNN
	1    9800 4550
	1    0    0    -1  
$EndComp
Wire Wire Line
	9550 4600 9800 4600
Wire Wire Line
	9800 4600 9800 4550
$Comp
L Device:R_Small R56
U 1 1 60172793
P 5800 1650
F 0 "R56" H 5859 1696 50  0000 L CNN
F 1 "2k" H 5859 1605 50  0000 L CNN
F 2 "Resistor_SMD:R_0805_2012Metric_Pad1.20x1.40mm_HandSolder" H 5800 1650 50  0001 C CNN
F 3 "~" H 5800 1650 50  0001 C CNN
	1    5800 1650
	1    0    0    -1  
$EndComp
$Comp
L Device:R_Small R55
U 1 1 601727AA
P 5500 1650
F 0 "R55" H 5559 1696 50  0000 L CNN
F 1 "2k" H 5559 1605 50  0000 L CNN
F 2 "Resistor_SMD:R_0805_2012Metric_Pad1.20x1.40mm_HandSolder" H 5500 1650 50  0001 C CNN
F 3 "~" H 5500 1650 50  0001 C CNN
	1    5500 1650
	1    0    0    -1  
$EndComp
$Comp
L Connector:Screw_Terminal_01x04 J1
U 1 1 5FEE0BCC
P 10700 5100
F 0 "J1" H 10618 4675 50  0000 C CNN
F 1 "Screw_Terminal_01x04" H 10618 4766 50  0000 C CNN
F 2 "TerminalBlock_Phoenix:TerminalBlock_Phoenix_MKDS-1,5-4-5.08_1x04_P5.08mm_Horizontal" H 10700 5100 50  0001 C CNN
F 3 "~" H 10700 5100 50  0001 C CNN
	1    10700 5100
	1    0    0    1   
$EndComp
Wire Wire Line
	10450 5000 10500 5000
Wire Wire Line
	10450 5200 10500 5200
Wire Wire Line
	10050 4900 10500 4900
Connection ~ 10050 4900
Wire Wire Line
	10500 5100 10200 5100
Wire Wire Line
	10200 5100 10200 5400
Wire Wire Line
	10200 5400 10050 5400
Connection ~ 10050 5400
$EndSCHEMATC
