EESchema Schematic File Version 4
EELAYER 30 0
EELAYER END
$Descr A4 11693 8268
encoding utf-8
Sheet 2 7
Title "SliderRGBShield"
Date "2020-12-29"
Rev "1.0"
Comp ""
Comment1 ""
Comment2 ""
Comment3 ""
Comment4 ""
$EndDescr
Connection ~ 5800 4550
Wire Wire Line
	4800 4550 5800 4550
Connection ~ 6000 4450
Wire Wire Line
	5000 4450 6000 4450
Connection ~ 6200 4350
Wire Wire Line
	5200 4350 6200 4350
Connection ~ 6800 4550
Wire Wire Line
	5800 4550 6800 4550
Wire Wire Line
	5800 4250 5800 4550
Connection ~ 7000 4450
Wire Wire Line
	6000 4450 7000 4450
Wire Wire Line
	6000 4250 6000 4450
Wire Wire Line
	6800 4550 7350 4550
Wire Wire Line
	6800 4250 6800 4550
Wire Wire Line
	7000 4450 7350 4450
Wire Wire Line
	7000 4250 7000 4450
Connection ~ 7200 4350
Wire Wire Line
	6200 4350 7200 4350
Wire Wire Line
	6200 4250 6200 4350
Wire Wire Line
	7200 4350 7350 4350
Wire Wire Line
	7200 4250 7200 4350
Wire Wire Line
	7200 3450 7200 3550
Wire Wire Line
	7000 3450 7000 3550
$Comp
L Device:R_Small R?
U 1 1 6026D0F9
P 7200 3650
AR Path="/6026D0F9" Ref="R?"  Part="1" 
AR Path="/601FCB8D/6026D0F9" Ref="R12"  Part="1" 
AR Path="/602F2CEE/6026D0F9" Ref="R?"  Part="1" 
AR Path="/603247A9/6026D0F9" Ref="R24"  Part="1" 
AR Path="/6033974E/6026D0F9" Ref="R36"  Part="1" 
AR Path="/6033A592/6026D0F9" Ref="R48"  Part="1" 
F 0 "R12" H 7259 3696 50  0000 L CNN
F 1 "150" H 7259 3605 50  0000 L CNN
F 2 "Resistor_SMD:R_1206_3216Metric_Pad1.30x1.75mm_HandSolder" H 7200 3650 50  0001 C CNN
F 3 "~" H 7200 3650 50  0001 C CNN
	1    7200 3650
	1    0    0    -1  
$EndComp
$Comp
L Device:R_Small R?
U 1 1 6026D0FF
P 7000 3650
AR Path="/6026D0FF" Ref="R?"  Part="1" 
AR Path="/601FCB8D/6026D0FF" Ref="R11"  Part="1" 
AR Path="/602F2CEE/6026D0FF" Ref="R?"  Part="1" 
AR Path="/603247A9/6026D0FF" Ref="R23"  Part="1" 
AR Path="/6033974E/6026D0FF" Ref="R35"  Part="1" 
AR Path="/6033A592/6026D0FF" Ref="R47"  Part="1" 
F 0 "R11" H 7059 3696 50  0000 L CNN
F 1 "330" H 7059 3605 50  0000 L CNN
F 2 "Resistor_SMD:R_1206_3216Metric_Pad1.30x1.75mm_HandSolder" H 7000 3650 50  0001 C CNN
F 3 "~" H 7000 3650 50  0001 C CNN
	1    7000 3650
	1    0    0    -1  
$EndComp
$Comp
L Device:R_Small R?
U 1 1 6026D105
P 6800 2850
AR Path="/6026D105" Ref="R?"  Part="1" 
AR Path="/601FCB8D/6026D105" Ref="R10"  Part="1" 
AR Path="/602F2CEE/6026D105" Ref="R?"  Part="1" 
AR Path="/603247A9/6026D105" Ref="R22"  Part="1" 
AR Path="/6033974E/6026D105" Ref="R34"  Part="1" 
AR Path="/6033A592/6026D105" Ref="R46"  Part="1" 
F 0 "R10" H 6859 2896 50  0000 L CNN
F 1 "150" H 6859 2805 50  0000 L CNN
F 2 "Resistor_SMD:R_1206_3216Metric_Pad1.30x1.75mm_HandSolder" H 6800 2850 50  0001 C CNN
F 3 "~" H 6800 2850 50  0001 C CNN
	1    6800 2850
	1    0    0    -1  
$EndComp
Wire Wire Line
	7000 3750 7000 3850
Wire Wire Line
	7200 3750 7200 3850
Wire Wire Line
	6800 3050 6800 2950
$Comp
L Device:LED_RGB D?
U 1 1 6026D117
P 7000 3250
AR Path="/6026D117" Ref="D?"  Part="1" 
AR Path="/601FCB8D/6026D117" Ref="D11"  Part="1" 
AR Path="/602F2CEE/6026D117" Ref="D?"  Part="1" 
AR Path="/603247A9/6026D117" Ref="D23"  Part="1" 
AR Path="/6033974E/6026D117" Ref="D35"  Part="1" 
AR Path="/6033A592/6026D117" Ref="D47"  Part="1" 
F 0 "D11" V 7046 2920 50  0000 R CNN
F 1 "LED_RGB" V 6955 2920 50  0000 R CNN
F 2 "LED_SMD:LED_RGB_5050-6" H 7000 3200 50  0001 C CNN
F 3 "~" H 7000 3200 50  0001 C CNN
	1    7000 3250
	0    -1   -1   0   
$EndComp
$Comp
L Device:LED_RGB D?
U 1 1 6026D11D
P 7000 2450
AR Path="/6026D11D" Ref="D?"  Part="1" 
AR Path="/601FCB8D/6026D11D" Ref="D10"  Part="1" 
AR Path="/602F2CEE/6026D11D" Ref="D?"  Part="1" 
AR Path="/603247A9/6026D11D" Ref="D22"  Part="1" 
AR Path="/6033974E/6026D11D" Ref="D34"  Part="1" 
AR Path="/6033A592/6026D11D" Ref="D46"  Part="1" 
F 0 "D10" V 7046 2120 50  0000 R CNN
F 1 "LED_RGB" V 6955 2120 50  0000 R CNN
F 2 "LED_SMD:LED_RGB_5050-6" H 7000 2400 50  0001 C CNN
F 3 "~" H 7000 2400 50  0001 C CNN
	1    7000 2450
	0    -1   -1   0   
$EndComp
Wire Wire Line
	6200 3450 6200 3550
Wire Wire Line
	6000 3450 6000 3550
$Comp
L Device:R_Small R?
U 1 1 6026D133
P 6200 3650
AR Path="/6026D133" Ref="R?"  Part="1" 
AR Path="/601FCB8D/6026D133" Ref="R9"  Part="1" 
AR Path="/602F2CEE/6026D133" Ref="R?"  Part="1" 
AR Path="/603247A9/6026D133" Ref="R21"  Part="1" 
AR Path="/6033974E/6026D133" Ref="R33"  Part="1" 
AR Path="/6033A592/6026D133" Ref="R45"  Part="1" 
F 0 "R9" H 6259 3696 50  0000 L CNN
F 1 "150" H 6259 3605 50  0000 L CNN
F 2 "Resistor_SMD:R_1206_3216Metric_Pad1.30x1.75mm_HandSolder" H 6200 3650 50  0001 C CNN
F 3 "~" H 6200 3650 50  0001 C CNN
	1    6200 3650
	1    0    0    -1  
$EndComp
$Comp
L Device:R_Small R?
U 1 1 6026D139
P 6000 3650
AR Path="/6026D139" Ref="R?"  Part="1" 
AR Path="/601FCB8D/6026D139" Ref="R8"  Part="1" 
AR Path="/602F2CEE/6026D139" Ref="R?"  Part="1" 
AR Path="/603247A9/6026D139" Ref="R20"  Part="1" 
AR Path="/6033974E/6026D139" Ref="R32"  Part="1" 
AR Path="/6033A592/6026D139" Ref="R44"  Part="1" 
F 0 "R8" H 6059 3696 50  0000 L CNN
F 1 "330" H 6059 3605 50  0000 L CNN
F 2 "Resistor_SMD:R_1206_3216Metric_Pad1.30x1.75mm_HandSolder" H 6000 3650 50  0001 C CNN
F 3 "~" H 6000 3650 50  0001 C CNN
	1    6000 3650
	1    0    0    -1  
$EndComp
$Comp
L Device:R_Small R?
U 1 1 6026D13F
P 5800 2850
AR Path="/6026D13F" Ref="R?"  Part="1" 
AR Path="/601FCB8D/6026D13F" Ref="R7"  Part="1" 
AR Path="/602F2CEE/6026D13F" Ref="R?"  Part="1" 
AR Path="/603247A9/6026D13F" Ref="R19"  Part="1" 
AR Path="/6033974E/6026D13F" Ref="R31"  Part="1" 
AR Path="/6033A592/6026D13F" Ref="R43"  Part="1" 
F 0 "R7" H 5859 2896 50  0000 L CNN
F 1 "150" H 5859 2805 50  0000 L CNN
F 2 "Resistor_SMD:R_1206_3216Metric_Pad1.30x1.75mm_HandSolder" H 5800 2850 50  0001 C CNN
F 3 "~" H 5800 2850 50  0001 C CNN
	1    5800 2850
	1    0    0    -1  
$EndComp
Wire Wire Line
	6000 3750 6000 3850
Wire Wire Line
	6200 3750 6200 3850
Wire Wire Line
	5800 3050 5800 2950
$Comp
L Device:LED_RGB D?
U 1 1 6026D151
P 6000 3250
AR Path="/6026D151" Ref="D?"  Part="1" 
AR Path="/601FCB8D/6026D151" Ref="D8"  Part="1" 
AR Path="/602F2CEE/6026D151" Ref="D?"  Part="1" 
AR Path="/603247A9/6026D151" Ref="D20"  Part="1" 
AR Path="/6033974E/6026D151" Ref="D32"  Part="1" 
AR Path="/6033A592/6026D151" Ref="D44"  Part="1" 
F 0 "D8" V 6046 2920 50  0000 R CNN
F 1 "LED_RGB" V 5955 2920 50  0000 R CNN
F 2 "LED_SMD:LED_RGB_5050-6" H 6000 3200 50  0001 C CNN
F 3 "~" H 6000 3200 50  0001 C CNN
	1    6000 3250
	0    -1   -1   0   
$EndComp
$Comp
L Device:LED_RGB D?
U 1 1 6026D157
P 6000 2450
AR Path="/6026D157" Ref="D?"  Part="1" 
AR Path="/601FCB8D/6026D157" Ref="D7"  Part="1" 
AR Path="/602F2CEE/6026D157" Ref="D?"  Part="1" 
AR Path="/603247A9/6026D157" Ref="D19"  Part="1" 
AR Path="/6033974E/6026D157" Ref="D31"  Part="1" 
AR Path="/6033A592/6026D157" Ref="D43"  Part="1" 
F 0 "D7" V 6046 2120 50  0000 R CNN
F 1 "LED_RGB" V 5955 2120 50  0000 R CNN
F 2 "LED_SMD:LED_RGB_5050-6" H 6000 2400 50  0001 C CNN
F 3 "~" H 6000 2400 50  0001 C CNN
	1    6000 2450
	0    -1   -1   0   
$EndComp
Connection ~ 4800 4550
Wire Wire Line
	3800 4550 4800 4550
Wire Wire Line
	3800 4250 3800 4550
Connection ~ 5000 4450
Wire Wire Line
	4000 4450 5000 4450
Wire Wire Line
	4000 4250 4000 4450
Wire Wire Line
	4800 4250 4800 4550
Wire Wire Line
	5000 4250 5000 4450
Connection ~ 5200 4350
Wire Wire Line
	4200 4350 5200 4350
Wire Wire Line
	4200 4250 4200 4350
Wire Wire Line
	5200 4250 5200 4350
Wire Wire Line
	5200 3450 5200 3550
Wire Wire Line
	5000 3450 5000 3550
$Comp
L Device:R_Small R?
U 1 1 6026D17B
P 5200 3650
AR Path="/6026D17B" Ref="R?"  Part="1" 
AR Path="/601FCB8D/6026D17B" Ref="R6"  Part="1" 
AR Path="/602F2CEE/6026D17B" Ref="R?"  Part="1" 
AR Path="/603247A9/6026D17B" Ref="R18"  Part="1" 
AR Path="/6033974E/6026D17B" Ref="R30"  Part="1" 
AR Path="/6033A592/6026D17B" Ref="R42"  Part="1" 
F 0 "R6" H 5259 3696 50  0000 L CNN
F 1 "150" H 5259 3605 50  0000 L CNN
F 2 "Resistor_SMD:R_1206_3216Metric_Pad1.30x1.75mm_HandSolder" H 5200 3650 50  0001 C CNN
F 3 "~" H 5200 3650 50  0001 C CNN
	1    5200 3650
	1    0    0    -1  
$EndComp
$Comp
L Device:R_Small R?
U 1 1 6026D181
P 5000 3650
AR Path="/6026D181" Ref="R?"  Part="1" 
AR Path="/601FCB8D/6026D181" Ref="R5"  Part="1" 
AR Path="/602F2CEE/6026D181" Ref="R?"  Part="1" 
AR Path="/603247A9/6026D181" Ref="R17"  Part="1" 
AR Path="/6033974E/6026D181" Ref="R29"  Part="1" 
AR Path="/6033A592/6026D181" Ref="R41"  Part="1" 
F 0 "R5" H 5059 3696 50  0000 L CNN
F 1 "330" H 5059 3605 50  0000 L CNN
F 2 "Resistor_SMD:R_1206_3216Metric_Pad1.30x1.75mm_HandSolder" H 5000 3650 50  0001 C CNN
F 3 "~" H 5000 3650 50  0001 C CNN
	1    5000 3650
	1    0    0    -1  
$EndComp
$Comp
L Device:R_Small R?
U 1 1 6026D187
P 4800 2850
AR Path="/6026D187" Ref="R?"  Part="1" 
AR Path="/601FCB8D/6026D187" Ref="R4"  Part="1" 
AR Path="/602F2CEE/6026D187" Ref="R?"  Part="1" 
AR Path="/603247A9/6026D187" Ref="R16"  Part="1" 
AR Path="/6033974E/6026D187" Ref="R28"  Part="1" 
AR Path="/6033A592/6026D187" Ref="R40"  Part="1" 
F 0 "R4" H 4859 2896 50  0000 L CNN
F 1 "150" H 4859 2805 50  0000 L CNN
F 2 "Resistor_SMD:R_1206_3216Metric_Pad1.30x1.75mm_HandSolder" H 4800 2850 50  0001 C CNN
F 3 "~" H 4800 2850 50  0001 C CNN
	1    4800 2850
	1    0    0    -1  
$EndComp
Wire Wire Line
	5000 3750 5000 3850
Wire Wire Line
	5200 3750 5200 3850
Wire Wire Line
	4800 3050 4800 2950
$Comp
L Device:LED_RGB D?
U 1 1 6026D199
P 5000 3250
AR Path="/6026D199" Ref="D?"  Part="1" 
AR Path="/601FCB8D/6026D199" Ref="D5"  Part="1" 
AR Path="/602F2CEE/6026D199" Ref="D?"  Part="1" 
AR Path="/603247A9/6026D199" Ref="D17"  Part="1" 
AR Path="/6033974E/6026D199" Ref="D29"  Part="1" 
AR Path="/6033A592/6026D199" Ref="D41"  Part="1" 
F 0 "D5" V 5046 2920 50  0000 R CNN
F 1 "LED_RGB" V 4955 2920 50  0000 R CNN
F 2 "LED_SMD:LED_RGB_5050-6" H 5000 3200 50  0001 C CNN
F 3 "~" H 5000 3200 50  0001 C CNN
	1    5000 3250
	0    -1   -1   0   
$EndComp
$Comp
L Device:LED_RGB D?
U 1 1 6026D19F
P 5000 2450
AR Path="/6026D19F" Ref="D?"  Part="1" 
AR Path="/601FCB8D/6026D19F" Ref="D4"  Part="1" 
AR Path="/602F2CEE/6026D19F" Ref="D?"  Part="1" 
AR Path="/603247A9/6026D19F" Ref="D16"  Part="1" 
AR Path="/6033974E/6026D19F" Ref="D28"  Part="1" 
AR Path="/6033A592/6026D19F" Ref="D40"  Part="1" 
F 0 "D4" V 5046 2120 50  0000 R CNN
F 1 "LED_RGB" V 4955 2120 50  0000 R CNN
F 2 "LED_SMD:LED_RGB_5050-6" H 5000 2400 50  0001 C CNN
F 3 "~" H 5000 2400 50  0001 C CNN
	1    5000 2450
	0    -1   -1   0   
$EndComp
Wire Wire Line
	4200 3450 4200 3550
Wire Wire Line
	4000 3450 4000 3550
$Comp
L Device:R_Small R?
U 1 1 6026D1B5
P 4200 3650
AR Path="/6026D1B5" Ref="R?"  Part="1" 
AR Path="/601FCB8D/6026D1B5" Ref="R3"  Part="1" 
AR Path="/602F2CEE/6026D1B5" Ref="R?"  Part="1" 
AR Path="/603247A9/6026D1B5" Ref="R15"  Part="1" 
AR Path="/6033974E/6026D1B5" Ref="R27"  Part="1" 
AR Path="/6033A592/6026D1B5" Ref="R39"  Part="1" 
F 0 "R3" H 4259 3696 50  0000 L CNN
F 1 "150" H 4259 3605 50  0000 L CNN
F 2 "Resistor_SMD:R_1206_3216Metric_Pad1.30x1.75mm_HandSolder" H 4200 3650 50  0001 C CNN
F 3 "~" H 4200 3650 50  0001 C CNN
	1    4200 3650
	1    0    0    -1  
$EndComp
$Comp
L Device:R_Small R?
U 1 1 6026D1BB
P 4000 3650
AR Path="/6026D1BB" Ref="R?"  Part="1" 
AR Path="/601FCB8D/6026D1BB" Ref="R2"  Part="1" 
AR Path="/602F2CEE/6026D1BB" Ref="R?"  Part="1" 
AR Path="/603247A9/6026D1BB" Ref="R14"  Part="1" 
AR Path="/6033974E/6026D1BB" Ref="R26"  Part="1" 
AR Path="/6033A592/6026D1BB" Ref="R38"  Part="1" 
F 0 "R2" H 4059 3696 50  0000 L CNN
F 1 "330" H 4059 3605 50  0000 L CNN
F 2 "Resistor_SMD:R_1206_3216Metric_Pad1.30x1.75mm_HandSolder" H 4000 3650 50  0001 C CNN
F 3 "~" H 4000 3650 50  0001 C CNN
	1    4000 3650
	1    0    0    -1  
$EndComp
$Comp
L Device:R_Small R?
U 1 1 6026D1C1
P 3800 2850
AR Path="/6026D1C1" Ref="R?"  Part="1" 
AR Path="/601FCB8D/6026D1C1" Ref="R1"  Part="1" 
AR Path="/602F2CEE/6026D1C1" Ref="R?"  Part="1" 
AR Path="/603247A9/6026D1C1" Ref="R13"  Part="1" 
AR Path="/6033974E/6026D1C1" Ref="R25"  Part="1" 
AR Path="/6033A592/6026D1C1" Ref="R37"  Part="1" 
F 0 "R1" H 3859 2896 50  0000 L CNN
F 1 "150" H 3859 2805 50  0000 L CNN
F 2 "Resistor_SMD:R_1206_3216Metric_Pad1.30x1.75mm_HandSolder" H 3800 2850 50  0001 C CNN
F 3 "~" H 3800 2850 50  0001 C CNN
	1    3800 2850
	1    0    0    -1  
$EndComp
Wire Wire Line
	4000 3750 4000 3850
Wire Wire Line
	4200 3750 4200 3850
Wire Wire Line
	3800 3050 3800 2950
$Comp
L Device:LED_RGB D?
U 1 1 6026D1D3
P 4000 3250
AR Path="/6026D1D3" Ref="D?"  Part="1" 
AR Path="/601FCB8D/6026D1D3" Ref="D2"  Part="1" 
AR Path="/602F2CEE/6026D1D3" Ref="D?"  Part="1" 
AR Path="/603247A9/6026D1D3" Ref="D14"  Part="1" 
AR Path="/6033974E/6026D1D3" Ref="D26"  Part="1" 
AR Path="/6033A592/6026D1D3" Ref="D38"  Part="1" 
F 0 "D2" V 4046 2920 50  0000 R CNN
F 1 "LED_RGB" V 3955 2920 50  0000 R CNN
F 2 "LED_SMD:LED_RGB_5050-6" H 4000 3200 50  0001 C CNN
F 3 "~" H 4000 3200 50  0001 C CNN
	1    4000 3250
	0    -1   -1   0   
$EndComp
$Comp
L Device:LED_RGB D?
U 1 1 6026D1D9
P 4000 2450
AR Path="/6026D1D9" Ref="D?"  Part="1" 
AR Path="/601FCB8D/6026D1D9" Ref="D1"  Part="1" 
AR Path="/602F2CEE/6026D1D9" Ref="D?"  Part="1" 
AR Path="/603247A9/6026D1D9" Ref="D13"  Part="1" 
AR Path="/6033974E/6026D1D9" Ref="D25"  Part="1" 
AR Path="/6033A592/6026D1D9" Ref="D37"  Part="1" 
F 0 "D1" V 4046 2120 50  0000 R CNN
F 1 "LED_RGB" V 3955 2120 50  0000 R CNN
F 2 "LED_SMD:LED_RGB_5050-6" H 4000 2400 50  0001 C CNN
F 3 "~" H 4000 2400 50  0001 C CNN
	1    4000 2450
	0    -1   -1   0   
$EndComp
Text HLabel 7350 4350 2    50   Input ~ 0
B
Text HLabel 7350 4450 2    50   Input ~ 0
R
Text HLabel 7350 4550 2    50   Input ~ 0
G
Wire Wire Line
	3800 2150 4000 2150
Wire Wire Line
	7200 2150 7200 2250
Wire Wire Line
	3800 2150 3800 2250
Wire Wire Line
	7000 2150 7000 2250
Connection ~ 7000 2150
Wire Wire Line
	7000 2150 7200 2150
Wire Wire Line
	6800 2150 6800 2250
Connection ~ 6800 2150
Wire Wire Line
	6800 2150 7000 2150
Wire Wire Line
	6200 2150 6200 2250
Connection ~ 6200 2150
Wire Wire Line
	6200 2150 6800 2150
Wire Wire Line
	6000 2150 6000 2250
Connection ~ 6000 2150
Wire Wire Line
	6000 2150 6200 2150
Wire Wire Line
	5800 2150 5800 2250
Connection ~ 5800 2150
Wire Wire Line
	5800 2150 6000 2150
Wire Wire Line
	5200 2150 5200 2250
Connection ~ 5200 2150
Wire Wire Line
	5200 2150 5800 2150
Wire Wire Line
	5000 2150 5000 2250
Connection ~ 5000 2150
Wire Wire Line
	5000 2150 5200 2150
Wire Wire Line
	4800 2150 4800 2250
Connection ~ 4800 2150
Wire Wire Line
	4800 2150 5000 2150
Wire Wire Line
	4200 2150 4200 2250
Connection ~ 4200 2150
Wire Wire Line
	4200 2150 4800 2150
Wire Wire Line
	4000 2150 4000 2250
Connection ~ 4000 2150
Wire Wire Line
	4000 2150 4200 2150
Wire Wire Line
	7200 2150 7350 2150
Connection ~ 7200 2150
Text HLabel 7350 2150 2    50   Input ~ 0
V_LED
$Comp
L Device:LED_RGB D?
U 1 1 6026D1CD
P 4000 4050
AR Path="/6026D1CD" Ref="D?"  Part="1" 
AR Path="/601FCB8D/6026D1CD" Ref="D3"  Part="1" 
AR Path="/602F2CEE/6026D1CD" Ref="D?"  Part="1" 
AR Path="/603247A9/6026D1CD" Ref="D15"  Part="1" 
AR Path="/6033974E/6026D1CD" Ref="D27"  Part="1" 
AR Path="/6033A592/6026D1CD" Ref="D39"  Part="1" 
F 0 "D3" V 4046 3720 50  0000 R CNN
F 1 "LED_RGB" V 3955 3720 50  0000 R CNN
F 2 "LED_SMD:LED_RGB_5050-6" H 4000 4000 50  0001 C CNN
F 3 "~" H 4000 4000 50  0001 C CNN
	1    4000 4050
	0    -1   -1   0   
$EndComp
$Comp
L Device:LED_RGB D?
U 1 1 6026D193
P 5000 4050
AR Path="/6026D193" Ref="D?"  Part="1" 
AR Path="/601FCB8D/6026D193" Ref="D6"  Part="1" 
AR Path="/602F2CEE/6026D193" Ref="D?"  Part="1" 
AR Path="/603247A9/6026D193" Ref="D18"  Part="1" 
AR Path="/6033974E/6026D193" Ref="D30"  Part="1" 
AR Path="/6033A592/6026D193" Ref="D42"  Part="1" 
F 0 "D6" V 5046 3720 50  0000 R CNN
F 1 "LED_RGB" V 4955 3720 50  0000 R CNN
F 2 "LED_SMD:LED_RGB_5050-6" H 5000 4000 50  0001 C CNN
F 3 "~" H 5000 4000 50  0001 C CNN
	1    5000 4050
	0    -1   -1   0   
$EndComp
$Comp
L Device:LED_RGB D?
U 1 1 6026D14B
P 6000 4050
AR Path="/6026D14B" Ref="D?"  Part="1" 
AR Path="/601FCB8D/6026D14B" Ref="D9"  Part="1" 
AR Path="/602F2CEE/6026D14B" Ref="D?"  Part="1" 
AR Path="/603247A9/6026D14B" Ref="D21"  Part="1" 
AR Path="/6033974E/6026D14B" Ref="D33"  Part="1" 
AR Path="/6033A592/6026D14B" Ref="D45"  Part="1" 
F 0 "D9" V 6046 3720 50  0000 R CNN
F 1 "LED_RGB" V 5955 3720 50  0000 R CNN
F 2 "LED_SMD:LED_RGB_5050-6" H 6000 4000 50  0001 C CNN
F 3 "~" H 6000 4000 50  0001 C CNN
	1    6000 4050
	0    -1   -1   0   
$EndComp
$Comp
L Device:LED_RGB D?
U 1 1 6026D111
P 7000 4050
AR Path="/6026D111" Ref="D?"  Part="1" 
AR Path="/601FCB8D/6026D111" Ref="D12"  Part="1" 
AR Path="/602F2CEE/6026D111" Ref="D?"  Part="1" 
AR Path="/603247A9/6026D111" Ref="D24"  Part="1" 
AR Path="/6033974E/6026D111" Ref="D36"  Part="1" 
AR Path="/6033A592/6026D111" Ref="D48"  Part="1" 
F 0 "D12" V 7046 3720 50  0000 R CNN
F 1 "LED_RGB" V 6955 3720 50  0000 R CNN
F 2 "LED_SMD:LED_RGB_5050-6" H 7000 4000 50  0001 C CNN
F 3 "~" H 7000 4000 50  0001 C CNN
	1    7000 4050
	0    -1   -1   0   
$EndComp
Wire Wire Line
	4000 2650 4000 3050
Wire Wire Line
	4200 2650 4200 3050
Wire Wire Line
	5000 2650 5000 3050
Wire Wire Line
	5200 2650 5200 3050
Wire Wire Line
	6000 2650 6000 3050
Wire Wire Line
	6200 2650 6200 3050
Wire Wire Line
	7000 2650 7000 3050
Wire Wire Line
	7200 2650 7200 3050
Wire Wire Line
	6800 2750 6800 2650
Wire Wire Line
	5800 2750 5800 2650
Wire Wire Line
	4800 2750 4800 2650
Wire Wire Line
	3800 2750 3800 2650
Wire Wire Line
	3800 3450 3800 3850
Wire Wire Line
	4800 3450 4800 3850
Wire Wire Line
	5800 3450 5800 3850
Wire Wire Line
	6800 3450 6800 3850
$EndSCHEMATC
