(module MUC10A (layer F.Cu)
  (fp_text reference REF** (at 0 0) (layer F.SilkS)
    (effects (font (size 1 1) (thickness .15)))
  )
  (fp_text value MUC10A (at 0 0) (layer F.SilkS)
    (effects (font (size 1 1) (thickness .15)))
  )
  (fp_text user "Copyright 2016 Accelerated Designs. All rights reserved." (at 0 0) (layer Cmts.User)
    (effects (font (size .127 .127) (thickness .002)))
  )
  (fp_text user "*" (at -2.4511 -2.47396) (layer F.SilkS)
    (effects (font (size 1 1) (thickness .15)))
  )
  (fp_text user "*" (at -1.1684 -1.4732) (layer F.Fab)
    (effects (font (size 1 1) (thickness .15)))
  )
  (fp_text user "0.02in/0.5mm" (at -5.2451 -.75057) (layer Dwgs.User)
    (effects (font (size 1 1) (thickness .15)))
  )
  (fp_text user "0.013in/0.33mm" (at 5.2451 -1.00076) (layer Dwgs.User)
    (effects (font (size 1 1) (thickness .15)))
  )
  (fp_text user "0.173in/4.394mm" (at 0 -3.9624) (layer Dwgs.User)
    (effects (font (size 1 1) (thickness .15)))
  )
  (fp_text user "0.054in/1.36mm" (at -2.1971 3.9624) (layer Dwgs.User)
    (effects (font (size 1 1) (thickness .15)))
  )
  (fp_text user "0.075in/1.905mm" (at 7.1374 0) (layer Dwgs.User)
    (effects (font (size 1 1) (thickness .15)))
  )
  (fp_text user "0.068in/1.727mm" (at 0 5.2324) (layer Dwgs.User)
    (effects (font (size 1 1) (thickness .15)))
  )
  (fp_text user "*" (at -2.4511 -2.47396) (layer F.SilkS)
    (effects (font (size 1 1) (thickness .15)))
  )
  (fp_text user "*" (at -1.1684 -1.4732) (layer F.Fab)
    (effects (font (size 1 1) (thickness .15)))
  )
  (fp_line (start -1.5494 -.83566) (end -1.5494 -1.16586) (layer F.Fab) (width .1524))
  (fp_line (start -1.5494 -1.16586) (end -2.5273 -1.16586) (layer F.Fab) (width .1524))
  (fp_line (start -2.5273 -1.16586) (end -2.5273 -.83566) (layer F.Fab) (width .1524))
  (fp_line (start -2.5273 -.83566) (end -1.5494 -.83566) (layer F.Fab) (width .1524))
  (fp_line (start -1.5494 -.33528) (end -1.5494 -.66548) (layer F.Fab) (width .1524))
  (fp_line (start -1.5494 -.66548) (end -2.5273 -.66548) (layer F.Fab) (width .1524))
  (fp_line (start -2.5273 -.66548) (end -2.5273 -.33528) (layer F.Fab) (width .1524))
  (fp_line (start -2.5273 -.33528) (end -1.5494 -.33528) (layer F.Fab) (width .1524))
  (fp_line (start -1.5494 .1651) (end -1.5494 -.1651) (layer F.Fab) (width .1524))
  (fp_line (start -1.5494 -.1651) (end -2.5273 -.1651) (layer F.Fab) (width .1524))
  (fp_line (start -2.5273 -.1651) (end -2.5273 .1651) (layer F.Fab) (width .1524))
  (fp_line (start -2.5273 .1651) (end -1.5494 .1651) (layer F.Fab) (width .1524))
  (fp_line (start -1.5494 .66548) (end -1.5494 .33528) (layer F.Fab) (width .1524))
  (fp_line (start -1.5494 .33528) (end -2.5273 .33528) (layer F.Fab) (width .1524))
  (fp_line (start -2.5273 .33528) (end -2.5273 .66548) (layer F.Fab) (width .1524))
  (fp_line (start -2.5273 .66548) (end -1.5494 .66548) (layer F.Fab) (width .1524))
  (fp_line (start -1.5494 1.16586) (end -1.5494 .83566) (layer F.Fab) (width .1524))
  (fp_line (start -1.5494 .83566) (end -2.5273 .83566) (layer F.Fab) (width .1524))
  (fp_line (start -2.5273 .83566) (end -2.5273 1.16586) (layer F.Fab) (width .1524))
  (fp_line (start -2.5273 1.16586) (end -1.5494 1.16586) (layer F.Fab) (width .1524))
  (fp_line (start 1.5494 .83566) (end 1.5494 1.16586) (layer F.Fab) (width .1524))
  (fp_line (start 1.5494 1.16586) (end 2.5273 1.16586) (layer F.Fab) (width .1524))
  (fp_line (start 2.5273 1.16586) (end 2.5273 .83566) (layer F.Fab) (width .1524))
  (fp_line (start 2.5273 .83566) (end 1.5494 .83566) (layer F.Fab) (width .1524))
  (fp_line (start 1.5494 .33528) (end 1.5494 .66548) (layer F.Fab) (width .1524))
  (fp_line (start 1.5494 .66548) (end 2.5273 .66548) (layer F.Fab) (width .1524))
  (fp_line (start 2.5273 .66548) (end 2.5273 .33528) (layer F.Fab) (width .1524))
  (fp_line (start 2.5273 .33528) (end 1.5494 .33528) (layer F.Fab) (width .1524))
  (fp_line (start 1.5494 -.1651) (end 1.5494 .1651) (layer F.Fab) (width .1524))
  (fp_line (start 1.5494 .1651) (end 2.5273 .1651) (layer F.Fab) (width .1524))
  (fp_line (start 2.5273 .1651) (end 2.5273 -.1651) (layer F.Fab) (width .1524))
  (fp_line (start 2.5273 -.1651) (end 1.5494 -.1651) (layer F.Fab) (width .1524))
  (fp_line (start 1.5494 -.66548) (end 1.5494 -.33528) (layer F.Fab) (width .1524))
  (fp_line (start 1.5494 -.33528) (end 2.5273 -.33528) (layer F.Fab) (width .1524))
  (fp_line (start 2.5273 -.33528) (end 2.5273 -.66548) (layer F.Fab) (width .1524))
  (fp_line (start 2.5273 -.66548) (end 1.5494 -.66548) (layer F.Fab) (width .1524))
  (fp_line (start 1.5494 -1.16586) (end 1.5494 -.83566) (layer F.Fab) (width .1524))
  (fp_line (start 1.5494 -.83566) (end 2.5273 -.83566) (layer F.Fab) (width .1524))
  (fp_line (start 2.5273 -.83566) (end 2.5273 -1.16586) (layer F.Fab) (width .1524))
  (fp_line (start 2.5273 -1.16586) (end 1.5494 -1.16586) (layer F.Fab) (width .1524))
  (fp_line (start -1.6764 1.6764) (end 1.6764 1.6764) (layer F.SilkS) (width .1524))
  (fp_line (start 1.6764 1.6764) (end 1.6764 1.4986) (layer F.SilkS) (width .1524))
  (fp_line (start 1.6764 -1.6764) (end -1.6764 -1.6764) (layer F.SilkS) (width .1524))
  (fp_line (start -1.6764 -1.6764) (end -1.6764 -1.4986) (layer F.SilkS) (width .1524))
  (fp_line (start -1.5494 1.5494) (end 1.5494 1.5494) (layer F.Fab) (width .1524))
  (fp_line (start 1.5494 1.5494) (end 1.5494 -1.5494) (layer F.Fab) (width .1524))
  (fp_line (start 1.5494 -1.5494) (end -1.5494 -1.5494) (layer F.Fab) (width .1524))
  (fp_line (start -1.5494 -1.5494) (end -1.5494 1.5494) (layer F.Fab) (width .1524))
  (fp_line (start -1.6764 1.4986) (end -1.6764 1.6764) (layer F.SilkS) (width .1524))
  (fp_line (start 1.6764 -1.4986) (end 1.6764 -1.6764) (layer F.SilkS) (width .1524))
  (fp_line (start 3.385299 -1.19126) (end 3.385299 -.81026) (layer F.SilkS) (width .1524))
  (fp_line (start 3.385299 -.81026) (end 3.131299 -.81026) (layer F.SilkS) (width .1524))
  (fp_line (start 3.131299 -.81026) (end 3.131299 -1.19126) (layer F.SilkS) (width .1524))
  (fp_line (start 3.131299 -1.19126) (end 3.385299 -1.19126) (layer F.SilkS) (width .1524))
  (fp_line (start -3.131299 1.41986) (end -3.131299 -1.41986) (layer F.CrtYd) (width .1524))
  (fp_line (start -3.131299 -1.41986) (end -1.8034 -1.41986) (layer F.CrtYd) (width .1524))
  (fp_line (start -1.8034 -1.41986) (end -1.8034 -1.8034) (layer F.CrtYd) (width .1524))
  (fp_line (start -1.8034 -1.8034) (end 1.8034 -1.8034) (layer F.CrtYd) (width .1524))
  (fp_line (start 1.8034 -1.8034) (end 1.8034 -1.41986) (layer F.CrtYd) (width .1524))
  (fp_line (start 1.8034 -1.41986) (end 3.131299 -1.41986) (layer F.CrtYd) (width .1524))
  (fp_line (start 3.131299 -1.41986) (end 3.131299 1.41986) (layer F.CrtYd) (width .1524))
  (fp_line (start 3.131299 1.41986) (end 1.8034 1.41986) (layer F.CrtYd) (width .1524))
  (fp_line (start 1.8034 1.41986) (end 1.8034 1.8034) (layer F.CrtYd) (width .1524))
  (fp_line (start 1.8034 1.8034) (end -1.8034 1.8034) (layer F.CrtYd) (width .1524))
  (fp_line (start -1.8034 1.8034) (end -1.8034 1.41986) (layer F.CrtYd) (width .1524))
  (fp_line (start -1.8034 1.41986) (end -3.131299 1.41986) (layer F.CrtYd) (width .1524))
  (fp_arc (start 0 -1.5494) (end .3048 -1.5494) (angle 180)(layer F.Fab) (width .1524))
  (pad 1 smd rect (at -2.1971 -1.00076) (size 1.360399 .3302) (layers F.Cu F.Paste F.Mask))
  (pad 2 smd rect (at -2.1971 -.50038) (size 1.360399 .3302) (layers F.Cu F.Paste F.Mask))
  (pad 3 smd rect (at -2.1971 0) (size 1.360399 .3302) (layers F.Cu F.Paste F.Mask))
  (pad 4 smd rect (at -2.1971 .50038) (size 1.360399 .3302) (layers F.Cu F.Paste F.Mask))
  (pad 5 smd rect (at -2.1971 1.00076) (size 1.360399 .3302) (layers F.Cu F.Paste F.Mask))
  (pad 6 smd rect (at 2.1971 1.00076) (size 1.360399 .3302) (layers F.Cu F.Paste F.Mask))
  (pad 7 smd rect (at 2.1971 .50038) (size 1.360399 .3302) (layers F.Cu F.Paste F.Mask))
  (pad 8 smd rect (at 2.1971 0) (size 1.360399 .3302) (layers F.Cu F.Paste F.Mask))
  (pad 9 smd rect (at 2.1971 -.50038) (size 1.360399 .3302) (layers F.Cu F.Paste F.Mask))
  (pad 10 smd rect (at 2.1971 -1.00076) (size 1.360399 .3302) (layers F.Cu F.Paste F.Mask))
  (pad EPAD smd rect (at 0 0) (size 1.7272 1.905) (layers F.Cu F.Paste F.Mask))
)
