EESchema Schematic File Version 4
EELAYER 30 0
EELAYER END
$Descr A4 11693 8268
encoding utf-8
Sheet 1 4
Title "current regulated LED driver"
Date "2021-04-07"
Rev "1.1"
Comp ""
Comment1 ""
Comment2 ""
Comment3 ""
Comment4 ""
$EndDescr
$Sheet
S 3500 3000 1000 1350
U 605C7023
F0 "ATTiny_controller" 50
F1 "ATTiny_controller.sch" 50
F2 "5V" I L 3500 3250 50 
F3 "UMON" I R 4500 3500 50 
F4 "TMON" I R 4500 3600 50 
F5 "IMON" I R 4500 3700 50 
F6 "IADJ" O R 4500 3250 50 
F7 "A" B L 3500 3500 50 
F8 "B" B L 3500 3600 50 
F9 "UPDI" B L 3500 4000 50 
$EndSheet
$Sheet
S 5500 4500 1000 1350
U 605D76F7
F0 "sensors" 50
F1 "sensors.sch" 50
F2 "CSENSp" I R 6500 5000 50 
F3 "CSENSn" I R 6500 5100 50 
F4 "IMON" O L 5500 5350 50 
F5 "5V" I L 5500 4650 50 
F6 "TMON" O L 5500 5250 50 
F7 "VLED" O R 6500 4650 50 
F8 "UMON" O L 5500 5150 50 
$EndSheet
Wire Wire Line
	6500 2950 6700 2950
Wire Wire Line
	6500 4650 6700 4650
Wire Wire Line
	6700 4650 6700 2950
Connection ~ 6700 2950
Wire Wire Line
	6700 2950 7000 2950
Wire Wire Line
	6800 5000 6800 3350
Wire Wire Line
	6800 3350 6500 3350
Wire Wire Line
	6500 5000 6800 5000
Wire Wire Line
	6500 5100 6900 5100
Wire Wire Line
	6900 5100 6900 3450
Wire Wire Line
	6900 3450 6500 3450
Wire Wire Line
	4500 3600 5000 3600
Wire Wire Line
	5000 3600 5000 5250
Wire Wire Line
	5000 5250 5500 5250
Wire Wire Line
	4500 3500 5100 3500
Wire Wire Line
	5100 3500 5100 5150
Wire Wire Line
	5100 5150 5500 5150
Wire Wire Line
	4500 3700 4900 3700
Wire Wire Line
	4900 3700 4900 5350
Wire Wire Line
	4900 5350 5500 5350
$Comp
L power:+48V #PWR0101
U 1 1 605F5B37
P 5400 2900
F 0 "#PWR0101" H 5400 2750 50  0001 C CNN
F 1 "+48V" H 5415 3073 50  0000 C CNN
F 2 "" H 5400 2900 50  0001 C CNN
F 3 "" H 5400 2900 50  0001 C CNN
	1    5400 2900
	1    0    0    -1  
$EndComp
$Comp
L power:+5V #PWR0102
U 1 1 605F5F14
P 5400 4600
F 0 "#PWR0102" H 5400 4450 50  0001 C CNN
F 1 "+5V" H 5415 4773 50  0000 C CNN
F 2 "" H 5400 4600 50  0001 C CNN
F 3 "" H 5400 4600 50  0001 C CNN
	1    5400 4600
	1    0    0    -1  
$EndComp
$Comp
L power:+5V #PWR0103
U 1 1 605F63AA
P 3400 3200
F 0 "#PWR0103" H 3400 3050 50  0001 C CNN
F 1 "+5V" H 3415 3373 50  0000 C CNN
F 2 "" H 3400 3200 50  0001 C CNN
F 3 "" H 3400 3200 50  0001 C CNN
	1    3400 3200
	1    0    0    -1  
$EndComp
Wire Wire Line
	3400 3200 3400 3250
Wire Wire Line
	3400 3250 3500 3250
Wire Wire Line
	5400 2900 5400 2950
Wire Wire Line
	5400 2950 5500 2950
Wire Wire Line
	5400 4600 5400 4650
Wire Wire Line
	5400 4650 5500 4650
$Comp
L Connector_Generic:Conn_01x02 J2
U 1 1 6062B669
P 2800 3500
F 0 "J2" H 2800 3300 50  0000 C CNN
F 1 "RS485" H 2800 3600 50  0000 C CNN
F 2 "Connector_Phoenix_MSTB:PhoenixContact_MSTBA_2,5_2-G-5,08_1x02_P5.08mm_Horizontal" H 2800 3500 50  0001 C CNN
F 3 "~" H 2800 3500 50  0001 C CNN
	1    2800 3500
	-1   0    0    -1  
$EndComp
Wire Wire Line
	3000 3500 3500 3500
Wire Wire Line
	3000 3600 3500 3600
$Comp
L power:+5V #PWR0130
U 1 1 60632F8E
P 2400 1000
F 0 "#PWR0130" H 2400 850 50  0001 C CNN
F 1 "+5V" V 2415 1128 50  0000 L CNN
F 2 "" H 2400 1000 50  0001 C CNN
F 3 "" H 2400 1000 50  0001 C CNN
	1    2400 1000
	0    1    1    0   
$EndComp
$Comp
L power:GND #PWR0131
U 1 1 60633319
P 2300 2000
F 0 "#PWR0131" H 2300 1750 50  0001 C CNN
F 1 "GND" H 2305 1827 50  0000 C CNN
F 2 "" H 2300 2000 50  0001 C CNN
F 3 "" H 2300 2000 50  0001 C CNN
	1    2300 2000
	1    0    0    -1  
$EndComp
$Comp
L power:+48V #PWR0132
U 1 1 606335EB
P 2400 1400
F 0 "#PWR0132" H 2400 1250 50  0001 C CNN
F 1 "+48V" V 2415 1528 50  0000 L CNN
F 2 "" H 2400 1400 50  0001 C CNN
F 3 "" H 2400 1400 50  0001 C CNN
	1    2400 1400
	0    1    1    0   
$EndComp
Text GLabel 7000 2950 2    50   Output ~ 0
VLED
Text GLabel 2400 1600 2    50   Output ~ 0
VLED
$Comp
L Device:CP C11
U 1 1 60648D17
P 4250 1250
F 0 "C11" H 4368 1296 50  0000 L CNN
F 1 "680u" H 4368 1205 50  0000 L CNN
F 2 "Capacitor_THT:CP_Radial_D13.0mm_P5.00mm" H 4288 1100 50  0001 C CNN
F 3 "~" H 4250 1250 50  0001 C CNN
	1    4250 1250
	1    0    0    -1  
$EndComp
$Comp
L power:+48V #PWR0133
U 1 1 6064D85A
P 4250 950
F 0 "#PWR0133" H 4250 800 50  0001 C CNN
F 1 "+48V" H 4265 1123 50  0000 C CNN
F 2 "" H 4250 950 50  0001 C CNN
F 3 "" H 4250 950 50  0001 C CNN
	1    4250 950 
	1    0    0    -1  
$EndComp
$Comp
L power:GND #PWR0134
U 1 1 6064DBBB
P 4250 1550
F 0 "#PWR0134" H 4250 1300 50  0001 C CNN
F 1 "GND" H 4255 1377 50  0000 C CNN
F 2 "" H 4250 1550 50  0001 C CNN
F 3 "" H 4250 1550 50  0001 C CNN
	1    4250 1550
	1    0    0    -1  
$EndComp
Wire Wire Line
	4250 1400 4250 1550
Wire Wire Line
	4250 950  4250 1100
$Comp
L power:GND #PWR0135
U 1 1 60655249
P 5000 1550
F 0 "#PWR0135" H 5000 1300 50  0001 C CNN
F 1 "GND" H 5005 1377 50  0000 C CNN
F 2 "" H 5000 1550 50  0001 C CNN
F 3 "" H 5000 1550 50  0001 C CNN
	1    5000 1550
	1    0    0    -1  
$EndComp
$Comp
L power:+5V #PWR0136
U 1 1 6065A573
P 5000 950
F 0 "#PWR0136" H 5000 800 50  0001 C CNN
F 1 "+5V" H 5015 1123 50  0000 C CNN
F 2 "" H 5000 950 50  0001 C CNN
F 3 "" H 5000 950 50  0001 C CNN
	1    5000 950 
	1    0    0    -1  
$EndComp
$Comp
L Device:R_Small R11
U 1 1 6065F069
P 7000 1100
F 0 "R11" H 7059 1146 50  0000 L CNN
F 1 "47k" H 7059 1055 50  0000 L CNN
F 2 "Resistor_SMD:R_0805_2012Metric_Pad1.20x1.40mm_HandSolder" H 7000 1100 50  0001 C CNN
F 3 "~" H 7000 1100 50  0001 C CNN
	1    7000 1100
	1    0    0    -1  
$EndComp
$Comp
L power:GND #PWR0137
U 1 1 606691B5
P 6500 1550
F 0 "#PWR0137" H 6500 1300 50  0001 C CNN
F 1 "GND" H 6505 1377 50  0000 C CNN
F 2 "" H 6500 1550 50  0001 C CNN
F 3 "" H 6500 1550 50  0001 C CNN
	1    6500 1550
	1    0    0    -1  
$EndComp
$Comp
L power:GND #PWR0138
U 1 1 606693FB
P 7000 1550
F 0 "#PWR0138" H 7000 1300 50  0001 C CNN
F 1 "GND" H 7005 1377 50  0000 C CNN
F 2 "" H 7000 1550 50  0001 C CNN
F 3 "" H 7000 1550 50  0001 C CNN
	1    7000 1550
	1    0    0    -1  
$EndComp
$Comp
L power:+5V #PWR0139
U 1 1 606696A5
P 6500 950
F 0 "#PWR0139" H 6500 800 50  0001 C CNN
F 1 "+5V" H 6515 1123 50  0000 C CNN
F 2 "" H 6500 950 50  0001 C CNN
F 3 "" H 6500 950 50  0001 C CNN
	1    6500 950 
	1    0    0    -1  
$EndComp
$Comp
L power:+48V #PWR0140
U 1 1 60669E70
P 7000 950
F 0 "#PWR0140" H 7000 800 50  0001 C CNN
F 1 "+48V" H 7015 1123 50  0000 C CNN
F 2 "" H 7000 950 50  0001 C CNN
F 3 "" H 7000 950 50  0001 C CNN
	1    7000 950 
	1    0    0    -1  
$EndComp
$Comp
L Device:LED_Small D2
U 1 1 6066A5D1
P 6500 1400
F 0 "D2" V 6500 1330 50  0000 R CNN
F 1 "LED_Small" V 6455 1330 50  0001 R CNN
F 2 "LED_SMD:LED_0805_2012Metric_Pad1.15x1.40mm_HandSolder" V 6500 1400 50  0001 C CNN
F 3 "~" V 6500 1400 50  0001 C CNN
	1    6500 1400
	0    -1   -1   0   
$EndComp
$Comp
L Device:LED_Small D3
U 1 1 6066AC28
P 7000 1400
F 0 "D3" V 7000 1330 50  0000 R CNN
F 1 "LED_Small" V 6955 1330 50  0001 R CNN
F 2 "LED_SMD:LED_0805_2012Metric_Pad1.15x1.40mm_HandSolder" V 7000 1400 50  0001 C CNN
F 3 "~" V 7000 1400 50  0001 C CNN
	1    7000 1400
	0    -1   -1   0   
$EndComp
Wire Wire Line
	6500 950  6500 1000
Wire Wire Line
	6500 1500 6500 1550
Wire Wire Line
	7000 1500 7000 1550
Wire Wire Line
	7000 1200 7000 1300
Wire Wire Line
	7000 950  7000 1000
$Comp
L Device:CP C12
U 1 1 60654D92
P 5000 1250
F 0 "C12" H 5118 1296 50  0000 L CNN
F 1 "100u" H 5118 1205 50  0000 L CNN
F 2 "Capacitor_THT:CP_Radial_D8.0mm_P2.50mm" H 5038 1100 50  0001 C CNN
F 3 "~" H 5000 1250 50  0001 C CNN
	1    5000 1250
	1    0    0    -1  
$EndComp
$Comp
L Connector_Generic:Conn_01x10 J1
U 1 1 6062F66B
P 2050 1500
F 0 "J1" H 1968 775 50  0000 C CNN
F 1 "Conn_01x10" H 1968 866 50  0000 C CNN
F 2 "Connector_Molex:Molex_Mini-Fit_Jr_5569-10A2_2x05_P4.20mm_Horizontal" H 2050 1500 50  0001 C CNN
F 3 "~" H 2050 1500 50  0001 C CNN
	1    2050 1500
	-1   0    0    1   
$EndComp
$Comp
L power:+48V #PWR0141
U 1 1 60589446
P 2400 1900
F 0 "#PWR0141" H 2400 1750 50  0001 C CNN
F 1 "+48V" V 2415 2028 50  0000 L CNN
F 2 "" H 2400 1900 50  0001 C CNN
F 3 "" H 2400 1900 50  0001 C CNN
	1    2400 1900
	0    1    1    0   
$EndComp
Text GLabel 2400 1100 2    50   Output ~ 0
VLED
Wire Wire Line
	2300 2000 2300 1800
Wire Wire Line
	2300 1200 2250 1200
Wire Wire Line
	2250 1300 2300 1300
Connection ~ 2300 1300
Wire Wire Line
	2300 1300 2300 1200
Wire Wire Line
	2250 1700 2300 1700
Connection ~ 2300 1700
Wire Wire Line
	2250 1800 2300 1800
Connection ~ 2300 1800
Wire Wire Line
	2300 1800 2300 1700
Wire Wire Line
	2250 1400 2400 1400
Wire Wire Line
	2250 1100 2400 1100
Wire Wire Line
	2250 1000 2400 1000
Wire Wire Line
	2250 1900 2400 1900
Wire Wire Line
	2300 1300 2300 1500
Wire Wire Line
	2250 1600 2400 1600
Wire Wire Line
	2250 1500 2300 1500
Connection ~ 2300 1500
Wire Wire Line
	2300 1500 2300 1700
Wire Wire Line
	6500 1200 6500 1300
$Comp
L Device:R_Small R10
U 1 1 6065F2CF
P 6500 1100
F 0 "R10" H 6559 1146 50  0000 L CNN
F 1 "2k" H 6559 1055 50  0000 L CNN
F 2 "Resistor_SMD:R_0805_2012Metric_Pad1.20x1.40mm_HandSolder" H 6500 1100 50  0001 C CNN
F 3 "~" H 6500 1100 50  0001 C CNN
	1    6500 1100
	1    0    0    -1  
$EndComp
$Sheet
S 5500 2750 1000 1350
U 605B305A
F0 "LM3409_driver" 50
F1 "LM3409_driver.sch" 50
F2 "VLED" O R 6500 2950 50 
F3 "VIN" I L 5500 2950 50 
F4 "CSENSp" O R 6500 3350 50 
F5 "CSENSn" O R 6500 3450 50 
F6 "IADJ" I L 5500 3250 50 
$EndSheet
Wire Wire Line
	4500 3250 5500 3250
Wire Wire Line
	5000 950  5000 1100
Wire Wire Line
	5000 1400 5000 1550
$Comp
L Device:CP C15
U 1 1 607915D7
P 3800 1250
F 0 "C15" H 3918 1296 50  0000 L CNN
F 1 "680u" H 3918 1205 50  0000 L CNN
F 2 "Capacitor_THT:CP_Radial_D13.0mm_P5.00mm" H 3838 1100 50  0001 C CNN
F 3 "~" H 3800 1250 50  0001 C CNN
	1    3800 1250
	1    0    0    -1  
$EndComp
$Comp
L power:GND #PWR0149
U 1 1 60791793
P 3800 1550
F 0 "#PWR0149" H 3800 1300 50  0001 C CNN
F 1 "GND" H 3805 1377 50  0000 C CNN
F 2 "" H 3800 1550 50  0001 C CNN
F 3 "" H 3800 1550 50  0001 C CNN
	1    3800 1550
	1    0    0    -1  
$EndComp
Wire Wire Line
	3800 1400 3800 1550
Wire Wire Line
	3800 1000 3800 1100
Text GLabel 3800 1000 1    50   Output ~ 0
VLED
$Comp
L Connector_Generic:Conn_01x03 J3
U 1 1 60708910
P 2800 4000
F 0 "J3" H 2800 3800 50  0000 C CNN
F 1 "UPDI" H 2800 4200 50  0000 C CNN
F 2 "Connector_PinHeader_2.54mm:PinHeader_1x03_P2.54mm_Vertical" H 2800 4000 50  0001 C CNN
F 3 "~" H 2800 4000 50  0001 C CNN
	1    2800 4000
	-1   0    0    -1  
$EndComp
$Comp
L power:+5V #PWR0154
U 1 1 6070A94F
P 3050 3850
F 0 "#PWR0154" H 3050 3700 50  0001 C CNN
F 1 "+5V" H 3065 4023 50  0000 C CNN
F 2 "" H 3050 3850 50  0001 C CNN
F 3 "" H 3050 3850 50  0001 C CNN
	1    3050 3850
	1    0    0    -1  
$EndComp
$Comp
L power:GND #PWR0155
U 1 1 6070AE75
P 3050 4150
F 0 "#PWR0155" H 3050 3900 50  0001 C CNN
F 1 "GND" H 3055 3977 50  0000 C CNN
F 2 "" H 3050 4150 50  0001 C CNN
F 3 "" H 3050 4150 50  0001 C CNN
	1    3050 4150
	1    0    0    -1  
$EndComp
Wire Wire Line
	3000 4100 3050 4100
Wire Wire Line
	3050 4100 3050 4150
Wire Wire Line
	3000 3900 3050 3900
Wire Wire Line
	3050 3900 3050 3850
Wire Wire Line
	3000 4000 3500 4000
$EndSCHEMATC
