(module TLC10A-101M-00 (layer F.Cu) (tedit 60577A82)
  (fp_text reference REF** (at 34 0 90) (layer F.SilkS)
    (effects (font (size 1 1) (thickness 0.15)))
  )
  (fp_text value TLC10A-101M-00 (at 0 -0.5) (layer F.Fab)
    (effects (font (size 1 1) (thickness 0.15)))
  )
  (fp_circle (center 0 0) (end 25.25 0) (layer F.SilkS) (width 0.15))
  (fp_circle (center 0 0) (end 10 0) (layer F.SilkS) (width 0.15))
  (pad 1 thru_hole circle (at 10.94 0) (size 4 4) (drill 2) (layers *.Cu *.Mask))
  (pad 2 thru_hole circle (at 24.25 0) (size 4 4) (drill 2) (layers *.Cu *.Mask))
  (pad "" np_thru_hole circle (at 5 8.660254) (size 3 3) (drill 3) (layers *.Cu *.Mask))
  (pad "" np_thru_hole circle (at 12.625 -21.867141) (size 3 3) (drill 3) (layers *.Cu *.Mask))
  (pad "" np_thru_hole circle (at 5 -8.660254) (size 3 3) (drill 3) (layers *.Cu *.Mask))
  (pad "" np_thru_hole circle (at 12.625 21.867141) (size 3 3) (drill 3) (layers *.Cu *.Mask))
  (pad "" np_thru_hole circle (at -10 0) (size 3 3) (drill 3) (layers *.Cu *.Mask))
  (pad "" np_thru_hole circle (at -25.25 0) (size 3 3) (drill 3) (layers *.Cu *.Mask))
)
