EESchema Schematic File Version 4
EELAYER 30 0
EELAYER END
$Descr A4 11693 8268
encoding utf-8
Sheet 2 4
Title ""
Date "2021-04-07"
Rev "1.1"
Comp ""
Comment1 ""
Comment2 ""
Comment3 ""
Comment4 ""
$EndDescr
Text HLabel 2200 3050 0    50   Input ~ 0
5V
$Comp
L power:+5V #PWR0114
U 1 1 605C8355
P 3500 2350
F 0 "#PWR0114" H 3500 2200 50  0001 C CNN
F 1 "+5V" H 3515 2523 50  0000 C CNN
F 2 "" H 3500 2350 50  0001 C CNN
F 3 "" H 3500 2350 50  0001 C CNN
	1    3500 2350
	1    0    0    -1  
$EndComp
$Comp
L power:GND #PWR0115
U 1 1 605C8A03
P 3500 3650
F 0 "#PWR0115" H 3500 3400 50  0001 C CNN
F 1 "GND" H 3505 3477 50  0000 C CNN
F 2 "" H 3500 3650 50  0001 C CNN
F 3 "" H 3500 3650 50  0001 C CNN
	1    3500 3650
	1    0    0    -1  
$EndComp
Text HLabel 8500 4700 2    50   Output ~ 0
IADJ
Text HLabel 7900 2750 2    50   Input ~ 0
UMON
Text HLabel 7900 3500 2    50   Input ~ 0
TMON
Text HLabel 7900 2000 2    50   Input ~ 0
IMON
$Comp
L Device:C_Small C4
U 1 1 605CB4B6
P 2250 3200
F 0 "C4" H 2342 3246 50  0000 L CNN
F 1 "100n" H 2342 3155 50  0000 L CNN
F 2 "Capacitor_SMD:C_0805_2012Metric_Pad1.18x1.45mm_HandSolder" H 2250 3200 50  0001 C CNN
F 3 "~" H 2250 3200 50  0001 C CNN
	1    2250 3200
	1    0    0    -1  
$EndComp
$Comp
L power:GND #PWR0116
U 1 1 605CC0AB
P 2250 3350
F 0 "#PWR0116" H 2250 3100 50  0001 C CNN
F 1 "GND" H 2255 3177 50  0000 C CNN
F 2 "" H 2250 3350 50  0001 C CNN
F 3 "" H 2250 3350 50  0001 C CNN
	1    2250 3350
	1    0    0    -1  
$EndComp
$Comp
L power:+5V #PWR0117
U 1 1 605CC35D
P 2250 3000
F 0 "#PWR0117" H 2250 2850 50  0001 C CNN
F 1 "+5V" H 2265 3173 50  0000 C CNN
F 2 "" H 2250 3000 50  0001 C CNN
F 3 "" H 2250 3000 50  0001 C CNN
	1    2250 3000
	1    0    0    -1  
$EndComp
Wire Wire Line
	2250 3000 2250 3050
Wire Wire Line
	2250 3300 2250 3350
Text Notes 750  900  0    50   ~ 0
Programm the RSTPINCFG bits of the FUSES.SYSCFG0 to 0x0 in order to use PA0 as GPIO.\n(see section 6.10.4.4 of datasheet). Be aware that you need a high voltage UPDI programmer\nto programm the device after RESET has been disabled!
$Comp
L Device:C_Small C5
U 1 1 6060036E
P 7500 2200
F 0 "C5" H 7592 2246 50  0000 L CNN
F 1 "100n" H 7592 2155 50  0000 L CNN
F 2 "Capacitor_SMD:C_0805_2012Metric_Pad1.18x1.45mm_HandSolder" H 7500 2200 50  0001 C CNN
F 3 "~" H 7500 2200 50  0001 C CNN
	1    7500 2200
	1    0    0    -1  
$EndComp
$Comp
L Device:R_Small R4
U 1 1 606004EA
P 7700 2000
F 0 "R4" V 7504 2000 50  0000 C CNN
F 1 "27k" V 7595 2000 50  0000 C CNN
F 2 "Resistor_SMD:R_0805_2012Metric_Pad1.20x1.40mm_HandSolder" H 7700 2000 50  0001 C CNN
F 3 "~" H 7700 2000 50  0001 C CNN
	1    7700 2000
	0    1    1    0   
$EndComp
Wire Wire Line
	7900 2000 7800 2000
Wire Wire Line
	7600 2000 7500 2000
Wire Wire Line
	7500 2000 7500 2100
$Comp
L power:GND #PWR0118
U 1 1 606019D7
P 7500 2400
F 0 "#PWR0118" H 7500 2150 50  0001 C CNN
F 1 "GND" H 7505 2227 50  0000 C CNN
F 2 "" H 7500 2400 50  0001 C CNN
F 3 "" H 7500 2400 50  0001 C CNN
	1    7500 2400
	1    0    0    -1  
$EndComp
Wire Wire Line
	7500 2400 7500 2300
Text Notes 8100 2250 0    50   ~ 0
f_c = 1 / (2 * pi * R * C)\n    = 54 Hz
Wire Wire Line
	7000 2000 7250 2000
Connection ~ 7500 2000
Text Label 7000 2000 0    50   ~ 0
I_MON
$Comp
L Device:C_Small C6
U 1 1 60607D3F
P 7500 2950
F 0 "C6" H 7592 2996 50  0000 L CNN
F 1 "100n" H 7592 2905 50  0000 L CNN
F 2 "Capacitor_SMD:C_0805_2012Metric_Pad1.18x1.45mm_HandSolder" H 7500 2950 50  0001 C CNN
F 3 "~" H 7500 2950 50  0001 C CNN
	1    7500 2950
	1    0    0    -1  
$EndComp
$Comp
L Device:R_Small R5
U 1 1 60607D45
P 7700 2750
F 0 "R5" V 7504 2750 50  0000 C CNN
F 1 "27k" V 7595 2750 50  0000 C CNN
F 2 "Resistor_SMD:R_0805_2012Metric_Pad1.20x1.40mm_HandSolder" H 7700 2750 50  0001 C CNN
F 3 "~" H 7700 2750 50  0001 C CNN
	1    7700 2750
	0    1    1    0   
$EndComp
Wire Wire Line
	7900 2750 7800 2750
Wire Wire Line
	7600 2750 7500 2750
Wire Wire Line
	7500 2750 7500 2850
$Comp
L power:GND #PWR0119
U 1 1 60607D4E
P 7500 3150
F 0 "#PWR0119" H 7500 2900 50  0001 C CNN
F 1 "GND" H 7505 2977 50  0000 C CNN
F 2 "" H 7500 3150 50  0001 C CNN
F 3 "" H 7500 3150 50  0001 C CNN
	1    7500 3150
	1    0    0    -1  
$EndComp
Wire Wire Line
	7500 3150 7500 3050
Text Notes 8100 3000 0    50   ~ 0
f_c = 1 / (2 * pi * R * C)\n    = 59 Hz
Wire Wire Line
	7000 2750 7500 2750
Connection ~ 7500 2750
Text Label 7000 2750 0    50   ~ 0
U_MON
$Comp
L Device:C_Small C7
U 1 1 60608C5F
P 7500 3700
F 0 "C7" H 7592 3746 50  0000 L CNN
F 1 "100n" H 7592 3655 50  0000 L CNN
F 2 "Capacitor_SMD:C_0805_2012Metric_Pad1.18x1.45mm_HandSolder" H 7500 3700 50  0001 C CNN
F 3 "~" H 7500 3700 50  0001 C CNN
	1    7500 3700
	1    0    0    -1  
$EndComp
$Comp
L Device:R_Small R6
U 1 1 60608C65
P 7700 3500
F 0 "R6" V 7504 3500 50  0000 C CNN
F 1 "27k" V 7595 3500 50  0000 C CNN
F 2 "Resistor_SMD:R_0805_2012Metric_Pad1.20x1.40mm_HandSolder" H 7700 3500 50  0001 C CNN
F 3 "~" H 7700 3500 50  0001 C CNN
	1    7700 3500
	0    1    1    0   
$EndComp
Wire Wire Line
	7900 3500 7800 3500
Wire Wire Line
	7600 3500 7500 3500
Wire Wire Line
	7500 3500 7500 3600
$Comp
L power:GND #PWR0120
U 1 1 60608C6E
P 7500 3900
F 0 "#PWR0120" H 7500 3650 50  0001 C CNN
F 1 "GND" H 7505 3727 50  0000 C CNN
F 2 "" H 7500 3900 50  0001 C CNN
F 3 "" H 7500 3900 50  0001 C CNN
	1    7500 3900
	1    0    0    -1  
$EndComp
Wire Wire Line
	7500 3900 7500 3800
Text Notes 8100 3750 0    50   ~ 0
f_c = 1 / (2 * pi * R * C)\n    = 59 Hz
Wire Wire Line
	7000 3500 7500 3500
Connection ~ 7500 3500
Text Label 7000 3500 0    50   ~ 0
T_MON
$Comp
L power:GND #PWR0121
U 1 1 6060B380
P 7500 5100
F 0 "#PWR0121" H 7500 4850 50  0001 C CNN
F 1 "GND" H 7505 4927 50  0000 C CNN
F 2 "" H 7500 5100 50  0001 C CNN
F 3 "" H 7500 5100 50  0001 C CNN
	1    7500 5100
	1    0    0    -1  
$EndComp
Text Label 7000 4300 0    50   ~ 0
I_ADJ
Wire Wire Line
	7500 5000 7500 5100
Wire Wire Line
	7500 4600 7500 4700
Wire Wire Line
	7500 4400 7500 4300
Wire Wire Line
	7500 4300 7000 4300
Wire Wire Line
	7500 4700 7650 4700
Connection ~ 7500 4700
Wire Wire Line
	7500 4700 7500 4800
Text Notes 8550 4450 0    50   ~ 0
LM3409 has max. current at IADJ = 1.24 V\n  -> divide PWM signal @ 5 V by 4 and add low pass filter
$Comp
L Device:R_Small R7
U 1 1 6060FDF1
P 7750 4700
F 0 "R7" V 7554 4700 50  0000 C CNN
F 1 "10k" V 7645 4700 50  0000 C CNN
F 2 "Resistor_SMD:R_0805_2012Metric_Pad1.20x1.40mm_HandSolder" H 7750 4700 50  0001 C CNN
F 3 "~" H 7750 4700 50  0001 C CNN
	1    7750 4700
	0    1    1    0   
$EndComp
$Comp
L Device:C_Small C8
U 1 1 60610199
P 8000 4900
F 0 "C8" H 8092 4946 50  0000 L CNN
F 1 "1u" H 8092 4855 50  0000 L CNN
F 2 "Capacitor_SMD:C_0805_2012Metric_Pad1.18x1.45mm_HandSolder" H 8000 4900 50  0001 C CNN
F 3 "~" H 8000 4900 50  0001 C CNN
	1    8000 4900
	1    0    0    -1  
$EndComp
Wire Wire Line
	7850 4700 8000 4700
Wire Wire Line
	8000 4700 8000 4800
Wire Wire Line
	8000 5000 8000 5100
Wire Wire Line
	8000 4700 8500 4700
Connection ~ 8000 4700
$Comp
L Device:R_Small R3
U 1 1 6060B0DE
P 7500 4900
F 0 "R3" H 7450 4950 50  0000 R CNN
F 1 "3k" H 7450 4850 50  0000 R CNN
F 2 "Resistor_SMD:R_0805_2012Metric_Pad1.20x1.40mm_HandSolder" H 7500 4900 50  0001 C CNN
F 3 "~" H 7500 4900 50  0001 C CNN
	1    7500 4900
	1    0    0    -1  
$EndComp
$Comp
L Device:R_Small R2
U 1 1 6060ABA9
P 7500 4500
F 0 "R2" H 7450 4550 50  0000 R CNN
F 1 "9k1" H 7450 4450 50  0000 R CNN
F 2 "Resistor_SMD:R_0805_2012Metric_Pad1.20x1.40mm_HandSolder" H 7500 4500 50  0001 C CNN
F 3 "~" H 7500 4500 50  0001 C CNN
	1    7500 4500
	1    0    0    -1  
$EndComp
$Comp
L power:GND #PWR0122
U 1 1 60614142
P 8000 5100
F 0 "#PWR0122" H 8000 4850 50  0001 C CNN
F 1 "GND" H 8005 4927 50  0000 C CNN
F 2 "" H 8000 5100 50  0001 C CNN
F 3 "" H 8000 5100 50  0001 C CNN
	1    8000 5100
	1    0    0    -1  
$EndComp
$Comp
L Device:C_Small C13
U 1 1 6059010B
P 7250 2200
F 0 "C13" H 7342 2246 50  0000 L CNN
F 1 "10n" H 7342 2155 50  0000 L CNN
F 2 "Capacitor_SMD:C_0805_2012Metric_Pad1.18x1.45mm_HandSolder" H 7250 2200 50  0001 C CNN
F 3 "~" H 7250 2200 50  0001 C CNN
	1    7250 2200
	-1   0    0    -1  
$EndComp
Wire Wire Line
	7250 2100 7250 2000
Connection ~ 7250 2000
Wire Wire Line
	7250 2000 7500 2000
$Comp
L power:GND #PWR0145
U 1 1 605915C5
P 7250 2400
F 0 "#PWR0145" H 7250 2150 50  0001 C CNN
F 1 "GND" H 7255 2227 50  0000 C CNN
F 2 "" H 7250 2400 50  0001 C CNN
F 3 "" H 7250 2400 50  0001 C CNN
	1    7250 2400
	1    0    0    -1  
$EndComp
Wire Wire Line
	7250 2300 7250 2400
Text HLabel 4250 5100 2    50   BiDi ~ 0
A
Text HLabel 4250 4800 2    50   BiDi ~ 0
B
$Comp
L Interface_UART:MAX485E U5
U 1 1 606E50DD
P 3700 4900
F 0 "U5" H 3950 5350 50  0000 C CNN
F 1 "MAX485E" H 3950 4350 50  0000 C CNN
F 2 "Package_SO:SOIC-8_3.9x4.9mm_P1.27mm" H 3700 4200 50  0001 C CNN
F 3 "https://datasheets.maximintegrated.com/en/ds/MAX1487E-MAX491E.pdf" H 3700 4950 50  0001 C CNN
	1    3700 4900
	1    0    0    -1  
$EndComp
Wire Wire Line
	4100 4800 4150 4800
Wire Wire Line
	4100 5100 4150 5100
$Comp
L Transistor_FET:BSS123 Q2
U 1 1 606EB2D8
P 2650 5250
F 0 "Q2" H 2854 5296 50  0000 L CNN
F 1 "BSS123" H 2854 5205 50  0000 L CNN
F 2 "Package_TO_SOT_SMD:SOT-23" H 2850 5175 50  0001 L CIN
F 3 "http://www.diodes.com/assets/Datasheets/ds30366.pdf" H 2650 5250 50  0001 L CNN
	1    2650 5250
	1    0    0    -1  
$EndComp
Text Label 4400 3200 2    50   ~ 0
RXD
Text Label 4400 3100 2    50   ~ 0
TXD
$Comp
L power:GND #PWR0129
U 1 1 606F11A3
P 3700 5550
F 0 "#PWR0129" H 3700 5300 50  0001 C CNN
F 1 "GND" H 3705 5377 50  0000 C CNN
F 2 "" H 3700 5550 50  0001 C CNN
F 3 "" H 3700 5550 50  0001 C CNN
	1    3700 5550
	1    0    0    -1  
$EndComp
$Comp
L power:+5V #PWR0142
U 1 1 606F1A61
P 3700 4350
F 0 "#PWR0142" H 3700 4200 50  0001 C CNN
F 1 "+5V" H 3715 4523 50  0000 C CNN
F 2 "" H 3700 4350 50  0001 C CNN
F 3 "" H 3700 4350 50  0001 C CNN
	1    3700 4350
	1    0    0    -1  
$EndComp
Wire Wire Line
	3700 4350 3700 4400
Wire Wire Line
	3700 5500 3700 5550
$Comp
L Device:R_Small R15
U 1 1 606F4995
P 2750 4750
F 0 "R15" H 2809 4796 50  0000 L CNN
F 1 "10k" H 2809 4705 50  0000 L CNN
F 2 "Resistor_SMD:R_0805_2012Metric_Pad1.20x1.40mm_HandSolder" H 2750 4750 50  0001 C CNN
F 3 "~" H 2750 4750 50  0001 C CNN
	1    2750 4750
	1    0    0    -1  
$EndComp
$Comp
L Device:R_Small R14
U 1 1 606F517C
P 2300 5250
F 0 "R14" V 2104 5250 50  0000 C CNN
F 1 "10k" V 2195 5250 50  0000 C CNN
F 2 "Resistor_SMD:R_0805_2012Metric_Pad1.20x1.40mm_HandSolder" H 2300 5250 50  0001 C CNN
F 3 "~" H 2300 5250 50  0001 C CNN
	1    2300 5250
	0    1    1    0   
$EndComp
Wire Wire Line
	2750 5050 2750 4950
Wire Wire Line
	2750 4950 3200 4950
Wire Wire Line
	3200 4950 3200 4900
Wire Wire Line
	3200 4900 3300 4900
Wire Wire Line
	3200 4950 3200 5000
Wire Wire Line
	3200 5000 3300 5000
Connection ~ 3200 4950
Text Label 3100 4800 0    50   ~ 0
RXD
Wire Wire Line
	3300 4800 3100 4800
Wire Wire Line
	3100 5100 3300 5100
Text Label 3100 5100 0    50   ~ 0
TXD
Wire Wire Line
	2400 5250 2450 5250
$Comp
L power:GND #PWR0143
U 1 1 606FF008
P 2750 5550
F 0 "#PWR0143" H 2750 5300 50  0001 C CNN
F 1 "GND" H 2755 5377 50  0000 C CNN
F 2 "" H 2750 5550 50  0001 C CNN
F 3 "" H 2750 5550 50  0001 C CNN
	1    2750 5550
	1    0    0    -1  
$EndComp
Wire Wire Line
	2750 5450 2750 5550
Wire Wire Line
	4100 2800 4400 2800
Wire Wire Line
	4400 2900 4100 2900
Wire Wire Line
	4400 3000 4100 3000
Wire Wire Line
	4100 3100 4400 3100
Wire Wire Line
	4100 3200 4400 3200
Wire Wire Line
	2750 4850 2750 4950
Connection ~ 2750 4950
Wire Wire Line
	2750 4650 2750 4550
$Comp
L power:+5V #PWR0148
U 1 1 6070EFD9
P 2750 4550
F 0 "#PWR0148" H 2750 4400 50  0001 C CNN
F 1 "+5V" H 2765 4723 50  0000 C CNN
F 2 "" H 2750 4550 50  0001 C CNN
F 3 "" H 2750 4550 50  0001 C CNN
	1    2750 4550
	1    0    0    -1  
$EndComp
Text Label 1950 5250 0    50   ~ 0
TXD
Wire Wire Line
	2200 5250 1950 5250
Text Label 4400 2900 2    50   ~ 0
I_ADJ
Text Label 4400 3000 2    50   ~ 0
I_MON
Text Label 5200 2700 2    50   ~ 0
T_MON
Text Label 4400 2800 2    50   ~ 0
U_MON
Wire Wire Line
	2200 3050 2250 3050
Connection ~ 2250 3050
Wire Wire Line
	2250 3050 2250 3100
Wire Wire Line
	3500 3600 3500 3650
Wire Wire Line
	3500 2350 3500 2400
$Comp
L Device:R_Small R16
U 1 1 606FBA02
P 2000 7000
F 0 "R16" V 1804 7000 50  0000 C CNN
F 1 "10k" V 1895 7000 50  0000 C CNN
F 2 "Resistor_SMD:R_0805_2012Metric_Pad1.20x1.40mm_HandSolder" H 2000 7000 50  0001 C CNN
F 3 "~" H 2000 7000 50  0001 C CNN
	1    2000 7000
	0    1    1    0   
$EndComp
$Comp
L power:GND #PWR0150
U 1 1 606FC184
P 2500 7250
F 0 "#PWR0150" H 2500 7000 50  0001 C CNN
F 1 "GND" H 2505 7077 50  0000 C CNN
F 2 "" H 2500 7250 50  0001 C CNN
F 3 "" H 2500 7250 50  0001 C CNN
	1    2500 7250
	1    0    0    -1  
$EndComp
$Comp
L Device:R_Small R17
U 1 1 606FC542
P 2500 6600
F 0 "R17" H 2559 6646 50  0000 L CNN
F 1 "2k" H 2559 6555 50  0000 L CNN
F 2 "Resistor_SMD:R_0805_2012Metric_Pad1.20x1.40mm_HandSolder" H 2500 6600 50  0001 C CNN
F 3 "~" H 2500 6600 50  0001 C CNN
	1    2500 6600
	1    0    0    -1  
$EndComp
$Comp
L Device:LED_Small D4
U 1 1 60700380
P 2500 6350
F 0 "D4" V 2546 6280 50  0000 R CNN
F 1 "LED_Small" V 2455 6280 50  0000 R CNN
F 2 "LED_SMD:LED_0805_2012Metric_Pad1.15x1.40mm_HandSolder" V 2500 6350 50  0001 C CNN
F 3 "~" V 2500 6350 50  0001 C CNN
	1    2500 6350
	0    -1   -1   0   
$EndComp
$Comp
L power:+5V #PWR0151
U 1 1 607010BA
P 2500 6200
F 0 "#PWR0151" H 2500 6050 50  0001 C CNN
F 1 "+5V" H 2515 6373 50  0000 C CNN
F 2 "" H 2500 6200 50  0001 C CNN
F 3 "" H 2500 6200 50  0001 C CNN
	1    2500 6200
	1    0    0    -1  
$EndComp
Wire Wire Line
	2500 6200 2500 6250
Wire Wire Line
	2500 6450 2500 6500
Wire Wire Line
	2500 6700 2500 6800
Wire Wire Line
	2500 7200 2500 7250
Wire Wire Line
	2100 7000 2200 7000
Wire Wire Line
	1900 7000 1650 7000
Text Label 1650 7000 0    50   ~ 0
TXD
$Comp
L Device:R_Small R18
U 1 1 6070A414
P 3500 7000
F 0 "R18" V 3304 7000 50  0000 C CNN
F 1 "10k" V 3395 7000 50  0000 C CNN
F 2 "Resistor_SMD:R_0805_2012Metric_Pad1.20x1.40mm_HandSolder" H 3500 7000 50  0001 C CNN
F 3 "~" H 3500 7000 50  0001 C CNN
	1    3500 7000
	0    1    1    0   
$EndComp
$Comp
L power:GND #PWR0152
U 1 1 6070A41E
P 4000 7250
F 0 "#PWR0152" H 4000 7000 50  0001 C CNN
F 1 "GND" H 4005 7077 50  0000 C CNN
F 2 "" H 4000 7250 50  0001 C CNN
F 3 "" H 4000 7250 50  0001 C CNN
	1    4000 7250
	1    0    0    -1  
$EndComp
$Comp
L Device:R_Small R19
U 1 1 6070A428
P 4000 6600
F 0 "R19" H 4059 6646 50  0000 L CNN
F 1 "2k" H 4059 6555 50  0000 L CNN
F 2 "Resistor_SMD:R_0805_2012Metric_Pad1.20x1.40mm_HandSolder" H 4000 6600 50  0001 C CNN
F 3 "~" H 4000 6600 50  0001 C CNN
	1    4000 6600
	1    0    0    -1  
$EndComp
$Comp
L Device:LED_Small D5
U 1 1 6070A432
P 4000 6350
F 0 "D5" V 4046 6280 50  0000 R CNN
F 1 "LED_Small" V 3955 6280 50  0000 R CNN
F 2 "LED_SMD:LED_0805_2012Metric_Pad1.15x1.40mm_HandSolder" V 4000 6350 50  0001 C CNN
F 3 "~" V 4000 6350 50  0001 C CNN
	1    4000 6350
	0    -1   -1   0   
$EndComp
$Comp
L power:+5V #PWR0153
U 1 1 6070A43C
P 4000 6200
F 0 "#PWR0153" H 4000 6050 50  0001 C CNN
F 1 "+5V" H 4015 6373 50  0000 C CNN
F 2 "" H 4000 6200 50  0001 C CNN
F 3 "" H 4000 6200 50  0001 C CNN
	1    4000 6200
	1    0    0    -1  
$EndComp
Wire Wire Line
	4000 6200 4000 6250
Wire Wire Line
	4000 6450 4000 6500
Wire Wire Line
	4000 6700 4000 6800
Wire Wire Line
	4000 7200 4000 7250
Wire Wire Line
	3600 7000 3700 7000
Wire Wire Line
	3400 7000 3150 7000
Text Label 3150 7000 0    50   ~ 0
RXD
$Comp
L Transistor_FET:NTR2101P Q4
U 1 1 60713C3D
P 3900 7000
F 0 "Q4" H 4105 6954 50  0000 L CNN
F 1 "NTR2101P" H 4105 7045 50  0000 L CNN
F 2 "Package_TO_SOT_SMD:SOT-23" H 4100 6925 50  0001 L CIN
F 3 "http://www.onsemi.com/pub/Collateral/NTR2101P-D.PDF" H 3900 7000 50  0001 L CNN
	1    3900 7000
	1    0    0    1   
$EndComp
$Comp
L Transistor_FET:NTR2101P Q3
U 1 1 60716C3A
P 2400 7000
F 0 "Q3" H 2605 6954 50  0000 L CNN
F 1 "NTR2101P" H 2605 7045 50  0000 L CNN
F 2 "Package_TO_SOT_SMD:SOT-23" H 2600 6925 50  0001 L CIN
F 3 "http://www.onsemi.com/pub/Collateral/NTR2101P-D.PDF" H 2400 7000 50  0001 L CNN
	1    2400 7000
	1    0    0    1   
$EndComp
$Comp
L Device:R_Small R20
U 1 1 606EF162
P 4150 4950
F 0 "R20" H 4209 4996 50  0000 L CNN
F 1 "120" H 4209 4905 50  0000 L CNN
F 2 "Resistor_SMD:R_0805_2012Metric_Pad1.20x1.40mm_HandSolder" H 4150 4950 50  0001 C CNN
F 3 "~" H 4150 4950 50  0001 C CNN
	1    4150 4950
	1    0    0    -1  
$EndComp
Wire Wire Line
	4150 4800 4150 4850
Connection ~ 4150 4800
Wire Wire Line
	4150 4800 4250 4800
Wire Wire Line
	4150 5050 4150 5100
Connection ~ 4150 5100
Wire Wire Line
	4150 5100 4250 5100
$Comp
L Device:Jumper JP1
U 1 1 606F9230
P 4600 2700
F 0 "JP1" H 4600 2964 50  0000 C CNN
F 1 "Jumper" H 4600 2873 50  0000 C CNN
F 2 "Jumper:SolderJumper-2_P1.3mm_Open_RoundedPad1.0x1.5mm" H 4600 2700 50  0001 C CNN
F 3 "~" H 4600 2700 50  0001 C CNN
	1    4600 2700
	1    0    0    -1  
$EndComp
$Comp
L MCU_Microchip_ATtiny:ATtiny202-SS U2
U 1 1 606E1B0C
P 3500 3000
F 0 "U2" H 2971 3046 50  0000 R CNN
F 1 "ATtiny202-SS" H 2971 2955 50  0000 R CNN
F 2 "Package_SO:SOIC-8_3.9x4.9mm_P1.27mm" H 3500 3000 50  0001 C CIN
F 3 "http://ww1.microchip.com/downloads/en/DeviceDoc/ATtiny202-402-AVR-MCU-with-Core-Independent-Peripherals_and-picoPower-40001969A.pdf" H 3500 3000 50  0001 C CNN
	1    3500 3000
	1    0    0    -1  
$EndComp
Wire Wire Line
	4900 2700 5200 2700
Text HLabel 4200 2550 1    50   BiDi ~ 0
UPDI
Wire Wire Line
	4100 2700 4200 2700
Wire Wire Line
	4200 2550 4200 2700
Connection ~ 4200 2700
Wire Wire Line
	4200 2700 4300 2700
Text Notes 750  1500 0    50   ~ 0
Be sure to open JP1 prior to programming the device.\nSince we use PA0 for analog reading and hence have disabled RESET,\nwe need to use high voltage programming (i.e. apply a 12 V pulse on\nPA0 to enter programming mode) See section 30.3.2.2 of the datasheet\nfor more information. Thereby it is double important to disconnect\nexternal circuitry from that pin.
$EndSCHEMATC
