EESchema Schematic File Version 4
EELAYER 30 0
EELAYER END
$Descr A4 11693 8268
encoding utf-8
Sheet 4 4
Title ""
Date "2021-04-07"
Rev "1.1"
Comp ""
Comment1 ""
Comment2 ""
Comment3 ""
Comment4 ""
$EndDescr
$Comp
L components:LM3409 U?
U 1 1 605C2ED1
P 5900 3900
AR Path="/605C2ED1" Ref="U?"  Part="1" 
AR Path="/605B305A/605C2ED1" Ref="U1"  Part="1" 
F 0 "U1" H 5900 4365 50  0000 C CNN
F 1 "LM3409HV" H 5900 4274 50  0000 C CNN
F 2 "Package_SO:MSOP-10-1EP_3x3mm_P0.5mm_EP1.68x1.88mm_ThermalVias" H 6150 3550 50  0001 C CNN
F 3 "" H 6150 3550 50  0001 C CNN
	1    5900 3900
	1    0    0    -1  
$EndComp
$Comp
L power:GND #PWR?
U 1 1 605C2ED7
P 5900 4350
AR Path="/605C2ED7" Ref="#PWR?"  Part="1" 
AR Path="/605B305A/605C2ED7" Ref="#PWR0104"  Part="1" 
F 0 "#PWR0104" H 5900 4100 50  0001 C CNN
F 1 "GND" H 5905 4177 50  0000 C CNN
F 2 "" H 5900 4350 50  0001 C CNN
F 3 "" H 5900 4350 50  0001 C CNN
	1    5900 4350
	1    0    0    -1  
$EndComp
$Comp
L power:GND #PWR?
U 1 1 605C2EDD
P 5450 4150
AR Path="/605C2EDD" Ref="#PWR?"  Part="1" 
AR Path="/605B305A/605C2EDD" Ref="#PWR0105"  Part="1" 
F 0 "#PWR0105" H 5450 3900 50  0001 C CNN
F 1 "GND" H 5455 3977 50  0000 C CNN
F 2 "" H 5450 4150 50  0001 C CNN
F 3 "" H 5450 4150 50  0001 C CNN
	1    5450 4150
	1    0    0    -1  
$EndComp
Wire Wire Line
	5450 4150 5450 4100
Wire Wire Line
	5450 4100 5500 4100
Wire Wire Line
	5900 4300 5900 4350
Text HLabel 7550 4650 2    50   Output ~ 0
VLED
$Comp
L Transistor_FET:IRF9540N Q?
U 1 1 605C2EE7
P 6800 4400
AR Path="/605C2EE7" Ref="Q?"  Part="1" 
AR Path="/605B305A/605C2EE7" Ref="Q1"  Part="1" 
F 0 "Q1" H 7004 4354 50  0000 L CNN
F 1 "IRF9530N" H 7004 4445 50  0000 L CNN
F 2 "Package_TO_SOT_THT:TO-220-3_Vertical" H 7000 4325 50  0001 L CIN
F 3 "http://www.irf.com/product-info/datasheets/data/irf9540n.pdf" H 6800 4400 50  0001 L CNN
	1    6800 4400
	1    0    0    1   
$EndComp
$Comp
L Diode:MBR340 D?
U 1 1 605C2EED
P 6900 4850
AR Path="/605C2EED" Ref="D?"  Part="1" 
AR Path="/605B305A/605C2EED" Ref="D1"  Part="1" 
F 0 "D1" H 6900 4633 50  0000 C CNN
F 1 "MBR10100" H 6900 4724 50  0000 C CNN
F 2 "Package_TO_SOT_THT:TO-220-2_Vertical" H 6900 4675 50  0001 C CNN
F 3 "http://www.onsemi.com/pub_link/Collateral/MBR340-D.PDF" H 6900 4850 50  0001 C CNN
	1    6900 4850
	0    1    1    0   
$EndComp
$Comp
L Device:L L?
U 1 1 605C2EF3
P 7150 4650
AR Path="/605C2EF3" Ref="L?"  Part="1" 
AR Path="/605B305A/605C2EF3" Ref="L1"  Part="1" 
F 0 "L1" V 7100 4650 50  0000 C CNN
F 1 "100u" V 7249 4650 50  0000 C CNN
F 2 "components:TLC10A-101M-00" H 7150 4650 50  0001 C CNN
F 3 "~" H 7150 4650 50  0001 C CNN
	1    7150 4650
	0    1    1    0   
$EndComp
$Comp
L Device:C_Small C?
U 1 1 605C2EF9
P 4900 4500
AR Path="/605C2EF9" Ref="C?"  Part="1" 
AR Path="/605B305A/605C2EF9" Ref="C2"  Part="1" 
F 0 "C2" H 4992 4546 50  0000 L CNN
F 1 "470p" H 4992 4455 50  0000 L CNN
F 2 "Capacitor_SMD:C_0805_2012Metric_Pad1.18x1.45mm_HandSolder" H 4900 4500 50  0001 C CNN
F 3 "~" H 4900 4500 50  0001 C CNN
	1    4900 4500
	1    0    0    -1  
$EndComp
$Comp
L Device:R_Small R_SNS?
U 1 1 605C2EFF
P 6900 3950
AR Path="/605C2EFF" Ref="R_SNS?"  Part="1" 
AR Path="/605B305A/605C2EFF" Ref="R_SNS1"  Part="1" 
F 0 "R_SNS1" H 6959 3996 50  0000 L CNN
F 1 "20m" H 6959 3905 50  0000 L CNN
F 2 "Resistor_THT:R_Axial_Power_L20.0mm_W6.4mm_P30.48mm" H 6900 3950 50  0001 C CNN
F 3 "~" H 6900 3950 50  0001 C CNN
	1    6900 3950
	1    0    0    -1  
$EndComp
$Comp
L Device:R_Small R_UV?
U 1 1 605C2F05
P 4950 3300
AR Path="/605C2F05" Ref="R_UV?"  Part="1" 
AR Path="/605B305A/605C2F05" Ref="R13"  Part="1" 
F 0 "R13" H 5009 3346 50  0000 L CNN
F 1 "100k" H 5009 3255 50  0000 L CNN
F 2 "Resistor_SMD:R_0805_2012Metric_Pad1.20x1.40mm_HandSolder" H 4950 3300 50  0001 C CNN
F 3 "~" H 4950 3300 50  0001 C CNN
	1    4950 3300
	1    0    0    -1  
$EndComp
$Comp
L Device:R_Small R_UV?
U 1 1 605C2F0B
P 4950 3000
AR Path="/605C2F0B" Ref="R_UV?"  Part="1" 
AR Path="/605B305A/605C2F0B" Ref="R12"  Part="1" 
F 0 "R12" H 5009 3046 50  0000 L CNN
F 1 "10k" H 5009 2955 50  0000 L CNN
F 2 "Resistor_SMD:R_0805_2012Metric_Pad1.20x1.40mm_HandSolder" H 4950 3000 50  0001 C CNN
F 3 "~" H 4950 3000 50  0001 C CNN
	1    4950 3000
	1    0    0    -1  
$EndComp
$Comp
L Device:R_Small R?
U 1 1 605C2F11
P 4900 4200
AR Path="/605C2F11" Ref="R?"  Part="1" 
AR Path="/605B305A/605C2F11" Ref="R1"  Part="1" 
F 0 "R1" H 4959 4246 50  0000 L CNN
F 1 "26k1" H 4959 4155 50  0000 L CNN
F 2 "Resistor_SMD:R_0805_2012Metric_Pad1.20x1.40mm_HandSolder" H 4900 4200 50  0001 C CNN
F 3 "~" H 4900 4200 50  0001 C CNN
	1    4900 4200
	1    0    0    -1  
$EndComp
Wire Wire Line
	4900 4600 4900 4650
$Comp
L power:GND #PWR?
U 1 1 605C2F18
P 4900 4650
AR Path="/605C2F18" Ref="#PWR?"  Part="1" 
AR Path="/605B305A/605C2F18" Ref="#PWR0106"  Part="1" 
F 0 "#PWR0106" H 4900 4400 50  0001 C CNN
F 1 "GND" H 4905 4477 50  0000 C CNN
F 2 "" H 4900 4650 50  0001 C CNN
F 3 "" H 4900 4650 50  0001 C CNN
	1    4900 4650
	1    0    0    -1  
$EndComp
$Comp
L power:+48V #PWR?
U 1 1 605C2F1E
P 4950 2800
AR Path="/605C2F1E" Ref="#PWR?"  Part="1" 
AR Path="/605B305A/605C2F1E" Ref="#PWR0107"  Part="1" 
F 0 "#PWR0107" H 4950 2650 50  0001 C CNN
F 1 "+48V" H 4965 2973 50  0000 C CNN
F 2 "" H 4950 2800 50  0001 C CNN
F 3 "" H 4950 2800 50  0001 C CNN
	1    4950 2800
	1    0    0    -1  
$EndComp
$Comp
L power:+48V #PWR?
U 1 1 605C2F24
P 5400 3900
AR Path="/605C2F24" Ref="#PWR?"  Part="1" 
AR Path="/605B305A/605C2F24" Ref="#PWR0108"  Part="1" 
F 0 "#PWR0108" H 5400 3750 50  0001 C CNN
F 1 "+48V" V 5415 4028 50  0000 L CNN
F 2 "" H 5400 3900 50  0001 C CNN
F 3 "" H 5400 3900 50  0001 C CNN
	1    5400 3900
	0    -1   -1   0   
$EndComp
Wire Wire Line
	4950 3400 4950 3450
$Comp
L power:GND #PWR?
U 1 1 605C2F2B
P 4950 3450
AR Path="/605C2F2B" Ref="#PWR?"  Part="1" 
AR Path="/605B305A/605C2F2B" Ref="#PWR0109"  Part="1" 
F 0 "#PWR0109" H 4950 3200 50  0001 C CNN
F 1 "GND" H 4955 3277 50  0000 C CNN
F 2 "" H 4950 3450 50  0001 C CNN
F 3 "" H 4950 3450 50  0001 C CNN
	1    4950 3450
	1    0    0    -1  
$EndComp
Wire Wire Line
	4950 2850 4950 2900
Wire Wire Line
	4900 4300 4900 4350
Wire Wire Line
	4900 4350 5300 4350
Wire Wire Line
	5300 4350 5300 4000
Wire Wire Line
	5300 4000 5500 4000
Connection ~ 4900 4350
Wire Wire Line
	4900 4350 4900 4400
Wire Wire Line
	5400 3900 5500 3900
Wire Wire Line
	5300 3700 5500 3700
Wire Wire Line
	4950 3100 4950 3150
Wire Wire Line
	4950 3150 5300 3150
Connection ~ 4950 3150
Wire Wire Line
	4950 3150 4950 3200
$Comp
L Device:C_Small C?
U 1 1 605C2F3E
P 4550 4000
AR Path="/605C2F3E" Ref="C?"  Part="1" 
AR Path="/605B305A/605C2F3E" Ref="C1"  Part="1" 
F 0 "C1" H 4642 4046 50  0000 L CNN
F 1 "100n" H 4642 3955 50  0000 L CNN
F 2 "Capacitor_SMD:C_0805_2012Metric_Pad1.18x1.45mm_HandSolder" H 4550 4000 50  0001 C CNN
F 3 "~" H 4550 4000 50  0001 C CNN
	1    4550 4000
	1    0    0    -1  
$EndComp
$Comp
L power:GND #PWR?
U 1 1 605C2F4A
P 4550 4150
AR Path="/605C2F4A" Ref="#PWR?"  Part="1" 
AR Path="/605B305A/605C2F4A" Ref="#PWR0110"  Part="1" 
F 0 "#PWR0110" H 4550 3900 50  0001 C CNN
F 1 "GND" H 4555 3977 50  0000 C CNN
F 2 "" H 4550 4150 50  0001 C CNN
F 3 "" H 4550 4150 50  0001 C CNN
	1    4550 4150
	1    0    0    -1  
$EndComp
Wire Wire Line
	4550 4100 4550 4150
Wire Wire Line
	4550 3800 4550 3900
Connection ~ 4550 3800
Wire Wire Line
	4550 3800 5500 3800
Text HLabel 4100 3800 0    50   Input ~ 0
IADJ
Wire Wire Line
	5300 3150 5300 3700
Wire Wire Line
	6400 3700 6300 3700
Wire Wire Line
	6300 3800 6500 3800
Wire Wire Line
	6500 3800 6500 3750
$Comp
L Device:C_Small C?
U 1 1 605C2F5B
P 6500 3650
AR Path="/605C2F5B" Ref="C?"  Part="1" 
AR Path="/605B305A/605C2F5B" Ref="C3"  Part="1" 
F 0 "C3" H 6592 3696 50  0000 L CNN
F 1 "10u" H 6592 3605 50  0000 L CNN
F 2 "Capacitor_SMD:C_0805_2012Metric_Pad1.18x1.45mm_HandSolder" H 6500 3650 50  0001 C CNN
F 3 "~" H 6500 3650 50  0001 C CNN
	1    6500 3650
	1    0    0    -1  
$EndComp
$Comp
L power:+48V #PWR?
U 1 1 605C2F61
P 6450 3450
AR Path="/605C2F61" Ref="#PWR?"  Part="1" 
AR Path="/605B305A/605C2F61" Ref="#PWR0111"  Part="1" 
F 0 "#PWR0111" H 6450 3300 50  0001 C CNN
F 1 "+48V" H 6465 3623 50  0000 C CNN
F 2 "" H 6450 3450 50  0001 C CNN
F 3 "" H 6450 3450 50  0001 C CNN
	1    6450 3450
	1    0    0    -1  
$EndComp
Wire Wire Line
	6500 3500 6500 3550
Wire Wire Line
	6400 3500 6400 3700
Wire Wire Line
	6400 3500 6450 3500
Wire Wire Line
	6450 3450 6450 3500
Connection ~ 6450 3500
Wire Wire Line
	6450 3500 6500 3500
$Comp
L power:+48V #PWR?
U 1 1 605C2F6D
P 6900 3750
AR Path="/605C2F6D" Ref="#PWR?"  Part="1" 
AR Path="/605B305A/605C2F6D" Ref="#PWR0112"  Part="1" 
F 0 "#PWR0112" H 6900 3600 50  0001 C CNN
F 1 "+48V" H 6915 3923 50  0000 C CNN
F 2 "" H 6900 3750 50  0001 C CNN
F 3 "" H 6900 3750 50  0001 C CNN
	1    6900 3750
	1    0    0    -1  
$EndComp
Wire Wire Line
	6900 4050 6900 4100
Wire Wire Line
	6900 3750 6900 3800
Wire Wire Line
	6300 3900 6700 3900
Wire Wire Line
	6700 3900 6700 3800
Wire Wire Line
	6700 3800 6900 3800
Connection ~ 6900 3800
Wire Wire Line
	6900 3800 6900 3850
Wire Wire Line
	6300 4000 6700 4000
Wire Wire Line
	6700 4000 6700 4100
Wire Wire Line
	6700 4100 6900 4100
Wire Wire Line
	6900 4100 6900 4200
Connection ~ 6900 4100
Wire Wire Line
	6300 4100 6450 4100
Wire Wire Line
	6450 4100 6450 4400
Wire Wire Line
	6450 4400 6600 4400
Wire Wire Line
	6900 4600 6900 4650
Wire Wire Line
	6900 4650 7000 4650
Connection ~ 6900 4650
Wire Wire Line
	6900 4650 6900 4700
Wire Wire Line
	7300 4650 7550 4650
$Comp
L power:GND #PWR?
U 1 1 605C2F87
P 6900 5050
AR Path="/605C2F87" Ref="#PWR?"  Part="1" 
AR Path="/605B305A/605C2F87" Ref="#PWR0113"  Part="1" 
F 0 "#PWR0113" H 6900 4800 50  0001 C CNN
F 1 "GND" H 6905 4877 50  0000 C CNN
F 2 "" H 6900 5050 50  0001 C CNN
F 3 "" H 6900 5050 50  0001 C CNN
	1    6900 5050
	1    0    0    -1  
$EndComp
Wire Wire Line
	6900 5000 6900 5050
Text Label 7300 4650 0    50   ~ 0
VLED
Text Label 4900 4050 1    50   ~ 0
VLED
Wire Wire Line
	4900 4100 4900 4050
Text HLabel 4100 2850 0    50   Input ~ 0
VIN
Wire Wire Line
	4100 2850 4950 2850
Connection ~ 4950 2850
Wire Wire Line
	4950 2800 4950 2850
Text HLabel 7550 3800 2    50   Output ~ 0
CSENSp
Text HLabel 7550 4100 2    50   Output ~ 0
CSENSn
Wire Wire Line
	6900 3800 7550 3800
Wire Wire Line
	6900 4100 7550 4100
Text Notes 1000 1150 0    50   ~ 0
IADJ low pass filter:\nf_c = 1 / (2*pi*R*C)\nR = 10k, C = 1u -> f_c = 16 Hz
Wire Wire Line
	4100 3800 4550 3800
$Comp
L Device:C_Small C?
U 1 1 60593C46
P 5550 2950
AR Path="/60593C46" Ref="C?"  Part="1" 
AR Path="/605B305A/60593C46" Ref="C14"  Part="1" 
F 0 "C14" H 5642 2996 50  0000 L CNN
F 1 "100n" H 5642 2905 50  0000 L CNN
F 2 "Capacitor_SMD:C_0805_2012Metric_Pad1.18x1.45mm_HandSolder" H 5550 2950 50  0001 C CNN
F 3 "~" H 5550 2950 50  0001 C CNN
	1    5550 2950
	1    0    0    -1  
$EndComp
$Comp
L power:+48V #PWR?
U 1 1 605981C4
P 5550 2800
AR Path="/605981C4" Ref="#PWR?"  Part="1" 
AR Path="/605B305A/605981C4" Ref="#PWR0146"  Part="1" 
F 0 "#PWR0146" H 5550 2650 50  0001 C CNN
F 1 "+48V" H 5565 2973 50  0000 C CNN
F 2 "" H 5550 2800 50  0001 C CNN
F 3 "" H 5550 2800 50  0001 C CNN
	1    5550 2800
	1    0    0    -1  
$EndComp
$Comp
L power:GND #PWR?
U 1 1 6059878B
P 5550 3100
AR Path="/6059878B" Ref="#PWR?"  Part="1" 
AR Path="/605B305A/6059878B" Ref="#PWR0147"  Part="1" 
F 0 "#PWR0147" H 5550 2850 50  0001 C CNN
F 1 "GND" H 5555 2927 50  0000 C CNN
F 2 "" H 5550 3100 50  0001 C CNN
F 3 "" H 5550 3100 50  0001 C CNN
	1    5550 3100
	1    0    0    -1  
$EndComp
Wire Wire Line
	5550 3050 5550 3100
Wire Wire Line
	5550 2800 5550 2850
$EndSCHEMATC
