<?xml version="1.0" encoding="UTF-8" standalone="no"?>
<svg
   xmlns:dc="http://purl.org/dc/elements/1.1/"
   xmlns:cc="http://creativecommons.org/ns#"
   xmlns:rdf="http://www.w3.org/1999/02/22-rdf-syntax-ns#"
   xmlns:svg="http://www.w3.org/2000/svg"
   xmlns="http://www.w3.org/2000/svg"
   xmlns:sodipodi="http://sodipodi.sourceforge.net/DTD/sodipodi-0.dtd"
   xmlns:inkscape="http://www.inkscape.org/namespaces/inkscape"
   width="71.866066mm"
   height="33.830887mm"
   viewBox="0 0 271.61978 142.07198"
   id="jh_logo"
   version="1.1"
   sodipodi:docname="alpaca-background.svg"
   inkscape:version="0.92.4 5da689c313, 2019-01-14"
   style="shape-rendering:crispEdges">
  <metadata
     id="metadata15">
    <rdf:RDF>
      <cc:Work
         rdf:about="">
        <dc:format>image/svg+xml</dc:format>
        <dc:type
           rdf:resource="http://purl.org/dc/dcmitype/StillImage" />
        <dc:title></dc:title>
      </cc:Work>
    </rdf:RDF>
  </metadata>
  <defs
     id="defs13" />
  <sodipodi:namedview
     pagecolor="#ffffff"
     bordercolor="#666666"
     borderopacity="1"
     objecttolerance="10"
     gridtolerance="10"
     guidetolerance="10"
     inkscape:pageopacity="0"
     inkscape:pageshadow="2"
     inkscape:window-width="1920"
     inkscape:window-height="1024"
     id="namedview11"
     showgrid="false"
     inkscape:zoom="2.6818181"
     inkscape:cx="162.38751"
     inkscape:cy="24.629548"
     inkscape:window-x="0"
     inkscape:window-y="28"
     inkscape:window-maximized="1"
     inkscape:current-layer="jh_logo"
     fit-margin-left="5"
     fit-margin-top="5"
     fit-margin-right="5"
     fit-margin-bottom="5"
     units="mm" />
  <g
     style="shape-rendering:crispEdges"
     id="g842"
     transform="matrix(9.0979293,0,0,9.0979293,165.63517,20.997377)">
    <g
       id="face-3">
      <g
         id="eyes-5">
        <rect
           height="1"
           width="1"
           y="6"
           x="2"
           id="left_eye-6" />
        <rect
           height="1"
           width="1"
           y="6"
           x="8"
           id="right_eye-2" />
      </g>
      <polygon
         points="4,9 7,9 7,7 6,7 6,8 5,8 5,7 4,7 "
         id="mouth-9" />
    </g>
    <g
       style="fill:#87cefa;fill-opacity:1"
       id="head-1">
      <polygon
         style="fill:#87cefa;fill-opacity:1"
         points="7,2 7,1 8,1 8,0 10,0 10,1 11,1 11,5 9,5 9,4 2,4 2,5 0,5 0,1 1,1 1,0 3,0 3,1 4,1 4,2 "
         id="ears-2" />
      <polygon
         style="fill:#87cefa;fill-opacity:1"
         points="0,9 1,9 1,10 2,10 2,11 9,11 9,10 10,10 10,9 11,9 11,5 10,5 10,8 9,8 9,9 8,9 8,10 3,10 3,9 2,9 2,8 1,8 1,5 0,5 "
         id="beard-7" />
    </g>
  </g>
  <g
     style="shape-rendering:crispEdges"
     id="g864"
     transform="matrix(9.0979293,0,0,9.0979293,5.9073735,20.997377)">
    <g
       id="face-0">
      <g
         id="eyes-6">
        <rect
           height="1"
           width="1"
           y="6"
           x="2"
           id="left_eye-2" />
        <rect
           height="1"
           width="1"
           y="6"
           x="8"
           id="right_eye-6" />
      </g>
      <polygon
         points="7,9 7,7 6,7 6,8 5,8 5,7 4,7 4,9 "
         id="mouth-1" />
    </g>
    <g
       style="fill:#ff8800;fill-opacity:1"
       id="head-8">
      <polygon
         style="fill:#ff8800;fill-opacity:1"
         points="7,1 8,1 8,0 10,0 10,1 11,1 11,5 9,5 9,4 2,4 2,5 0,5 0,1 1,1 1,0 3,0 3,1 4,1 4,2 7,2 "
         id="ears-7" />
      <polygon
         style="fill:#ff8800;fill-opacity:1"
         points="1,9 1,10 2,10 2,11 9,11 9,10 10,10 10,9 11,9 11,5 10,5 10,8 9,8 9,9 8,9 8,10 3,10 3,9 2,9 2,8 1,8 1,5 0,5 0,9 "
         id="beard-9" />
    </g>
  </g>
</svg>
