[
    {
      "name":"security threats"
    },
    {
      "name":"data protection"
    },
    {
      "name":"multi-cloud security"
    },
    {
      "name":"virus"
    },
    {
      "name":"algorithm"
    }
  ]