{
    "Images": {
        "quay.io/devspaces/code-rhel8:3.3-5": {"Created": "2022-09-25T12:13:19.281458022Z", "Digest": "6022ca1454a64220f00bf8610fc8867a88fd496cac2ffc057e9f756fd52b857f", "Image": "quay.io/devspaces/code-rhel8:3.3-5"},
        "quay.io/devspaces/configbump-rhel8:3.3-9": {"Created": "2022-10-02T09:02:56.170178172Z", "Digest": "5729eb1c37210e82a569a63791d2efbc97476650846bf45473886fb0b4a8150d", "Image": "quay.io/devspaces/configbump-rhel8:3.3-9"},
        "quay.io/devspaces/devspaces-rhel8-operator:3.3-37": {"Created": "2022-10-02T09:02:20.75900778Z", "Digest": "e7d8e0460b878a8a4e8ad9978fca759a67685e213875ece5630e16a05d80342e", "Image": "quay.io/devspaces/devspaces-rhel8-operator:3.3-37"},
        "quay.io/devspaces/devspaces-operator-bundle:3.3-97": {"Created": "2022-10-03T17:40:10.295637576Z", "Digest": "c104c487ab41dc070b0d7580ac15ded20bae65e0d79980eb08e1eb83edd48c4d", "Image": "quay.io/devspaces/devspaces-operator-bundle:3.3-97"},
        "quay.io/devspaces/dashboard-rhel8:3.3-29": {"Created": "2022-10-03T17:53:04.407802287Z", "Digest": "a52f3659c96be93e8240a176a6959e0600374777953f693dc532bad59a3ee158", "Image": "quay.io/devspaces/dashboard-rhel8:3.3-29"},
        "quay.io/devspaces/devfileregistry-rhel8:3.3-19": {"Created": "2022-10-02T09:03:49.571691836Z", "Digest": "2e9deeaded784f6a1807d4341e9d52600f170802523493c4deb1b8d97f131c08", "Image": "quay.io/devspaces/devfileregistry-rhel8:3.3-19"},
        "quay.io/devspaces/idea-rhel8:3.3-4": {"Created": "2022-09-25T10:41:34.759237331Z", "Digest": "d39352b3c75129dcf78a24257e9249a06d22388e75cfc00565209081acbed5ce", "Image": "quay.io/devspaces/idea-rhel8:3.3-4"},
        "quay.io/devspaces/imagepuller-rhel8:3.3-10": {"Created": "2022-10-02T09:05:25.01229022Z", "Digest": "11b61c092d6f55eb2220bea034f43441f64ee3d52937c8cc2fb6641b60731e81", "Image": "quay.io/devspaces/imagepuller-rhel8:3.3-10"},
        "quay.io/devspaces/machineexec-rhel8:3.3-9": {"Created": "2022-10-02T09:01:48.847139802Z", "Digest": "c2f909c6f2dfc8629ddcaee6245ee6abb436d00282f1af72e2d49800ba551d00", "Image": "quay.io/devspaces/machineexec-rhel8:3.3-9"},
        "quay.io/devspaces/pluginregistry-rhel8:3.3-19": {"Created": "2022-10-03T17:13:56.255396338Z", "Digest": "df00c5e6c6a24ea4acbf3e3db9b7cb9b9e1333265d85179e8b2a720cda98122c", "Image": "quay.io/devspaces/pluginregistry-rhel8:3.3-19"},
        "quay.io/devspaces/server-rhel8:3.3-20": {"Created": "2022-10-03T07:03:19.869655192Z", "Digest": "15193af328dc772995d89ba0b50eec2a2f796b468367bcf635f157f9b987f3fc", "Image": "quay.io/devspaces/server-rhel8:3.3-20"},
        "quay.io/devspaces/theia-dev-rhel8:3.3-10": {"Created": "2022-10-02T10:32:07.395957752Z", "Digest": "8bbee2991031564c9c17b024fa8738e5ec89c47b36614a80da9b66d17bb145ff", "Image": "quay.io/devspaces/theia-dev-rhel8:3.3-10"},
        "quay.io/devspaces/theia-endpoint-rhel8:3.3-8": {"Created": "2022-10-02T12:06:54.970745776Z", "Digest": "13c1689f280710206c8bdc9714dc9a85d3b89b504bbfd362bf35cd58fc34e7cb", "Image": "quay.io/devspaces/theia-endpoint-rhel8:3.3-8"},
        "quay.io/devspaces/theia-rhel8:3.3-9": {"Created": "2022-10-02T11:48:36.448329645Z", "Digest": "fd55146017edaf218f0209510f4cdeeeda3d82fef563015e472902b6dab9f891", "Image": "quay.io/devspaces/theia-rhel8:3.3-9"},
        "quay.io/devspaces/traefik-rhel8:3.3-11": {"Created": "2022-10-02T10:01:22.814942107Z", "Digest": "ac76f74f0e4b3d2ca5e929b2b49632a98cb28a6c94a48b7775423805343ed057", "Image": "quay.io/devspaces/traefik-rhel8:3.3-11"},
        "quay.io/devspaces/udi-rhel8:3.3-17": {"Created": "2022-10-02T10:04:14.906547189Z", "Digest": "73528592c428d8dde8e911c3f89b7335963403a14a7514ac72434d9aa47cb709", "Image": "quay.io/devspaces/udi-rhel8:3.3-17"},
        "": {"Created":"", "Digest":"", "Image":""}
    }
}
