{
  "type": "service_account",
  "project_id": "crawler-177017",
  "private_key_id": "5ce82dde094967922fa91adcdad9b3f4ce5fdad3",
  "private_key": "-----BEGIN PRIVATE KEY-----\nMIIEvAIBADANBgkqhkiG9w0BAQEFAASCBKYwggSiAgEAAoIBAQC44KOQyoARhtFI\nvsd92FsleEqfMYm/NilVGEqjLw9+UrbzsNaMw4alEzsn8AsITHG7mrfhnD+oaY29\nJ9pPMUl1PMhS0GDIdC06o9nD6z7nhZilVXhF1SdzcIhVR9yNVaerkIDETWf2YIJ9\nfGhV52+STyFpZFCHanGAHLzH63LeIyMQrkvk9d7AwTQQ30phZ23F4sEtwjKFoz/l\nosABCn3nsAjhXvSPU8B1gmZlT1yBSWcOZzZL5sjQ/S4EFMJtuJArqBVG8V5qZrEO\nXcOCfTmbaTB2awrsYlBCKMoWLMjZ6Whg1njPK4OxYXwWuZrzvzFnIAzBHC00hKcm\n+O/30Q7/AgMBAAECggEAF/LVjViF/X861hMMkYM4z2JFPFj08IWKFiFW7cuXVLRP\nScMDD+n2I6UZmSNRsooAg55XqoyMfHrr5vBmKbMHQn4UrxGaL+1IvJtkBqqPE/us\n2eH3+gfSG/ScXHu6GL7bQPCvlX43dOVskefPNi2MOOYyPE5H1jrWKBPQ6o7X6ulm\n2ZokgsT2MTB/VYjaEeNXBIU1GQhym0z6PZQ18mzLrA+J60Rl8a9EZGWgfA7p9Xut\n2v9heBtqWBbKZBn8W37RR0PKUwPNyZ6KBy9cmX/QNBqXIiofiqJmkm1AS+tJUPL7\nRAkVmm/8i/OydyyFbuXvSfobkNNTSwYSL9oS/nUyNQKBgQDmTJffU8h0Kp+bW7jI\nfKh9Xq6cLVioA0npxi5ShPNh8FtgbNrc3ujvZI04JWillmB7HDrndW0HSnCnfezA\nKFvOpI7K9HvDIYo6PPxsrtxq+Y3CegA9LHMszJZTJw359fTrMBz/aPwYYRZSu1eT\nrblgB50hXOMW/jd4VfoGURlRmwKBgQDNgmU3Jn1+bH8mwFUQO4TwYJAVUFYh1YN9\n4WHljrQfdA9gtRkkTnPkFsrJVKaeqT5PZDoTHcugwxxpAXLDnBFFHwg8K5X726U3\nRlbd6OPV21qKWqS9eTFG7TeOUGXFR21UCyA5DEaUIVHrMk/2X8dr9v9lytAwe0jw\nlDnLdxjwbQKBgA3pfJcyIX7bAE9LSCtcVHVWXefzWVK0+CcWIMA9ZdJ5yZtWmBYV\npS6o/Vrx75NpNSTavLg0wMRa+9kyYzXsejdOe43JHRzZjtcbzgfmvEv+DVE9O3x2\njfKb3UzipBaAhC4c9vN67Rev7cBLruut5+/kJdrZGKLP8pvjXbo59fSXAoGAeS0A\n52L/rjLlSoEv5xFhUqdtbdPf5bVTAj+KDOR3GvDBPIGsIHdN6Fj0G4CZeoZKol9z\nyt/PuKwzLUtYUzTMDhi9L1V363jY013bTJ/M78WWfmvyJXK3dp3bG0QWrhtuwJaK\n2nh9iUyYU/lnottY6DVM5MWQunWHTavo5CsGfoUCgYAhz39QvjrTVqjcuXoE7z5b\nORN/Sdm9sxgwSPsH5V35rlIfA4kggR3pX4+zxoFiH6kVXeW1r7ZKckDaFlL05NoJ\nQXR85v/3XZoCsiiwemhednjWkfD/AnDPASYif3Ej5zKn9/BTIEpfiJmHw5AIIpCb\nyGXLCg0Lj2FLXQBIaphiNg==\n-----END PRIVATE KEY-----\n",
  "client_email": "gustavious@crawler-177017.iam.gserviceaccount.com",
  "client_id": "106993710501257126771",
  "auth_uri": "https://accounts.google.com/o/oauth2/auth",
  "token_uri": "https://accounts.google.com/o/oauth2/token",
  "auth_provider_x509_cert_url": "https://www.googleapis.com/oauth2/v1/certs",
  "client_x509_cert_url": "https://www.googleapis.com/robot/v1/metadata/x509/gustavious%40crawler-177017.iam.gserviceaccount.com"
}
