firstFormID:"2F9E1D60-6896-4FC9-9310-2ED78DABACAE",
modulesNames:"geco_login,geco_authenticator,geco_core",
onOpenMethodID:"9F891A5F-5CAB-46B0-B9CA-9C9BDE7B8636",
titleText:"Geco - Personnel",
typeid:43,
uuid:"6CA630E8-84A6-40B6-A754-BD3A947376C3"