firstFormID:"FF3C21C6-6689-4E56-A44F-06CF1456ADAE",
modulesNames:"geco_core,geco_login,geco_authenticator",
onOpenMethodID:"8B55D34D-15E0-42EB-A66C-59EED22AF6C0",
typeid:43,
uuid:"E36ADF50-3193-47F5-97A5-67BAFB1EE599"