firstFormID:"D39ACD48-AFF1-4EA3-A83E-A0332608EB17",
modulesNames:"geco_login,geco_core,geco_authenticator",
onOpenMethodID:"CD5117E6-C9D1-4047-9E89-1CBF269A5E03",
titleText:"Spindox",
typeid:43,
uuid:"156FBD88-6047-4D31-9ED8-969F944CC8C0"