dataSource:"db:/geco/working_hours_week",
onInsertMethodID:"47D9ABE8-1A08-4BD9-A22F-D002E47CA22D",
onUpdateMethodID:"530E43EF-98D0-41B0-9D7D-DA4BC3BF5699",
typeid:39,
uuid:"65F809C2-198F-41B8-A98D-DA94C153F4E2"