dataSource:"db:/geco/comm_supp_customers",
onInsertMethodID:"D9B94854-34C8-4752-85C2-A2F2FE2A7E98",
onUpdateMethodID:"0A23C5D4-4385-44D1-8EAE-C9CE3E73339A",
typeid:39,
uuid:"1525B19C-CB84-4E23-92CB-7446E5789257"