[
{
mimeType:"image/png",
name:"mp_header_main.png",
typeid:37,
uuid:"0F32B354-793D-45D9-BCD2-CC0CC61092BD"
},
{
mimeType:"image/png",
name:"mp_logo_white.png",
typeid:37,
uuid:"1FB63266-3567-4F80-A92B-F02B6B75B556"
}
]