dataSource:"db:/geco/owners_profit_centers",
onDeleteMethodID:"0E17B2FF-04A8-4E4D-BE19-92D74416E556",
onInsertMethodID:"EE7EAAD1-C186-41ED-A515-7F764C2FF50F",
typeid:39,
uuid:"0559EAB2-3FFA-44EE-9585-824E7A9A81E4"