[
{
mimeType:"image/png",
name:"015_print.png",
typeid:37,
uuid:"427D389C-9FB7-4FBB-9B60-5E7F06FFEF26"
},
{
mimeType:"image/png",
name:"015_print_green.png",
typeid:37,
uuid:"DCD25FBF-F5A1-4608-ADEC-7B6B75A39704"
},
{
mimeType:"image/png",
name:"016_bin.png",
typeid:37,
uuid:"C4410AC7-097E-41A4-8A0D-7E56DCEAF68B"
},
{
mimeType:"image/png",
name:"016_bin_green.png",
typeid:37,
uuid:"5BAAC81B-BF90-4D84-BE7B-325879A0DEA2"
},
{
mimeType:"image/png",
name:"023_cogwheels.png",
typeid:37,
uuid:"82FDB7E1-764D-46ED-834A-6E9B38B4F950"
},
{
mimeType:"image/png",
name:"027_search.png",
typeid:37,
uuid:"0F5F9713-E1BC-4AC4-8772-C41FCA019653"
},
{
mimeType:"image/png",
name:"027_search_blu.png",
typeid:37,
uuid:"1C38C0A3-62D5-4E76-83DC-FB684E70057B"
},
{
mimeType:"image/png",
name:"027_search_gray.png",
typeid:37,
uuid:"B150660C-DE47-446A-8001-699BEE6F074B"
},
{
mimeType:"image/png",
name:"029_notes_2_red.png",
typeid:37,
uuid:"A645E912-3A73-47EE-9C1F-A5DDC85B3929"
},
{
mimeType:"image/png",
name:"081_refresh.png",
typeid:37,
uuid:"B432FC13-6422-4A74-956D-4474A7CD5FF0"
},
{
mimeType:"image/png",
name:"081_refresh_blue.png",
typeid:37,
uuid:"B2C0D6C5-8456-4477-BFD5-825161DD2756"
},
{
mimeType:"image/png",
name:"114_list_blu.png",
typeid:37,
uuid:"3149CE31-91C0-4AA1-AB97-64F31694692A"
},
{
mimeType:"image/png",
name:"114_list_gray.png",
typeid:37,
uuid:"B66DED96-EFE1-40BC-8E5A-4EB37A3AAE8E"
},
{
mimeType:"image/png",
name:"140_database_lock.png",
typeid:37,
uuid:"0A26B339-5F19-4460-AAC7-5886A60FD7BF"
},
{
mimeType:"image/png",
name:"140_database_lock_green.png",
typeid:37,
uuid:"1B7BDCEE-1A0B-49D9-96E0-6278B542236C"
},
{
mimeType:"image/png",
name:"150_check.png",
typeid:37,
uuid:"D7C76DB6-127D-4CDE-8857-5C8C518ED58B"
},
{
mimeType:"image/png",
name:"151_edit.png",
typeid:37,
uuid:"6CE946CC-802B-4720-BEA8-83113989DEA4"
},
{
mimeType:"image/png",
name:"151_edit_blue.png",
typeid:37,
uuid:"977B61AE-CE6B-4EC7-8DAA-EEA3126000B3"
},
{
mimeType:"image/png",
name:"152_new_window.png",
typeid:37,
uuid:"5585E506-E2FC-4F1C-B460-A08028192C71"
},
{
mimeType:"image/png",
name:"152_new_window_blu.png",
typeid:37,
uuid:"A19EBD8A-DE5F-4077-80BB-6FFFD54466AF"
},
{
mimeType:"image/png",
name:"156_show_thumbnails_with_lines_blu.png",
typeid:37,
uuid:"D89F2292-3853-4083-B230-9465DAFC9BDF"
},
{
mimeType:"image/png",
name:"156_show_thumbnails_with_lines_gray.png",
typeid:37,
uuid:"61356FAD-4D40-4BF5-BFEB-B9A78FB7EF22"
},
{
mimeType:"image/png",
name:"190_circle_plus.png",
typeid:37,
uuid:"7A86256B-E02A-4543-AD97-946114112357"
},
{
mimeType:"image/png",
name:"190_circle_plus_green.png",
typeid:37,
uuid:"7DF9F89E-6E8D-4A43-BCBD-2AB4E9E96A96"
},
{
mimeType:"image/png",
name:"191_circle_minus_gr.png",
typeid:37,
uuid:"4DE06F1A-7880-43C3-AD6B-3F3A1131AAC5"
},
{
mimeType:"image/png",
name:"191_circle_minus_red.png",
typeid:37,
uuid:"FB765AC0-60E4-4987-845E-B21C5B767847"
},
{
mimeType:"image/png",
name:"192_circle_remove.png",
typeid:37,
uuid:"42609E4C-C17A-4948-B7C2-735D570C1765"
},
{
mimeType:"image/png",
name:"197_remove.png",
typeid:37,
uuid:"D2902910-9EA5-4800-927E-232505089207"
},
{
mimeType:"image/png",
name:"197_remove_red.png",
typeid:37,
uuid:"D7A4C49C-3518-4A47-B4C2-739DB8D71C8C"
},
{
mimeType:"image/png",
name:"198_ok.png",
typeid:37,
uuid:"56D10CC3-627D-4B5C-A04F-EF1B95CBE26D"
},
{
mimeType:"image/png",
name:"198_ok_green.png",
typeid:37,
uuid:"12C599E0-550F-4F03-8748-47D95EC29AB3"
},
{
mimeType:"image/png",
name:"199_ban.png",
typeid:37,
uuid:"F6D12F9D-63AF-4F91-91C9-4B3846D4D807"
},
{
mimeType:"image/png",
name:"199_ban_orange.png",
typeid:37,
uuid:"C575BC66-B077-4824-B406-9B4705FD6EBC"
},
{
mimeType:"image/png",
name:"199_ban_red.png",
typeid:37,
uuid:"93C4599E-648A-457F-A83A-8A2B592069FB"
},
{
mimeType:"image/png",
name:"203_lock_green.png",
typeid:37,
uuid:"4A4323FB-D4B2-4AA5-AB02-2DB2611479E8"
},
{
mimeType:"image/png",
name:"319_sort.png",
typeid:37,
uuid:"AE496265-AC68-40CB-A9AC-554D5931A418"
},
{
mimeType:"image/png",
name:"319_sort_green.png",
typeid:37,
uuid:"4F58BFF6-C150-4699-86EB-2040F8ADF64A"
},
{
mimeType:"image/png",
name:"320_filter.png",
typeid:37,
uuid:"2D2BCC07-618C-4C4D-B9C6-92584D5A8910"
},
{
mimeType:"image/png",
name:"359_file_export.png",
typeid:37,
uuid:"2A98FF72-C7A0-484D-A665-DCB1EFB6E139"
},
{
mimeType:"image/png",
name:"359_file_export_green.png",
typeid:37,
uuid:"16662A6A-F25D-4B4A-A4DD-FCEC69BD3D12"
},
{
mimeType:"image/png",
name:"app_is_working_day.png",
typeid:37,
uuid:"F8B95256-852E-4B43-BA10-4A288F311378"
},
{
mimeType:"image/png",
name:"attachmentBlu.png",
typeid:37,
uuid:"F55510FE-1827-445F-B78A-ED7592CBE2C5"
},
{
mimeType:"image/png",
name:"attachmentGrey.png",
typeid:37,
uuid:"0F1AC7C4-E082-473C-B5D1-E56E3BE9DB42"
},
{
mimeType:"image/png",
name:"attachmentRed.png",
typeid:37,
uuid:"A4EE5569-435C-4247-92E2-BC0796D4D2B9"
},
{
mimeType:"image/png",
name:"bin_boxed.png",
typeid:37,
uuid:"CBEAA728-4C67-4153-AD52-DA9ABF3630ED"
},
{
mimeType:"image/png",
name:"blank.png",
typeid:37,
uuid:"F4534E03-35A3-4982-B04A-A7F2D61C9406"
},
{
mimeType:"image/png",
name:"blueprint.png",
typeid:37,
uuid:"3C333442-74C7-4BA8-B819-76565183EF90"
},
{
mimeType:"image/png",
name:"button.png",
typeid:37,
uuid:"A0135426-B853-4172-8A20-0DEE1360E30A"
},
{
mimeType:"image/png",
name:"calculator.png",
typeid:37,
uuid:"C9F7F021-0116-401E-83ED-5DC45819DAA8"
},
{
mimeType:"image/png",
name:"calculator_blu.png",
typeid:37,
uuid:"CA6164A8-7726-49BE-BF2C-493CD3C9A8DF"
},
{
mimeType:"image/png",
name:"calculator_gray.png",
typeid:37,
uuid:"9914B008-E366-4B14-9192-3935B092569F"
},
{
mimeType:"image/png",
name:"chart_blu.png",
typeid:37,
uuid:"265DF8C5-30BB-4F67-BF2B-95A8BA91559D"
},
{
mimeType:"image/png",
name:"chart_gray.png",
typeid:37,
uuid:"2C53A859-8E20-40E5-BF13-8D43CA210161"
},
{
mimeType:"image/png",
name:"check-green.png",
typeid:37,
uuid:"4F294F47-4C57-4465-B0E9-85C7A1C23F47"
},
{
mimeType:"image/png",
name:"croce.png",
typeid:37,
uuid:"70A2E638-9010-47FA-9F2B-6C04A31255A4"
},
{
mimeType:"image/png",
name:"daniela.png",
typeid:37,
uuid:"02F9475D-CFF4-4DC0-A23E-D29753A7FB90"
},
{
mimeType:"image/png",
name:"dot_black.png",
typeid:37,
uuid:"3CF27D5C-64CA-40F4-A96A-2B296C052AE3"
},
{
mimeType:"image/png",
name:"dot_blu.png",
typeid:37,
uuid:"E78BB1EC-D564-4B7B-B02D-452E4CD2CDD0"
},
{
mimeType:"image/png",
name:"dot_gray.png",
typeid:37,
uuid:"6158B9FE-12C9-4E41-B06A-1D8D7E294626"
},
{
mimeType:"image/png",
name:"dot_green.png",
typeid:37,
uuid:"EC7EA785-96A1-45CA-9A11-B7600A39150B"
},
{
mimeType:"image/png",
name:"dot_red.png",
typeid:37,
uuid:"EF68AE7B-A9D8-4C2A-88EF-4FB8608622B6"
},
{
name:"dot_red.png.1.tmp",
typeid:37,
uuid:"913F6568-753B-4848-B732-2797C86CBC4B"
},
{
name:"dot_red.png.tmp",
typeid:37,
uuid:"640F5EB1-A823-41E9-AFF5-6234C28AF22D"
},
{
mimeType:"image/png",
name:"dot_yellow.png",
typeid:37,
uuid:"95622CB6-1934-4736-AB5B-238282F27018"
},
{
mimeType:"image/png",
name:"dot_yellow2.png",
typeid:37,
uuid:"C80AA34E-98F0-4E3D-89B7-4905C5C3A51F"
},
{
mimeType:"image/png",
name:"esclamativo.png",
typeid:37,
uuid:"BE2CBB0B-3E71-41F4-BD19-B85150618D70"
},
{
mimeType:"image/png",
name:"Export.png",
typeid:37,
uuid:"DB9689AB-1BE7-48AC-BD5A-CE629BF63B5D"
},
{
mimeType:"image/png",
name:"filter/201_download.png",
typeid:37,
uuid:"F9A60759-FF84-441C-8F57-34200859C8CD"
},
{
mimeType:"image/png",
name:"filter/201_download_hover.png",
typeid:37,
uuid:"1A250942-79B8-4A0F-9081-009E599E883E"
},
{
mimeType:"image/png",
name:"filter/201_upload.png",
typeid:37,
uuid:"03F94D22-013D-4A87-85E4-CAF4070F0F22"
},
{
mimeType:"image/png",
name:"filter/201_upload_hover.png",
typeid:37,
uuid:"5876ADD3-DD1C-4956-90BA-1051EE85B5D7"
},
{
mimeType:"image/png",
name:"filter/arrow_down.png",
typeid:37,
uuid:"FEE483D9-548E-4746-8BF1-7DB73C1A10EF"
},
{
mimeType:"image/png",
name:"filter/arrow_up.png",
typeid:37,
uuid:"50A7A8D4-2B24-4628-AA6E-36CD827FF5C4"
},
{
mimeType:"image/png",
name:"freccia_green.png",
typeid:37,
uuid:"ABFDEA0F-945D-45AD-A283-65442D975701"
},
{
mimeType:"image/png",
name:"freccia_green_back.png",
typeid:37,
uuid:"92B9F681-7602-4CBB-9439-B63B476A19A3"
},
{
mimeType:"image/png",
name:"FrecciaAvantiGrigio.png",
typeid:37,
uuid:"5767A601-C181-4479-96AE-7BCC05085F81"
},
{
mimeType:"image/png",
name:"FrecciaIndietroGrigio.png",
typeid:37,
uuid:"928D4876-9054-4B95-8386-3ECBCA1D02DE"
},
{
mimeType:"image/png",
name:"gecko.png",
typeid:37,
uuid:"02F1FA70-4211-4987-9932-29EDD811055A"
},
{
mimeType:"image/png",
name:"is_overtime.png",
typeid:37,
uuid:"1E79A628-1904-4A68-A123-06899F187DA0"
},
{
mimeType:"image/png",
name:"is_working_day.png",
typeid:37,
uuid:"FE121787-00B5-4ED1-9880-A678BA386B0C"
},
{
mimeType:"image/jpeg",
name:"juan.jpg",
typeid:37,
uuid:"287DCCAE-7C77-4C49-8F9A-626EAE6BED70"
},
{
mimeType:"image/png",
name:"kchart.png",
typeid:37,
uuid:"6A76846C-5FF7-4122-845E-5733253974F1"
},
{
mimeType:"image/png",
name:"linkgGray.png",
typeid:37,
uuid:"26C2F443-2170-4155-9CA7-FE48151BF0A8"
},
{
mimeType:"image/png",
name:"linkRed.png",
typeid:37,
uuid:"D6E1AD6F-50AD-46AE-8F12-9D79B2B2384C"
},
{
mimeType:"image/png",
name:"list/016_bin.png",
typeid:37,
uuid:"0536A52B-E436-473F-B07F-61FBF1C5ADCF"
},
{
mimeType:"image/png",
name:"list/140_database_lock.png",
typeid:37,
uuid:"A623DB8C-044F-4F57-9B43-88F492D02D17"
},
{
mimeType:"image/png",
name:"list/152_new_window.png",
typeid:37,
uuid:"8CA1991B-2A15-4525-8EF6-45056244B7FC"
},
{
mimeType:"image/png",
name:"list/203_lock.png",
typeid:37,
uuid:"907A6A4C-87A6-4243-BC06-89098DA86DB7"
},
{
mimeType:"image/png",
name:"list/203_lock_green.png",
typeid:37,
uuid:"10E5D08C-033F-4411-9399-B23635D4211D"
},
{
mimeType:"image/png",
name:"list/button_add.png",
typeid:37,
uuid:"C4635651-169C-4282-8A83-537109BBB4A1"
},
{
mimeType:"image/png",
name:"list/button_add_hover.png",
typeid:37,
uuid:"236D7DC9-DA14-49D2-ACFF-ABDBED8319B5"
},
{
mimeType:"image/png",
name:"list/button_delete.png",
typeid:37,
uuid:"A7414DF4-7BC9-40C8-8800-F8366871E048"
},
{
mimeType:"image/png",
name:"list/button_delete_hover.png",
typeid:37,
uuid:"C390B8BC-0DB1-41CF-B762-539AA36DC768"
},
{
mimeType:"image/png",
name:"list/button_down.png",
typeid:37,
uuid:"F3CD1DA9-0DF8-4E65-BBF7-4E5A3030ACCA"
},
{
mimeType:"image/png",
name:"list/button_down_hover.png",
typeid:37,
uuid:"527BF7C8-9224-451C-B068-F2E582C53D4B"
},
{
mimeType:"image/png",
name:"list/button_up.png",
typeid:37,
uuid:"D151525B-3AB4-40E3-B3A3-2C63F3ECF874"
},
{
mimeType:"image/png",
name:"list/button_up_hover.png",
typeid:37,
uuid:"7BC87B85-A20F-4695-A53B-20924F32D6A7"
},
{
mimeType:"image/png",
name:"list/footer.png",
typeid:37,
uuid:"B4D155D5-12B8-4A68-8319-1FE6B0BCC7AF"
},
{
mimeType:"image/png",
name:"list_header.png",
typeid:37,
uuid:"9F1B2BB3-06A7-498D-96A3-74BE2E3CBCF1"
},
{
mimeType:"image/png",
name:"logo.png",
typeid:37,
uuid:"02D21BF3-AE4D-49E1-92E9-51A9F3AB0861"
},
{
mimeType:"image/png",
name:"logoSpx.png",
typeid:37,
uuid:"EE5ABD3C-6802-4F8C-903C-5D307C868529"
},
{
mimeType:"image/png",
name:"main/header_main.png",
typeid:37,
uuid:"C7FA7EE4-1E9F-4463-8E3F-6653AA36E1EB"
},
{
mimeType:"image/png",
name:"main/logo_orange.png",
typeid:37,
uuid:"E1F505FF-4F3E-48BC-A7CF-8184F9B5CF0F"
},
{
mimeType:"image/png",
name:"main/logo_white.png",
typeid:37,
uuid:"5C11CDBC-C497-4A57-811C-9EF1728B57FD"
},
{
mimeType:"image/png",
name:"main/selector_underline.png",
typeid:37,
uuid:"CAA7008A-7074-4FBB-8024-74788DB04C82"
},
{
mimeType:"image/png",
name:"main/selectorNav.png",
typeid:37,
uuid:"661C40FA-9481-4BC3-AE33-DC1B4F2898FB"
},
{
mimeType:"image/png",
name:"mauro.png",
typeid:37,
uuid:"DA855D0B-D1BE-4C4B-A29D-95752E2E6983"
},
{
mimeType:"image/png",
name:"nav_backward.png",
typeid:37,
uuid:"2121324E-A80A-4027-AA6C-13DC3571B24C"
},
{
mimeType:"image/png",
name:"nav_backward_blu.png",
typeid:37,
uuid:"91986F1C-746D-449C-ACAF-312DBEDC9AA6"
},
{
mimeType:"image/png",
name:"nav_backward_gray.png",
typeid:37,
uuid:"D528BC10-A4A5-4B2E-9B1F-04550A27F61A"
},
{
mimeType:"image/png",
name:"nav_forward.png",
typeid:37,
uuid:"A36CB215-422A-4071-A601-DB8DF4AD619B"
},
{
mimeType:"image/png",
name:"nav_forward_blu.png",
typeid:37,
uuid:"9B6E2A55-CD46-40AA-81B1-E02D0151FB8A"
},
{
mimeType:"image/png",
name:"nav_forward_gray.png",
typeid:37,
uuid:"697672A8-A1C7-4CBC-8574-0D6726155AB3"
},
{
mimeType:"image/png",
name:"RicalcolaRed.png",
typeid:37,
uuid:"1D6793C6-6D6C-4FDB-B18F-7C16E121DD81"
},
{
mimeType:"image/png",
name:"selectorNav.png",
typeid:37,
uuid:"D4B717DA-9812-4B9D-887F-8F98DC0F0DFA"
},
{
mimeType:"image/png",
name:"tab_selector.png",
typeid:37,
uuid:"03838FFD-00BD-4C3D-9FAF-A142C61AD40E"
},
{
mimeType:"image/png",
name:"view-icon_blu.png",
typeid:37,
uuid:"2E8FDED5-3D5C-4770-B544-185BB752B24E"
},
{
mimeType:"image/png",
name:"view-icon_gray.png",
typeid:37,
uuid:"45BB0F9B-02DF-43E2-BE8C-E2E6011569C0"
}
]