dataSource:"db:/geco/comm_supp_profit_centers",
onDeleteMethodID:"68944CC8-A72B-413F-8973-2DA7F42AF502",
onInsertMethodID:"DA6B04B1-DD98-484D-8F8D-47453AE79530",
onUpdateMethodID:"92EB51BE-F1FD-4568-A20A-1A77B15B80CC",
typeid:39,
uuid:"1CB4B426-44C6-414A-83B3-6109CCD294D0"