dataSource:"db:/pratiche_sanitarie/mp_bills",
onInsertMethodID:"0850B96E-BFF0-4325-86D4-59E82896A115",
onUpdateMethodID:"F6A61A1D-4E20-4029-A18E-069F64C54E62",
typeid:39,
uuid:"3F204E34-7770-46F4-84F0-F7BB4EAF8735"