dataSource:"db:/pratiche_sanitarie/mp_documents",
onInsertMethodID:"4401E87F-71A7-4423-8A82-2A2638AFF7A2",
onUpdateMethodID:"F9829525-32BD-4263-A363-C94886A7E7F3",
typeid:39,
uuid:"A9CDE2CF-BD1B-49F6-B90B-039CFA908FA9"