(footprint "Potenciometro22K" (version 20221018) (generator pcbnew)
  (layer "F.Cu")
  (attr through_hole)
  (fp_text reference "TH" (at 0 -0.5 unlocked) (layer "F.SilkS") hide
      (effects (font (size 1 1) (thickness 0.1)))
    (tstamp 82558505-b5c1-499c-adc6-e7acc0575a74)
  )
  (fp_text value "Potenciometro22K" (at 0 1 unlocked) (layer "F.Fab")
      (effects (font (size 1 1) (thickness 0.15)))
    (tstamp c2cb8c54-ccff-48fa-88b3-8a43f2dd5316)
  )
  (fp_text user "${REFERENCE}" (at 0 2.5 unlocked) (layer "F.Fab")
      (effects (font (size 1 1) (thickness 0.15)))
    (tstamp 0e29cbc6-a4f7-4147-b9f6-5ffea8bac9f4)
  )
  (fp_rect (start -7.62 4.445) (end 7.62 10.795)
    (stroke (width 0.1) (type default)) (fill none) (layer "F.SilkS") (tstamp 268719a5-8ca4-48b9-adfb-9d4ff21ef8f5))
  (pad "1" thru_hole circle (at -5.08 7.62) (size 4 4) (drill 1.524) (layers "*.Cu" "*.Mask") (tstamp a722e3ea-4867-42e4-98aa-56bf944122fd))
  (pad "2" thru_hole circle (at 5.08 7.62) (size 4 4) (drill 1.524) (layers "*.Cu" "*.Mask") (tstamp 7e4ead30-d989-43f9-9b9c-52874aa7a17d))
)
