NOTA 3,9


==================================
1.
5.0
- BUEN TRABAJO!!
==================================
2.

3.5

- Revisar el Calor específico, no es lo esperado!! - Ver la guia del curso
- Revisar la Magnetización, no es lo esperado!! - Ver la guia del curso


==================================
3.
----------------------------------
p1
2.5
- No funciona el 3.1
- Falta el 3.3
