NOTA 3,6


==================================
1.
3.5
- KeyError: 'nuevos_casos', El valor de la columna es "NUEVOS_CASOS", no "nuevos_casos"
==================================
2.

3.0
- El modelo no representa lo esperado en la teoría
- Favor revisar la guia del curso - modelo de Ising


==================================
3.
----------------------------------
p1
5.0
- BUEN TRABAJO!!
