../Core/Src/main.c:74:5:_write	24	static
../Core/Src/main.c:87:5:main	48	dynamic
../Core/Src/main.c:184:6:SystemClock_Config	88	static
../Core/Src/main.c:237:13:MX_ADC1_Init	24	static
../Core/Src/main.c:289:13:MX_ADC2_Init	24	static
../Core/Src/main.c:341:13:MX_DAC_Init	16	static
../Core/Src/main.c:381:13:MX_TIM1_Init	80	static
../Core/Src/main.c:445:13:MX_USART1_UART_Init	8	static
../Core/Src/main.c:476:13:MX_DMA_Init	16	static
../Core/Src/main.c:494:13:MX_GPIO_Init	24	static
../Core/Src/main.c:517:6:Error_Handler	4	static,ignoring_inline_asm
