%YAML 1.1
%TAG !u! tag:unity3d.com,2011:
--- !u!1045 &1
EditorBuildSettings:
  m_ObjectHideFlags: 0
  serializedVersion: 2
  m_Scenes:
  - enabled: 1
    path: Assets/Scenes/Level.unity
    guid: 9fc0d4010bbf28b4594072e72b8655ab
  - enabled: 1
    path: Assets/Scenes/Cityscape.unity
    guid: 5795f23112a78fe4e8a2b3816830a36a
  - enabled: 1
    path: Assets/Scenes/ShootingRange.unity
    guid: 30fe0b67b501f6c40b9db6cf79de1b13
  m_configObjects: {}
