%YAML 1.1
%TAG !u! tag:unity3d.com,2011:
--- !u!1 &2622321023580334132
GameObject:
  m_ObjectHideFlags: 0
  m_CorrespondingSourceObject: {fileID: 0}
  m_PrefabInstance: {fileID: 0}
  m_PrefabAsset: {fileID: 0}
  serializedVersion: 6
  m_Component:
  - component: {fileID: 8583067064237010164}
  - component: {fileID: 6840311578882124226}
  m_Layer: 0
  m_Name: ArmorPiercing
  m_TagString: Untagged
  m_Icon: {fileID: 0}
  m_NavMeshLayer: 0
  m_StaticEditorFlags: 0
  m_IsActive: 1
--- !u!4 &8583067064237010164
Transform:
  m_ObjectHideFlags: 0
  m_CorrespondingSourceObject: {fileID: 0}
  m_PrefabInstance: {fileID: 0}
  m_PrefabAsset: {fileID: 0}
  m_GameObject: {fileID: 2622321023580334132}
  m_LocalRotation: {x: -0, y: -0, z: -0, w: 1}
  m_LocalPosition: {x: 0, y: 0, z: 0}
  m_LocalScale: {x: 1, y: 1, z: 1}
  m_Children: []
  m_Father: {fileID: 0}
  m_RootOrder: 0
  m_LocalEulerAnglesHint: {x: 0, y: 0, z: 0}
--- !u!114 &6840311578882124226
MonoBehaviour:
  m_ObjectHideFlags: 0
  m_CorrespondingSourceObject: {fileID: 0}
  m_PrefabInstance: {fileID: 0}
  m_PrefabAsset: {fileID: 0}
  m_GameObject: {fileID: 2622321023580334132}
  m_Enabled: 1
  m_EditorHideFlags: 0
  m_Script: {fileID: 11500000, guid: 5946fd18548942a4baae505fbf4d107c, type: 3}
  m_Name: 
  m_EditorClassIdentifier: 
  AttachmentId: armor-piercing
  AttachmentType: 3
  ModifierSet:
    AttachmentId: 
    MagazineMultiplier: 0
    AimZoom: 0
    AimSpeed: 0
    AimBonus: 0
    TunnelVisionFactor: 0
    ReloadTime: 0
    Accuracy: 0
    RecoilViolence: 0
    Damage:
      FleshDamageMultiplier: 0
      ArmorDamageMultiplier: 0
      ElectricDamageMultiplier: 0
