%YAML 1.1
%TAG !u! tag:unity3d.com,2011:
--- !u!114 &11400000
MonoBehaviour:
  m_ObjectHideFlags: 0
  m_CorrespondingSourceObject: {fileID: 0}
  m_PrefabInstance: {fileID: 0}
  m_PrefabAsset: {fileID: 0}
  m_GameObject: {fileID: 0}
  m_Enabled: 1
  m_EditorHideFlags: 0
  m_Script: {fileID: 11500000, guid: e3b4c4e4a3c8f2a4689aefff0bd47807, type: 3}
  m_Name: Whitefish
  m_EditorClassIdentifier: 
  Id: whitefish
  Name: Whitefish
  Photo: {fileID: 21300000, guid: 22670c146e9d3cc4f98dfb6e1149f6be, type: 3}
  BaseWeight: 5
  BaseFishZone: 60
  BaseEscapeRate: 0.06
  BaseCatchRate: 0.36
  BaseMaxMoveSpeed: 0.3
  BaseLineDegradation: 0.6
  BaseActivityFactor: 2.3
  WeightPerLevel: 0.53
  FishZonePerLevel: 0.8
  EscapeRatePerLevel: 0.012
  CatchRatePerLevel: 0.0035
  MaxMoveSpeedPerLevel: 0.002
  LineDegradationPerLevel: 0.05
  ActivityFactorPerLevel: 0.04
