2022-12-03 21:31:58.009 [info] Added views:workbench.panel.markers.view in workbench.panel.markers
2022-12-03 21:31:58.009 [info] Added views:workbench.panel.output in workbench.panel.output
2022-12-03 21:31:58.009 [info] Added views:terminal in terminal
2022-12-03 21:31:58.009 [info] Added views:outline in workbench.view.explorer
2022-12-03 21:31:58.009 [info] Added views:workbench.scm in workbench.view.scm
2022-12-03 21:31:58.009 [info] Added views:workbench.view.search in workbench.view.search
2022-12-03 21:31:58.009 [info] Added views:timeline in workbench.view.explorer
2022-12-03 21:31:58.009 [info] Added views:workbench.explorer.emptyView in workbench.view.explorer
2022-12-03 21:31:58.009 [info] Added views:workbench.debug.variablesView,workbench.debug.watchExpressionsView,workbench.debug.callStackView,workbench.debug.breakPointsView in workbench.view.debug
2022-12-03 21:31:59.292 [info] Added views:workbench.panel.repl.view in workbench.panel.repl
2022-12-03 21:31:59.294 [info] Removed views:workbench.debug.breakPointsView,workbench.debug.callStackView,workbench.debug.watchExpressionsView,workbench.debug.variablesView from workbench.view.debug
2022-12-03 21:31:59.295 [info] Added views:workbench.debug.welcome in workbench.view.debug
