asttokens==2.2.1
backcall==0.2.0
boto3==1.26.94
botocore==1.29.94
colorama==0.4.6
comm==0.1.2
contourpy==1.0.7
cycler==0.11.0
debugpy==1.6.6
decorator==5.1.1
dill==0.3.6
executing==1.2.0
fonttools==4.38.0
install==1.3.5
ipykernel==6.21.2
ipython==8.10.0
jedi==0.18.2
jmespath==1.0.1
jupyter_client==8.0.3
jupyter_core==5.2.0
kiwisolver==1.4.4
lambdify==0.0.3
matplotlib==3.7.0
matplotlib-inline==0.1.6
mplot3d-dragger==0.0.0
mpmath==1.3.0
nest-asyncio==1.5.6
numpy==1.24.2
packaging==23.0
pandas==2.0.1
parso==0.8.3
pickleshare==0.7.5
Pillow==9.4.0
platformdirs==3.0.0
prompt-toolkit==3.0.37
psutil==5.9.4
pure-eval==0.2.2
Pygments==2.14.0
pyparsing==3.0.9
python-dateutil==2.8.2
pytz==2023.3
pywin32==305
pyzmq==25.0.0
s3transfer==0.6.0
scipy==1.10.1
six==1.16.0
stack-data==0.6.2
sympy==1.11.1
tornado==6.2
traitlets==5.9.0
tzdata==2023.3
urllib3==1.26.15
wcwidth==0.2.6
