<svg width="400" height="400" xmlns="http://www.w3.org/2000/svg">
 <style type="text/css">.st0{fill:none;stroke:#4a4a4a;stroke-width:12;stroke-miterlimit:10;}</style>

 <g>
  <title>background</title>
  <rect fill="none" id="canvas_background" height="402" width="582" y="-1" x="-1"/>
 </g>
 <g>
  <title>Layer 1</title>
  <polyline transform="rotate(-179.9764862060547 193.10000610351565,199.9999847412109) " points="100.19999694824219,14.199999809265137 286,200 100.19999694824219,385.79998779296875 " class="st0" id="XMLID_12299_"/>
 </g>
</svg>