<?xml version="1.0" encoding="UTF-8" standalone="no"?>
<svg width="15px" height="10px" viewBox="0 0 15 10" version="1.1" xmlns="http://www.w3.org/2000/svg" xmlns:xlink="http://www.w3.org/1999/xlink">
    <!-- Generator: Sketch 46.2 (44496) - http://www.bohemiancoding.com/sketch -->
    <title>Page 1</title>
    <desc>Created with Sketch.</desc>
    <defs></defs>
    <g id="Pattern-Library" stroke="none" stroke-width="1" fill="none" fill-rule="evenodd">
        <g id="Component1" transform="translate(-564.000000, -324.000000)" stroke-width="2.44703247" stroke="#FFFAF0">
            <g id="Group" transform="translate(198.000000, 306.000000)">
                <polyline id="Page-1" transform="translate(373.267300, 22.481833) rotate(180.000000) translate(-373.267300, -22.481833) " points="367 25.9636667 373.267232 19 379.5346 25.9636667"></polyline>
            </g>
        </g>
    </g>
</svg>