<?xml version="1.0" encoding="utf-8"?>
<!-- Generator: Adobe Illustrator 19.0.0, SVG Export Plug-In . SVG Version: 6.00 Build 0)  -->
<svg version="1.1" id="Layer_1" xmlns="http://www.w3.org/2000/svg" xmlns:xlink="http://www.w3.org/1999/xlink" x="0px" y="0px"
	 width="1901.5px" height="64.7px" viewBox="0 0 1901.5 64.7" style="enable-background:new 0 0 1901.5 64.7;" xml:space="preserve"
	>
<style type="text/css">
	.st0{fill:#FFFFFF;}
</style>
<g id="XMLID_145_">
	<polygon id="XMLID_2629_" points="1901.5,40.7 1232.5,40.7 1208.5,64.7 702.4,64.7 679.6,41.9 0,41.9 0,3.1 1901.5,3.1 	"/>
	<polygon id="XMLID_2628_" class="st0" points="1901.5,37.6 1232.5,37.6 1208.5,61.6 702.4,61.6 679.6,38.8 0,38.8 0,0 1901.5,0
		"/>
</g>
</svg>
