service_id,monday,tuesday,wednesday,thursday,friday,saturday,sunday,start_date,end_date                                                               
1013L,1,0,0,0,0,0,0,20221017,20221017                                                                                                                 
1014M,0,1,0,0,0,0,0,20221018,20221018                                                                                                                 
1015X,0,0,1,0,0,0,0,20221019,20221019                                                                                                                 
1016J,0,0,0,1,0,0,0,20221020,20221020                                                                                                                 
1017V,0,0,0,0,1,0,0,20221021,20221021                                                                                                                 
1018S,0,0,0,0,0,1,0,20221022,20221022                                                                                                                 
1019D,0,0,0,0,0,0,1,20221023,20221023                                                                                                                 
1020L,1,0,0,0,0,0,0,20221024,20221024                                                                                                                 
1021M,0,1,0,0,0,0,0,20221025,20221025                                                                                                                 
1022X,0,0,1,0,0,0,0,20221026,20221026                                                                                                                 
1023J,0,0,0,1,0,0,0,20221027,20221027                                                                                                                 
1024V,0,0,0,0,1,0,0,20221028,20221028                                                                                                                 
1025S,0,0,0,0,0,1,0,20221029,20221029                                                                                                                 
1026D,0,0,0,0,0,0,1,20221030,20221030                                                                                                                 
1027L,1,0,0,0,0,0,0,20221031,20221031                                                                                                                 
1028M,0,1,0,0,0,0,0,20221101,20221101                                                                                                                 
1029X,0,0,1,0,0,0,0,20221102,20221102                                                                                                                 
1030J,0,0,0,1,0,0,0,20221103,20221103                                                                                                                 
1031V,0,0,0,0,1,0,0,20221104,20221104                                                                                                                 
1032S,0,0,0,0,0,1,0,20221105,20221105                                                                                                                 
1033D,0,0,0,0,0,0,1,20221106,20221106                                                                                                                 
1034L,1,0,0,0,0,0,0,20221107,20221107                                                                                                                 
1035M,0,1,0,0,0,0,0,20221108,20221108                                                                                                                 
1036X,0,0,1,0,0,0,0,20221109,20221109                                                                                                                 
1037J,0,0,0,1,0,0,0,20221110,20221110                                                                                                                 
1038V,0,0,0,0,1,0,0,20221111,20221111                                                                                                                 
1039S,0,0,0,0,0,1,0,20221112,20221112                                                                                                                 
1040D,0,0,0,0,0,0,1,20221113,20221113                                                                                                                 
1041L,1,0,0,0,0,0,0,20221114,20221114                                                                                                                 
1042M,0,1,0,0,0,0,0,20221115,20221115                                                                                                                 
1043X,0,0,1,0,0,0,0,20221116,20221116                                                                                                                 
2013L,1,0,0,0,0,0,0,20221017,20221017                                                                                                                 
2014M,0,1,0,0,0,0,0,20221018,20221018                                                                                                                 
2015X,0,0,1,0,0,0,0,20221019,20221019                                                                                                                 
2016J,0,0,0,1,0,0,0,20221020,20221020                                                                                                                 
2017V,0,0,0,0,1,0,0,20221021,20221021                                                                                                                 
2018S,0,0,0,0,0,1,0,20221022,20221022                                                                                                                 
2019D,0,0,0,0,0,0,1,20221023,20221023                                                                                                                 
2020L,1,0,0,0,0,0,0,20221024,20221024                                                                                                                 
2021M,0,1,0,0,0,0,0,20221025,20221025                                                                                                                 
2022X,0,0,1,0,0,0,0,20221026,20221026                                                                                                                 
2023J,0,0,0,1,0,0,0,20221027,20221027                                                                                                                 
2024V,0,0,0,0,1,0,0,20221028,20221028                                                                                                                 
2025S,0,0,0,0,0,1,0,20221029,20221029                                                                                                                 
2026D,0,0,0,0,0,0,1,20221030,20221030                                                                                                                 
2027L,1,0,0,0,0,0,0,20221031,20221031                                                                                                                 
2028M,0,1,0,0,0,0,0,20221101,20221101                                                                                                                 
2029X,0,0,1,0,0,0,0,20221102,20221102                                                                                                                 
2030J,0,0,0,1,0,0,0,20221103,20221103                                                                                                                 
2031V,0,0,0,0,1,0,0,20221104,20221104                                                                                                                 
2032S,0,0,0,0,0,1,0,20221105,20221105                                                                                                                 
2033D,0,0,0,0,0,0,1,20221106,20221106                                                                                                                 
2034L,1,0,0,0,0,0,0,20221107,20221107                                                                                                                 
2035M,0,1,0,0,0,0,0,20221108,20221108                                                                                                                 
2036X,0,0,1,0,0,0,0,20221109,20221109                                                                                                                 
2037J,0,0,0,1,0,0,0,20221110,20221110                                                                                                                 
2038V,0,0,0,0,1,0,0,20221111,20221111                                                                                                                 
2039S,0,0,0,0,0,1,0,20221112,20221112                                                                                                                 
2040D,0,0,0,0,0,0,1,20221113,20221113                                                                                                                 
2041L,1,0,0,0,0,0,0,20221114,20221114                                                                                                                 
2042M,0,1,0,0,0,0,0,20221115,20221115                                                                                                                 
2043X,0,0,1,0,0,0,0,20221116,20221116                                                                                                                 
3013L,1,0,0,0,0,0,0,20221017,20221017                                                                                                                 
3014M,0,1,0,0,0,0,0,20221018,20221018                                                                                                                 
3015X,0,0,1,0,0,0,0,20221019,20221019                                                                                                                 
3016J,0,0,0,1,0,0,0,20221020,20221020                                                                                                                 
3017V,0,0,0,0,1,0,0,20221021,20221021                                                                                                                 
3018S,0,0,0,0,0,1,0,20221022,20221022                                                                                                                 
3019D,0,0,0,0,0,0,1,20221023,20221023                                                                                                                 
3020L,1,0,0,0,0,0,0,20221024,20221024                                                                                                                 
3021M,0,1,0,0,0,0,0,20221025,20221025                                                                                                                 
3022X,0,0,1,0,0,0,0,20221026,20221026                                                                                                                 
3023J,0,0,0,1,0,0,0,20221027,20221027                                                                                                                 
3024V,0,0,0,0,1,0,0,20221028,20221028                                                                                                                 
3025S,0,0,0,0,0,1,0,20221029,20221029                                                                                                                 
3026D,0,0,0,0,0,0,1,20221030,20221030                                                                                                                 
3027L,1,0,0,0,0,0,0,20221031,20221031                                                                                                                 
3028M,0,1,0,0,0,0,0,20221101,20221101                                                                                                                 
3029X,0,0,1,0,0,0,0,20221102,20221102                                                                                                                 
3030J,0,0,0,1,0,0,0,20221103,20221103                                                                                                                 
3031V,0,0,0,0,1,0,0,20221104,20221104                                                                                                                 
3032S,0,0,0,0,0,1,0,20221105,20221105                                                                                                                 
3033D,0,0,0,0,0,0,1,20221106,20221106                                                                                                                 
3034L,1,0,0,0,0,0,0,20221107,20221107                                                                                                                 
3035M,0,1,0,0,0,0,0,20221108,20221108                                                                                                                 
3036X,0,0,1,0,0,0,0,20221109,20221109                                                                                                                 
3037J,0,0,0,1,0,0,0,20221110,20221110                                                                                                                 
3038V,0,0,0,0,1,0,0,20221111,20221111                                                                                                                 
3039S,0,0,0,0,0,1,0,20221112,20221112                                                                                                                 
3040D,0,0,0,0,0,0,1,20221113,20221113                                                                                                                 
3041L,1,0,0,0,0,0,0,20221114,20221114                                                                                                                 
3042M,0,1,0,0,0,0,0,20221115,20221115                                                                                                                 
3043X,0,0,1,0,0,0,0,20221116,20221116                                                                                                                 
3113L,1,0,0,0,0,0,0,20221017,20221017                                                                                                                 
3114M,0,1,0,0,0,0,0,20221018,20221018                                                                                                                 
3115X,0,0,1,0,0,0,0,20221019,20221019                                                                                                                 
3116J,0,0,0,1,0,0,0,20221020,20221020                                                                                                                 
3117V,0,0,0,0,1,0,0,20221021,20221021                                                                                                                 
3118S,0,0,0,0,0,1,0,20221022,20221022                                                                                                                 
3119D,0,0,0,0,0,0,1,20221023,20221023                                                                                                                 
3120L,1,0,0,0,0,0,0,20221024,20221024                                                                                                                 
3121M,0,1,0,0,0,0,0,20221025,20221025                                                                                                                 
3122X,0,0,1,0,0,0,0,20221026,20221026                                                                                                                 
3123J,0,0,0,1,0,0,0,20221027,20221027                                                                                                                 
3124V,0,0,0,0,1,0,0,20221028,20221028                                                                                                                 
3125S,0,0,0,0,0,1,0,20221029,20221029                                                                                                                 
3126D,0,0,0,0,0,0,1,20221030,20221030                                                                                                                 
3127L,1,0,0,0,0,0,0,20221031,20221031                                                                                                                 
3128M,0,1,0,0,0,0,0,20221101,20221101                                                                                                                 
3129X,0,0,1,0,0,0,0,20221102,20221102                                                                                                                 
3130J,0,0,0,1,0,0,0,20221103,20221103                                                                                                                 
3131V,0,0,0,0,1,0,0,20221104,20221104                                                                                                                 
3132S,0,0,0,0,0,1,0,20221105,20221105                                                                                                                 
3133D,0,0,0,0,0,0,1,20221106,20221106                                                                                                                 
3134L,1,0,0,0,0,0,0,20221107,20221107                                                                                                                 
3135M,0,1,0,0,0,0,0,20221108,20221108                                                                                                                 
3136X,0,0,1,0,0,0,0,20221109,20221109                                                                                                                 
3137J,0,0,0,1,0,0,0,20221110,20221110                                                                                                                 
3138V,0,0,0,0,1,0,0,20221111,20221111                                                                                                                 
3139S,0,0,0,0,0,1,0,20221112,20221112                                                                                                                 
3140D,0,0,0,0,0,0,1,20221113,20221113                                                                                                                 
3141L,1,0,0,0,0,0,0,20221114,20221114                                                                                                                 
3142M,0,1,0,0,0,0,0,20221115,20221115                                                                                                                 
3143X,0,0,1,0,0,0,0,20221116,20221116                                                                                                                 
3213L,1,0,0,0,0,0,0,20221017,20221017                                                                                                                 
3214M,0,1,0,0,0,0,0,20221018,20221018                                                                                                                 
3215X,0,0,1,0,0,0,0,20221019,20221019                                                                                                                 
3216J,0,0,0,1,0,0,0,20221020,20221020                                                                                                                 
3217V,0,0,0,0,1,0,0,20221021,20221021                                                                                                                 
3218S,0,0,0,0,0,1,0,20221022,20221022                                                                                                                 
3219D,0,0,0,0,0,0,1,20221023,20221023                                                                                                                 
3220L,1,0,0,0,0,0,0,20221024,20221024                                                                                                                 
3221M,0,1,0,0,0,0,0,20221025,20221025                                                                                                                 
3222X,0,0,1,0,0,0,0,20221026,20221026                                                                                                                 
3223J,0,0,0,1,0,0,0,20221027,20221027                                                                                                                 
3224V,0,0,0,0,1,0,0,20221028,20221028                                                                                                                 
3225S,0,0,0,0,0,1,0,20221029,20221029                                                                                                                 
3226D,0,0,0,0,0,0,1,20221030,20221030                                                                                                                 
3227L,1,0,0,0,0,0,0,20221031,20221031                                                                                                                 
3228M,0,1,0,0,0,0,0,20221101,20221101                                                                                                                 
3229X,0,0,1,0,0,0,0,20221102,20221102                                                                                                                 
3230J,0,0,0,1,0,0,0,20221103,20221103                                                                                                                 
3231V,0,0,0,0,1,0,0,20221104,20221104                                                                                                                 
3232S,0,0,0,0,0,1,0,20221105,20221105                                                                                                                 
3233D,0,0,0,0,0,0,1,20221106,20221106                                                                                                                 
3234L,1,0,0,0,0,0,0,20221107,20221107                                                                                                                 
3235M,0,1,0,0,0,0,0,20221108,20221108                                                                                                                 
3236X,0,0,1,0,0,0,0,20221109,20221109                                                                                                                 
3237J,0,0,0,1,0,0,0,20221110,20221110                                                                                                                 
3238V,0,0,0,0,1,0,0,20221111,20221111                                                                                                                 
3239S,0,0,0,0,0,1,0,20221112,20221112                                                                                                                 
3240D,0,0,0,0,0,0,1,20221113,20221113                                                                                                                 
3241L,1,0,0,0,0,0,0,20221114,20221114                                                                                                                 
3242M,0,1,0,0,0,0,0,20221115,20221115                                                                                                                 
3243X,0,0,1,0,0,0,0,20221116,20221116                                                                                                                 
4013L,1,0,0,0,0,0,0,20221017,20221017                                                                                                                 
4014M,0,1,0,0,0,0,0,20221018,20221018                                                                                                                 
4015X,0,0,1,0,0,0,0,20221019,20221019                                                                                                                 
4016J,0,0,0,1,0,0,0,20221020,20221020                                                                                                                 
4017V,0,0,0,0,1,0,0,20221021,20221021                                                                                                                 
4018S,0,0,0,0,0,1,0,20221022,20221022                                                                                                                 
4019D,0,0,0,0,0,0,1,20221023,20221023                                                                                                                 
4020L,1,0,0,0,0,0,0,20221024,20221024                                                                                                                 
4021M,0,1,0,0,0,0,0,20221025,20221025                                                                                                                 
4022X,0,0,1,0,0,0,0,20221026,20221026                                                                                                                 
4023J,0,0,0,1,0,0,0,20221027,20221027                                                                                                                 
4024V,0,0,0,0,1,0,0,20221028,20221028                                                                                                                 
4025S,0,0,0,0,0,1,0,20221029,20221029                                                                                                                 
4026D,0,0,0,0,0,0,1,20221030,20221030                                                                                                                 
4027L,1,0,0,0,0,0,0,20221031,20221031                                                                                                                 
4028M,0,1,0,0,0,0,0,20221101,20221101                                                                                                                 
4029X,0,0,1,0,0,0,0,20221102,20221102                                                                                                                 
4030J,0,0,0,1,0,0,0,20221103,20221103                                                                                                                 
4031V,0,0,0,0,1,0,0,20221104,20221104                                                                                                                 
4032S,0,0,0,0,0,1,0,20221105,20221105                                                                                                                 
4033D,0,0,0,0,0,0,1,20221106,20221106                                                                                                                 
4034L,1,0,0,0,0,0,0,20221107,20221107                                                                                                                 
4035M,0,1,0,0,0,0,0,20221108,20221108                                                                                                                 
4036X,0,0,1,0,0,0,0,20221109,20221109                                                                                                                 
4037J,0,0,0,1,0,0,0,20221110,20221110                                                                                                                 
4038V,0,0,0,0,1,0,0,20221111,20221111                                                                                                                 
4039S,0,0,0,0,0,1,0,20221112,20221112                                                                                                                 
4040D,0,0,0,0,0,0,1,20221113,20221113                                                                                                                 
4041L,1,0,0,0,0,0,0,20221114,20221114                                                                                                                 
4042M,0,1,0,0,0,0,0,20221115,20221115                                                                                                                 
4043X,0,0,1,0,0,0,0,20221116,20221116                                                                                                                 
4113L,1,0,0,0,0,0,0,20221017,20221017                                                                                                                 
4114M,0,1,0,0,0,0,0,20221018,20221018                                                                                                                 
4115X,0,0,1,0,0,0,0,20221019,20221019                                                                                                                 
4116J,0,0,0,1,0,0,0,20221020,20221020                                                                                                                 
4117V,0,0,0,0,1,0,0,20221021,20221021                                                                                                                 
4118S,0,0,0,0,0,1,0,20221022,20221022                                                                                                                 
4119D,0,0,0,0,0,0,1,20221023,20221023                                                                                                                 
4120L,1,0,0,0,0,0,0,20221024,20221024                                                                                                                 
4121M,0,1,0,0,0,0,0,20221025,20221025                                                                                                                 
4122X,0,0,1,0,0,0,0,20221026,20221026                                                                                                                 
4123J,0,0,0,1,0,0,0,20221027,20221027                                                                                                                 
4124V,0,0,0,0,1,0,0,20221028,20221028                                                                                                                 
4125S,0,0,0,0,0,1,0,20221029,20221029                                                                                                                 
4126D,0,0,0,0,0,0,1,20221030,20221030                                                                                                                 
4127L,1,0,0,0,0,0,0,20221031,20221031                                                                                                                 
4128M,0,1,0,0,0,0,0,20221101,20221101                                                                                                                 
4129X,0,0,1,0,0,0,0,20221102,20221102                                                                                                                 
4130J,0,0,0,1,0,0,0,20221103,20221103                                                                                                                 
4131V,0,0,0,0,1,0,0,20221104,20221104                                                                                                                 
4132S,0,0,0,0,0,1,0,20221105,20221105                                                                                                                 
4133D,0,0,0,0,0,0,1,20221106,20221106                                                                                                                 
4134L,1,0,0,0,0,0,0,20221107,20221107                                                                                                                 
4135M,0,1,0,0,0,0,0,20221108,20221108                                                                                                                 
4136X,0,0,1,0,0,0,0,20221109,20221109                                                                                                                 
4137J,0,0,0,1,0,0,0,20221110,20221110                                                                                                                 
4138V,0,0,0,0,1,0,0,20221111,20221111                                                                                                                 
4139S,0,0,0,0,0,1,0,20221112,20221112                                                                                                                 
4140D,0,0,0,0,0,0,1,20221113,20221113                                                                                                                 
4141L,1,0,0,0,0,0,0,20221114,20221114                                                                                                                 
4142M,0,1,0,0,0,0,0,20221115,20221115                                                                                                                 
4143X,0,0,1,0,0,0,0,20221116,20221116                                                                                                                 
5013L,1,0,0,0,0,0,0,20221017,20221017                                                                                                                 
5014M,0,1,0,0,0,0,0,20221018,20221018                                                                                                                 
5015X,0,0,1,0,0,0,0,20221019,20221019                                                                                                                 
5016J,0,0,0,1,0,0,0,20221020,20221020                                                                                                                 
5017V,0,0,0,0,1,0,0,20221021,20221021                                                                                                                 
5018S,0,0,0,0,0,1,0,20221022,20221022                                                                                                                 
5019D,0,0,0,0,0,0,1,20221023,20221023                                                                                                                 
5020L,1,0,0,0,0,0,0,20221024,20221024                                                                                                                 
5021M,0,1,0,0,0,0,0,20221025,20221025                                                                                                                 
5022X,0,0,1,0,0,0,0,20221026,20221026                                                                                                                 
5023J,0,0,0,1,0,0,0,20221027,20221027                                                                                                                 
5024V,0,0,0,0,1,0,0,20221028,20221028                                                                                                                 
5025S,0,0,0,0,0,1,0,20221029,20221029                                                                                                                 
5026D,0,0,0,0,0,0,1,20221030,20221030                                                                                                                 
5027L,1,0,0,0,0,0,0,20221031,20221031                                                                                                                 
5028M,0,1,0,0,0,0,0,20221101,20221101                                                                                                                 
5029X,0,0,1,0,0,0,0,20221102,20221102                                                                                                                 
5030J,0,0,0,1,0,0,0,20221103,20221103                                                                                                                 
5031V,0,0,0,0,1,0,0,20221104,20221104                                                                                                                 
5032S,0,0,0,0,0,1,0,20221105,20221105                                                                                                                 
5033D,0,0,0,0,0,0,1,20221106,20221106                                                                                                                 
5034L,1,0,0,0,0,0,0,20221107,20221107                                                                                                                 
5035M,0,1,0,0,0,0,0,20221108,20221108                                                                                                                 
5036X,0,0,1,0,0,0,0,20221109,20221109                                                                                                                 
5037J,0,0,0,1,0,0,0,20221110,20221110                                                                                                                 
5038V,0,0,0,0,1,0,0,20221111,20221111                                                                                                                 
5039S,0,0,0,0,0,1,0,20221112,20221112                                                                                                                 
5040D,0,0,0,0,0,0,1,20221113,20221113                                                                                                                 
5041L,1,0,0,0,0,0,0,20221114,20221114                                                                                                                 
5042M,0,1,0,0,0,0,0,20221115,20221115                                                                                                                 
5043X,0,0,1,0,0,0,0,20221116,20221116                                                                                                                 
6013L,1,0,0,0,0,0,0,20221017,20221017                                                                                                                 
6014M,0,1,0,0,0,0,0,20221018,20221018                                                                                                                 
6015X,0,0,1,0,0,0,0,20221019,20221019                                                                                                                 
6016J,0,0,0,1,0,0,0,20221020,20221020                                                                                                                 
6017V,0,0,0,0,1,0,0,20221021,20221021                                                                                                                 
6018S,0,0,0,0,0,1,0,20221022,20221022                                                                                                                 
6019D,0,0,0,0,0,0,1,20221023,20221023                                                                                                                 
6020L,1,0,0,0,0,0,0,20221024,20221024                                                                                                                 
6021M,0,1,0,0,0,0,0,20221025,20221025                                                                                                                 
6022X,0,0,1,0,0,0,0,20221026,20221026                                                                                                                 
6023J,0,0,0,1,0,0,0,20221027,20221027                                                                                                                 
6024V,0,0,0,0,1,0,0,20221028,20221028                                                                                                                 
6025S,0,0,0,0,0,1,0,20221029,20221029                                                                                                                 
6026D,0,0,0,0,0,0,1,20221030,20221030                                                                                                                 
6027L,1,0,0,0,0,0,0,20221031,20221031                                                                                                                 
6028M,0,1,0,0,0,0,0,20221101,20221101                                                                                                                 
6029X,0,0,1,0,0,0,0,20221102,20221102                                                                                                                 
6030J,0,0,0,1,0,0,0,20221103,20221103                                                                                                                 
6031V,0,0,0,0,1,0,0,20221104,20221104                                                                                                                 
6032S,0,0,0,0,0,1,0,20221105,20221105                                                                                                                 
6033D,0,0,0,0,0,0,1,20221106,20221106                                                                                                                 
6034L,1,0,0,0,0,0,0,20221107,20221107                                                                                                                 
6035M,0,1,0,0,0,0,0,20221108,20221108                                                                                                                 
6036X,0,0,1,0,0,0,0,20221109,20221109                                                                                                                 
6037J,0,0,0,1,0,0,0,20221110,20221110                                                                                                                 
6038V,0,0,0,0,1,0,0,20221111,20221111                                                                                                                 
6039S,0,0,0,0,0,1,0,20221112,20221112                                                                                                                 
6040D,0,0,0,0,0,0,1,20221113,20221113                                                                                                                 
6041L,1,0,0,0,0,0,0,20221114,20221114                                                                                                                 
6042M,0,1,0,0,0,0,0,20221115,20221115                                                                                                                 
6043X,0,0,1,0,0,0,0,20221116,20221116                                                                                                                 
6113L,1,0,0,0,0,0,0,20221017,20221017                                                                                                                 
6114M,0,1,0,0,0,0,0,20221018,20221018                                                                                                                 
6115X,0,0,1,0,0,0,0,20221019,20221019                                                                                                                 
6116J,0,0,0,1,0,0,0,20221020,20221020                                                                                                                 
6117V,0,0,0,0,1,0,0,20221021,20221021                                                                                                                 
6118S,0,0,0,0,0,1,0,20221022,20221022                                                                                                                 
6119D,0,0,0,0,0,0,1,20221023,20221023                                                                                                                 
6120L,1,0,0,0,0,0,0,20221024,20221024                                                                                                                 
6121M,0,1,0,0,0,0,0,20221025,20221025                                                                                                                 
6122X,0,0,1,0,0,0,0,20221026,20221026                                                                                                                 
6123J,0,0,0,1,0,0,0,20221027,20221027                                                                                                                 
6124V,0,0,0,0,1,0,0,20221028,20221028                                                                                                                 
6125S,0,0,0,0,0,1,0,20221029,20221029                                                                                                                 
6126D,0,0,0,0,0,0,1,20221030,20221030                                                                                                                 
6127L,1,0,0,0,0,0,0,20221031,20221031                                                                                                                 
6128M,0,1,0,0,0,0,0,20221101,20221101                                                                                                                 
6129X,0,0,1,0,0,0,0,20221102,20221102                                                                                                                 
6130J,0,0,0,1,0,0,0,20221103,20221103                                                                                                                 
6131V,0,0,0,0,1,0,0,20221104,20221104                                                                                                                 
6132S,0,0,0,0,0,1,0,20221105,20221105                                                                                                                 
6133D,0,0,0,0,0,0,1,20221106,20221106                                                                                                                 
6134L,1,0,0,0,0,0,0,20221107,20221107                                                                                                                 
6135M,0,1,0,0,0,0,0,20221108,20221108                                                                                                                 
6136X,0,0,1,0,0,0,0,20221109,20221109                                                                                                                 
6137J,0,0,0,1,0,0,0,20221110,20221110                                                                                                                 
6138V,0,0,0,0,1,0,0,20221111,20221111                                                                                                                 
6139S,0,0,0,0,0,1,0,20221112,20221112                                                                                                                 
6140D,0,0,0,0,0,0,1,20221113,20221113                                                                                                                 
6141L,1,0,0,0,0,0,0,20221114,20221114                                                                                                                 
6142M,0,1,0,0,0,0,0,20221115,20221115                                                                                                                 
6143X,0,0,1,0,0,0,0,20221116,20221116                                                                                                                 
6213L,1,0,0,0,0,0,0,20221017,20221017                                                                                                                 
6214M,0,1,0,0,0,0,0,20221018,20221018                                                                                                                 
6215X,0,0,1,0,0,0,0,20221019,20221019                                                                                                                 
6216J,0,0,0,1,0,0,0,20221020,20221020                                                                                                                 
6217V,0,0,0,0,1,0,0,20221021,20221021                                                                                                                 
6218S,0,0,0,0,0,1,0,20221022,20221022                                                                                                                 
6219D,0,0,0,0,0,0,1,20221023,20221023                                                                                                                 
6220L,1,0,0,0,0,0,0,20221024,20221024                                                                                                                 
6221M,0,1,0,0,0,0,0,20221025,20221025                                                                                                                 
6222X,0,0,1,0,0,0,0,20221026,20221026                                                                                                                 
6223J,0,0,0,1,0,0,0,20221027,20221027                                                                                                                 
6224V,0,0,0,0,1,0,0,20221028,20221028                                                                                                                 
6225S,0,0,0,0,0,1,0,20221029,20221029                                                                                                                 
6226D,0,0,0,0,0,0,1,20221030,20221030                                                                                                                 
6227L,1,0,0,0,0,0,0,20221031,20221031                                                                                                                 
6228M,0,1,0,0,0,0,0,20221101,20221101                                                                                                                 
6229X,0,0,1,0,0,0,0,20221102,20221102                                                                                                                 
6230J,0,0,0,1,0,0,0,20221103,20221103                                                                                                                 
6231V,0,0,0,0,1,0,0,20221104,20221104                                                                                                                 
6232S,0,0,0,0,0,1,0,20221105,20221105                                                                                                                 
6233D,0,0,0,0,0,0,1,20221106,20221106                                                                                                                 
6234L,1,0,0,0,0,0,0,20221107,20221107                                                                                                                 
6235M,0,1,0,0,0,0,0,20221108,20221108                                                                                                                 
6236X,0,0,1,0,0,0,0,20221109,20221109                                                                                                                 
6237J,0,0,0,1,0,0,0,20221110,20221110                                                                                                                 
6238V,0,0,0,0,1,0,0,20221111,20221111                                                                                                                 
6239S,0,0,0,0,0,1,0,20221112,20221112                                                                                                                 
6240D,0,0,0,0,0,0,1,20221113,20221113                                                                                                                 
6241L,1,0,0,0,0,0,0,20221114,20221114                                                                                                                 
6242M,0,1,0,0,0,0,0,20221115,20221115                                                                                                                 
6243X,0,0,1,0,0,0,0,20221116,20221116                                                                                                                 
7013L,1,0,0,0,0,0,0,20221017,20221017                                                                                                                 
7014M,0,1,0,0,0,0,0,20221018,20221018                                                                                                                 
7015X,0,0,1,0,0,0,0,20221019,20221019                                                                                                                 
7016J,0,0,0,1,0,0,0,20221020,20221020                                                                                                                 
7017V,0,0,0,0,1,0,0,20221021,20221021                                                                                                                 
7018S,0,0,0,0,0,1,0,20221022,20221022                                                                                                                 
7019D,0,0,0,0,0,0,1,20221023,20221023                                                                                                                 
7020L,1,0,0,0,0,0,0,20221024,20221024                                                                                                                 
7021M,0,1,0,0,0,0,0,20221025,20221025                                                                                                                 
7022X,0,0,1,0,0,0,0,20221026,20221026                                                                                                                 
7023J,0,0,0,1,0,0,0,20221027,20221027                                                                                                                 
7024V,0,0,0,0,1,0,0,20221028,20221028                                                                                                                 
7025S,0,0,0,0,0,1,0,20221029,20221029                                                                                                                 
7026D,0,0,0,0,0,0,1,20221030,20221030                                                                                                                 
7027L,1,0,0,0,0,0,0,20221031,20221031                                                                                                                 
7028M,0,1,0,0,0,0,0,20221101,20221101                                                                                                                 
7029X,0,0,1,0,0,0,0,20221102,20221102                                                                                                                 
7030J,0,0,0,1,0,0,0,20221103,20221103                                                                                                                 
7031V,0,0,0,0,1,0,0,20221104,20221104                                                                                                                 
7032S,0,0,0,0,0,1,0,20221105,20221105                                                                                                                 
7033D,0,0,0,0,0,0,1,20221106,20221106                                                                                                                 
7034L,1,0,0,0,0,0,0,20221107,20221107                                                                                                                 
7035M,0,1,0,0,0,0,0,20221108,20221108                                                                                                                 
7036X,0,0,1,0,0,0,0,20221109,20221109                                                                                                                 
7037J,0,0,0,1,0,0,0,20221110,20221110                                                                                                                 
7038V,0,0,0,0,1,0,0,20221111,20221111                                                                                                                 
7039S,0,0,0,0,0,1,0,20221112,20221112                                                                                                                 
7040D,0,0,0,0,0,0,1,20221113,20221113                                                                                                                 
7041L,1,0,0,0,0,0,0,20221114,20221114                                                                                                                 
7042M,0,1,0,0,0,0,0,20221115,20221115                                                                                                                 
7043X,0,0,1,0,0,0,0,20221116,20221116