{
  "compilerOptions": {
    "baseUrl": ".",
    "paths": {
      "@database": [
        "database/db.js"
      ],
      "@components/*": [
        "components/*"
      ],
      
    }
  }
}