{
    "cryptocoins": [
        {
            "type": "cryptocoin",
            "attributes": {
                "symbol": "BTC",
                "name": "Bitcoin",
                "sort": 10,
                "asset_type_name": "cryptocoin",
                "asset_group_name": "coin",
                "url_check_address": "https://www.blockchain.com/btc/address/%s",
                "url_check_transaction": "https://www.blockchain.com/btc/tx/%s",
                "buy_active": true,
                "sell_active": true,
                "withdraw_active": true,
                "deposit_active": true,
                "transfer_active": true,
                "available": true,
                "maintenance_enabled": false,
                "min_buy_eur": "0.06",
                "min_sell_eur": "1",
                "min_withdraw_eur": "8.94",
                "default_sell_amount": "1",
                "precision_for_fiat_price": 2,
                "precision_for_coins": 4,
                "precision_for_tx": 8,
                "wallet_min_deposit": "0.05000000",
                "wallet_small_deposit": "0.05000000",
                "wallet_small_deposit_fee": "0.00010000",
                "avg_price": "8936.50",
                "color": "#F7931A",
                "wallet_withdraw_fee": "0.0000300000000000",
                "change_24h": "-3.0714208301723",
                "change_24h_amount": "-283.18",
                "change_1w": "5.946739954511",
                "change_1w_amount": "501.60",
                "change_1m": "23.066338254923",
                "change_1m_amount": "1674.97",
                "change_1y": "179.11244265518",
                "change_1y_amount": "5734.74",
                "logo": "https://bitpanda-assets.s3-eu-west-1.amazonaws.com/static/cryptocoin/btc.svg",
                "logo_dark": "https://bitpanda-assets.s3-eu-west-1.amazonaws.com/static/cryptocoin/btc_dark.svg",
                "support_destination_tag": false,
                "android_supported_version": "0.0.1",
                "ios_supported_version": "1.0.0",
                "circulating_supply": "18209712.00000000",
                "allowed_unverified": false,
                "allowed_documented": true,
                "allowed_verified": true,
                "ieo_phases": [],
                "info": "",
                "unavailable_reason": "Wallet under maintenance due to an update. We are working hard to bring it back online as soon as possible.",
                "maintenance_reason": "BTC wallets are in maintenance and currently set to trade only (buy and sell). We are working hard to bring them back online as soon as possible.",
                "wallet_info": "",
                "extra_info": "",
                "investment_info": "",
                "info_integration": "",
                "info_deu": "",
                "info_eng": "",
                "info_fra": "",
                "unavailable_reason_deu": "Aufgrund eines Updates befindet sich die Wallet im Wartungsmodus. Wir bemühen uns die Wallet so schnell wie möglich wieder online zu bringen.",
                "unavailable_reason_eng": "Wallet under maintenance due to an update. We are working hard to bring it back online as soon as possible.",
                "unavailable_reason_fra": "Wallet en maintenance en raison d'une mise à jour. Nous travaillons pour le remettre en ligne dès que possible.",
                "maintenance_reason_deu": "BTC Wallets befinden sich zur Zeit im Wartungsmodus und sind auf Trade Only (Kaufen und verkaufen) eingestellt. Wir bemühen uns die Wallets so schnell wie möglich wieder online zu bringen.",
                "maintenance_reason_eng": "BTC wallets are in maintenance and currently set to trade only (buy and sell). We are working hard to bring them back online as soon as possible.",
                "maintenance_reason_fra": "Les BTC wallets sont en cours de maintenance et actuellement disponibles qu'en trade only (achat et vente). Nous travaillons pour les remettre en ligne dès que possible.",
                "wallet_info_deu": "",
                "wallet_info_eng": "",
                "wallet_info_fra": "",
                "extra_info_deu": "",
                "extra_info_eng": "",
                "extra_info_fra": "",
                "investment_info_deu": "",
                "investment_info_eng": "",
                "investment_info_fra": "",
                "info_integration_deu": "",
                "info_integration_eng": "",
                "info_integration_fra": ""
            },
            "id": "1"
        },
        {
            "type": "cryptocoin",
            "attributes": {
                "symbol": "LTC",
                "name": "Litecoin",
                "sort": 120,
                "asset_type_name": "cryptocoin",
                "asset_group_name": "coin",
                "url_check_address": "https://insight.litecore.io/address/%s",
                "url_check_transaction": "https://insight.litecore.io/tx/%s",
                "buy_active": true,
                "sell_active": false,
                "withdraw_active": true,
                "deposit_active": true,
                "transfer_active": true,
                "available": true,
                "maintenance_enabled": false,
                "min_buy_eur": "1",
                "min_sell_eur": "1",
                "min_withdraw_eur": "3.32",
                "default_sell_amount": "10",
                "precision_for_fiat_price": 2,
                "precision_for_coins": 4,
                "precision_for_tx": 8,
                "wallet_min_deposit": "0.00100000",
                "wallet_small_deposit": "0.10000000",
                "wallet_small_deposit_fee": "0.00010000",
                "avg_price": "66.32",
                "color": "#BEBEBE",
                "wallet_withdraw_fee": "0.0000023000000000",
                "change_24h": "-5.9659231602591",
                "change_24h_amount": "-4.21",
                "change_1w": "4.6898441024961",
                "change_1w_amount": "2.97",
                "change_1m": "52.241680100831",
                "change_1m_amount": "22.76",
                "change_1y": "62.160482175782",
                "change_1y_amount": "25.42",
                "logo": "https://bitpanda-assets.s3-eu-west-1.amazonaws.com/static/cryptocoin/ltc.svg",
                "logo_dark": "https://bitpanda-assets.s3-eu-west-1.amazonaws.com/static/cryptocoin/ltc_dark.svg",
                "support_destination_tag": false,
                "android_supported_version": "0.0.1",
                "ios_supported_version": "1.0.0",
                "circulating_supply": "64051072.13875700",
                "allowed_unverified": false,
                "allowed_documented": true,
                "allowed_verified": true,
                "ieo_phases": [],
                "info": "",
                "unavailable_reason": "Wallet under maintenance due to an update. We are working hard to bring it back online as soon as possible.",
                "maintenance_reason": "LTC wallets are in maintenance and currently set to trade only (buy and sell). We are working hard to bring them back online as soon as possible.",
                "wallet_info": "",
                "extra_info": "",
                "investment_info": "",
                "info_integration": "",
                "info_deu": "",
                "info_eng": "",
                "info_fra": "",
                "unavailable_reason_deu": "Aufgrund eines Updates befindet sich die Wallet im Wartungsmodus. Wir bemühen uns die Wallet so schnell wie möglich wieder online zu bringen.",
                "unavailable_reason_eng": "Wallet under maintenance due to an update. We are working hard to bring it back online as soon as possible.",
                "unavailable_reason_fra": "Wallet en maintenance en raison d'une mise à jour. Nous travaillons pour le remettre en ligne dès que possible.",
                "maintenance_reason_deu": "LTC Wallets befinden sich zur Zeit im Wartungsmodus und sind auf Trade Only (Kaufen und verkaufen) eingestellt. Wir bemühen uns die Wallets so schnell wie möglich wieder online zu bringen.",
                "maintenance_reason_eng": "LTC wallets are in maintenance and currently set to trade only (buy and sell). We are working hard to bring them back online as soon as possible.",
                "maintenance_reason_fra": "Les LTC wallets sont en cours de maintenance et actuellement disponibles qu'en trade only (achat et vente). Nous travaillons pour les remettre en ligne dès que possible.",
                "wallet_info_deu": "",
                "wallet_info_eng": "",
                "wallet_info_fra": "",
                "extra_info_deu": "",
                "extra_info_eng": "",
                "extra_info_fra": "",
                "investment_info_deu": "",
                "investment_info_eng": "",
                "investment_info_fra": "",
                "info_integration_deu": "",
                "info_integration_eng": "",
                "info_integration_fra": ""
            },
            "id": "3"
        }],
    "commodities": [
        {
            "type": "commodity",
            "attributes": {
                "symbol": "XAU",
                "name": "Gold",
                "sort": 20,
                "asset_type_name": "commodity",
                "asset_group_name": "metal",
                "url_check_address": "",
                "url_check_transaction": "",
                "buy_active": true,
                "sell_active": true,
                "withdraw_active": false,
                "deposit_active": false,
                "transfer_active": true,
                "available": true,
                "maintenance_enabled": false,
                "min_buy_eur": "1",
                "min_sell_eur": "1",
                "min_withdraw_eur": "0.00",
                "default_sell_amount": "1",
                "precision_for_fiat_price": 2,
                "precision_for_coins": 4,
                "precision_for_tx": 8,
                "wallet_min_deposit": "0.00000000",
                "wallet_small_deposit": "0.00000000",
                "wallet_small_deposit_fee": "0.00000000",
                "avg_price": "46.20",
                "color": "#B68E46",
                "wallet_withdraw_fee": "0.0000000000000000",
                "change_24h": "0.17830390615683",
                "change_24h_amount": "0.08",
                "change_1w": "0.79461766021271",
                "change_1w_amount": "0.36",
                "change_1m": "2.2904516330434",
                "change_1m_amount": "1.03",
                "change_1y": "23.80947152489",
                "change_1y_amount": "8.89",
                "logo": "https://bitpanda-assets.s3-eu-west-1.amazonaws.com/static/cryptocoin/xau.svg",
                "logo_dark": "https://bitpanda-assets.s3-eu-west-1.amazonaws.com/static/cryptocoin/xau_dark.svg",
                "support_destination_tag": false,
                "circulating_supply": "190040000000.00000000",
                "allowed_unverified": false,
                "allowed_documented": true,
                "allowed_verified": true,
                "measurement_unit": "g",
                "ieo_phases": [],
                "info": "",
                "unavailable_reason": "",
                "maintenance_reason": "",
                "wallet_info": "",
                "extra_info": "",
                "info_integration": "",
                "info_deu": "",
                "info_eng": "",
                "info_fra": "",
                "unavailable_reason_deu": "",
                "unavailable_reason_eng": "",
                "unavailable_reason_fra": "",
                "maintenance_reason_deu": "",
                "maintenance_reason_eng": "",
                "maintenance_reason_fra": "",
                "wallet_info_deu": "",
                "wallet_info_eng": "",
                "wallet_info_fra": "",
                "extra_info_deu": "",
                "extra_info_eng": "",
                "extra_info_fra": "",
                "info_integration_deu": "",
                "info_integration_eng": "",
                "info_integration_fra": ""
            },
            "id": "28"
        },
        {
            "type": "commodity",
            "attributes": {
                "symbol": "XAG",
                "name": "Silver",
                "sort": 80,
                "asset_type_name": "commodity",
                "asset_group_name": "metal",
                "url_check_address": "",
                "url_check_transaction": "",
                "buy_active": true,
                "sell_active": true,
                "withdraw_active": false,
                "deposit_active": false,
                "transfer_active": true,
                "available": true,
                "maintenance_enabled": false,
                "min_buy_eur": "1",
                "min_sell_eur": "1",
                "min_withdraw_eur": "0.00",
                "default_sell_amount": "1",
                "precision_for_fiat_price": 4,
                "precision_for_coins": 4,
                "precision_for_tx": 8,
                "wallet_min_deposit": "0.00000000",
                "wallet_small_deposit": "0.00000000",
                "wallet_small_deposit_fee": "0.00000000",
                "avg_price": "0.5223",
                "color": "#BFBFBF",
                "wallet_withdraw_fee": "0.0000000000000000",
                "change_24h": "0.45618863533643",
                "change_24h_amount": "0.0024",
                "change_1w": "1.0634107360189",
                "change_1w_amount": "0.0055",
                "change_1m": "-0.28618255265208",
                "change_1m_amount": "-0.0015",
                "change_1y": "16.240139492548",
                "change_1y_amount": "0.0730",
                "logo": "https://bitpanda-assets.s3-eu-west-1.amazonaws.com/static/cryptocoin/xag.svg",
                "logo_dark": "https://bitpanda-assets.s3-eu-west-1.amazonaws.com/static/cryptocoin/xag_dark.svg",
                "support_destination_tag": false,
                "circulating_supply": "78978851000.00000000",
                "allowed_unverified": false,
                "allowed_documented": true,
                "allowed_verified": true,
                "measurement_unit": "g",
                "ieo_phases": [],
                "info": "",
                "unavailable_reason": "",
                "maintenance_reason": "",
                "wallet_info": "",
                "extra_info": "",
                "info_integration": "",
                "info_deu": "",
                "info_eng": "",
                "info_fra": "",
                "unavailable_reason_deu": "",
                "unavailable_reason_eng": "",
                "unavailable_reason_fra": "",
                "maintenance_reason_deu": "",
                "maintenance_reason_eng": "",
                "maintenance_reason_fra": "",
                "wallet_info_deu": "",
                "wallet_info_eng": "",
                "wallet_info_fra": "",
                "extra_info_deu": "",
                "extra_info_eng": "",
                "extra_info_fra": "",
                "info_integration_deu": "",
                "info_integration_eng": "",
                "info_integration_fra": ""
            },
            "id": "29"
        },
        {
            "type": "commodity",
            "attributes": {
                "symbol": "XPD",
                "name": "Palladium",
                "sort": 30,
                "asset_type_name": "commodity",
                "asset_group_name": "metal",
                "url_check_address": "",
                "url_check_transaction": "",
                "buy_active": true,
                "sell_active": true,
                "withdraw_active": false,
                "deposit_active": false,
                "transfer_active": true,
                "available": true,
                "maintenance_enabled": false,
                "min_buy_eur": "1",
                "min_sell_eur": "1",
                "min_withdraw_eur": "0.00",
                "default_sell_amount": "1",
                "precision_for_fiat_price": 2,
                "precision_for_coins": 4,
                "precision_for_tx": 8,
                "wallet_min_deposit": "0.00000000",
                "wallet_small_deposit": "0.00000000",
                "wallet_small_deposit_fee": "0.00000000",
                "avg_price": "68.91",
                "color": "#B5ABA0",
                "wallet_withdraw_fee": "0.0000000000000000",
                "change_24h": "1.3015303013818",
                "change_24h_amount": "0.89",
                "change_1w": "3.8967571345633",
                "change_1w_amount": "2.58",
                "change_1m": "12.413020936326",
                "change_1m_amount": "7.61",
                "change_1y": "73.079047744652",
                "change_1y_amount": "29.09",
                "logo": "https://bitpanda-assets.s3-eu-west-1.amazonaws.com/static/cryptocoin/xpd.svg",
                "logo_dark": "https://bitpanda-assets.s3-eu-west-1.amazonaws.com/static/cryptocoin/xpd_dark.svg",
                "support_destination_tag": false,
                "allowed_unverified": false,
                "allowed_documented": true,
                "allowed_verified": true,
                "measurement_unit": "g",
                "ieo_phases": [],
                "info": "",
                "unavailable_reason": "",
                "maintenance_reason": "",
                "wallet_info": "",
                "extra_info": "",
                "investment_info": "",
                "info_integration": "",
                "info_deu": "",
                "info_eng": "",
                "info_fra": "",
                "unavailable_reason_deu": "",
                "unavailable_reason_eng": "",
                "unavailable_reason_fra": "",
                "maintenance_reason_deu": "",
                "maintenance_reason_eng": "",
                "maintenance_reason_fra": "",
                "wallet_info_deu": "",
                "wallet_info_eng": "",
                "wallet_info_fra": "",
                "extra_info_deu": "",
                "extra_info_eng": "",
                "extra_info_fra": "",
                "investment_info_deu": "",
                "investment_info_eng": "",
                "investment_info_fra": "",
                "info_integration_deu": "",
                "info_integration_eng": "",
                "info_integration_fra": ""
            },
            "id": "35"
        }
    ],
    "fiats": [
        {
            "type": "fiat",
            "attributes": {
                "symbol": "EUR",
                "name": "Euro",
                "precision": 2,
                "to_eur_rate": "1.00000000",
                "default_sell_amount": "100",
                "numeric_character_reference": "&#x020AC;",
                "min_withdraw_euro": "25.00000000",
                "symbol_character": "€",
                "has_wallets": true,
                "logo": "https://bitpanda-assets.s3-eu-west-1.amazonaws.com/static/fiat/eur.svg",
                "logo_dark": "https://bitpanda-assets.s3-eu-west-1.amazonaws.com/static/fiat/eur_dark.svg",
                "logo_white": "https://bitpanda-assets.s3-eu-west-1.amazonaws.com/static/fiat/eur_white.svg",
                "logo_color": "https://bitpanda-assets.s3-eu-west-1.amazonaws.com/static/fiat/eur_color.svg",
                "name_deu": "Euro",
                "name_eng": "Euro",
                "name_fra": "Euro"
            },
            "id": "1"
        }
    ]
}
