[
    {
      "command": [
        "/var/lib/flatpak/exports/bin/contour"
      ],
      "working_directory": "/home/jabia"
    },
    {
      "command": [
        "/var/lib/flatpak/exports/bin/contour"
      ],
      "working_directory": "/home/jabia"
    }
] 