{
    "BatchSize": 50,
    "SerializedLayers": [
        {
            "Type": "WeightDecay",
            "UnderlyingSerializedLayer": {
                "Bias": [
                    0,
                    0,
                    0,
                    0,
                    0,
                    0,
                    0,
                    0,
                    0,
                    0,
                    0,
                    0,
                    0,
                    0,
                    0,
                    0,
                    0,
                    0,
                    0,
                    0,
                    0,
                    0,
                    0,
                    0,
                    0
                ],
                "Weights": [
                    [
                        -0.2727753957367382,
                        0.9801429709702227,
                        0.33466182467662886,
                        0.7345404682823938,
                        -0.26675678292972166,
                        0.3080128990877306,
                        0.1415447307993071,
                        0.2385940504643613,
                        -0.2379085927254056,
                        0.07659651397631871,
                        -0.005606475927630564,
                        -0.7500532806427737,
                        -0.008096689176791742,
                        -0.016434493057187638,
                        -0.3180281789165556,
                        -0.5462265466066661,
                        0.3816574669003331,
                        0.19835079859258856,
                        0.810776657062655,
                        -0.24790359393579653,
                        0.49491589132792047,
                        0.19082054269423251,
                        -0.022197986435128693,
                        -0.2112427831458875,
                        -0.03989413342488459
                    ],
                    [
                        -0.3321590105201275,
                        -0.12962165186556324,
                        -0.08001795489398611,
                        -0.4220410324935183,
                        -0.5860926514261214,
                        0.22214853504809515,
                        -0.21107826160570864,
                        0.3891898296558355,
                        0.011073275932303327,
                        -0.30208125599166474,
                        0.28957196505902555,
                        0.8287120161852726,
                        -0.40155114524429963,
                        0.07456594611932821,
                        -0.5506044698081535,
                        0.334927082252577,
                        -0.338381723614513,
                        0.18620157556926323,
                        -0.06802544609487876,
                        0.05407972371494068,
                        -0.7852243124936722,
                        -0.499589665288099,
                        0.15762280000121842,
                        0.3450864064507326,
                        0.8036713156694624
                    ],
                    [
                        -0.32286544754051233,
                        0.16090651448252113,
                        0.4558046771018677,
                        -0.4914892156185807,
                        0.4046741370832237,
                        0.2260440033040473,
                        -0.08473103093239787,
                        0.10372508836941831,
                        0.3018395891838604,
                        0.1652853086069998,
                        0.4146453573894664,
                        -0.2900709913441126,
                        0.8333797246382385,
                        -0.022370142704681684,
                        -0.03510656530898441,
                        0.21342813950189982,
                        -0.4623874935461275,
                        -0.32034142416830746,
                        0.4152071295460098,
                        -0.0839745543985106,
                        0.6380711361010708,
                        -0.26227609220350057,
                        0.17134457019944235,
                        0.23039912749245992,
                        -0.18256184450604335
                    ],
                    [
                        -0.8335077541439697,
                        0.2320399212345759,
                        0.3781487822841105,
                        0.5188892434509895,
                        0.10651196206839406,
                        -0.2205888343939192,
                        0.10572424774773119,
                        0.22857389765548058,
                        -0.4769059635573019,
                        -0.3881930498900469,
                        -0.06019424867784459,
                        -0.061962214767818824,
                        -0.6809500924404237,
                        -0.08004159681570738,
                        0.2364234906071167,
                        -0.06787296614079508,
                        0.17160152331873468,
                        0.13749780085708485,
                        -0.03615626907566529,
                        0.15184333380171494,
                        0.1966466177875606,
                        0.4761320249269233,
                        -0.2611082949498181,
                        -0.30665169935942016,
                        0.029263656002011296
                    ],
                    [
                        0.08963558766592801,
                        0.0784326133788398,
                        -0.14483869423190346,
                        -0.047143957307550305,
                        -0.0639489682188262,
                        -0.3231643624109022,
                        -0.17302869829645626,
                        0.046812272155631565,
                        -0.20753595238337477,
                        -0.03705338785003151,
                        0.24808815644280538,
                        0.277673591111947,
                        0.6552897126892373,
                        -0.41136499372424884,
                        -0.46026563209095844,
                        -0.14995889634787274,
                        -0.4282538185492024,
                        0.8692174843918348,
                        -0.605180227994674,
                        0.08201388909328067,
                        0.6837194403636486,
                        0.0550047665616442,
                        0.07422973170435446,
                        -0.7019279433458889,
                        -0.6691909611414729
                    ],
                    [
                        0.2618388199579162,
                        0.4997734544884477,
                        -0.6044916451150587,
                        0.12707742659461316,
                        -0.5301031074658544,
                        0.4090025646697418,
                        -0.7636958359956086,
                        -0.14626482340180547,
                        0.015375238391518782,
                        0.019500659437395356,
                        0.05983751248812708,
                        -0.07168332971643593,
                        -0.4474371341772785,
                        0.6541330907569071,
                        -0.25542061855894066,
                        0.40891036543264186,
                        -0.15629981467691123,
                        -0.010351155184310287,
                        0.14321405238199816,
                        -0.938236682953418,
                        0.5281102250567377,
                        -0.03735679008395719,
                        -1.0841923406621103,
                        -0.11034165922508815,
                        0.14720803109617583
                    ],
                    [
                        -0.08741314735645728,
                        -0.08973321880000892,
                        -0.443388358464639,
                        1.0963016925189133,
                        0.1602612183222517,
                        -0.08214868514828068,
                        0.6958409647639505,
                        -0.38540246997379035,
                        0.14160075154516846,
                        0.2736052261383865,
                        -0.21412111161381253,
                        0.4539979171884884,
                        -0.4553851083743423,
                        -0.4188186139740596,
                        0.24319028924547847,
                        0.48451554218024856,
                        0.08502597900396823,
                        -0.4375993629257221,
                        -0.25667587820002324,
                        0.25921981464088284,
                        0.04209740226143443,
                        0.13314293668710062,
                        -0.4836918635280153,
                        0.09506312656356161,
                        0.19347956059957505
                    ]
                ],
                "ActivatorType": "LeakyReLU",
                "GradientAdjustmentParameters": {
                    "StepSize": 0.01,
                    "FirstMomentDecay": 0.9,
                    "SecondMomentDecay": 0.999,
                    "DenominatorFactor": 1e-08,
                    "Type": "Adam"
                },
                "Type": "Standard"
            },
            "DecayRate": 1e-08
        },
        {
            "Type": "WeightDecay",
            "UnderlyingSerializedLayer": {
                "Bias": [
                    0,
                    0,
                    0,
                    0,
                    0,
                    0,
                    0,
                    0,
                    0,
                    0,
                    0,
                    0,
                    0,
                    0,
                    0,
                    0,
                    0,
                    0,
                    0,
                    0,
                    0,
                    0,
                    0,
                    0,
                    0
                ],
                "Weights": [
                    [
                        -0.016389450591082485,
                        0.17274923425100652,
                        -0.3415254249447028,
                        0.07885987897079036,
                        0.040186087489829936,
                        -0.10017919830589608,
                        -0.28663565104891336,
                        -0.22503646555787765,
                        0.3370394893441271,
                        -0.11121843792139788,
                        -0.044474774616716166,
                        0.113210740870729,
                        -0.18162631982669505,
                        -0.05192131746309007,
                        -0.28028828860680577,
                        -0.395405117161874,
                        0.15716275328590543,
                        -0.058678042100111606,
                        -0.025094351818967627,
                        0.26352429315144765,
                        -0.022168303340442324,
                        -0.26276183027024286,
                        0.3274985268123821,
                        0.19843467509122437,
                        -0.36640028052149104
                    ],
                    [
                        0.1358358527828881,
                        -0.19048999039072165,
                        -0.07183746751490354,
                        -0.03757825534489815,
                        -0.1475584531219141,
                        -0.1054762013999675,
                        0.31192200307625295,
                        0.16922024134356847,
                        0.07714618754212794,
                        0.04564800489920113,
                        0.5153245627611509,
                        0.18249941492372315,
                        -0.15477878333297945,
                        -0.10914914106788856,
                        -0.20296806705604997,
                        -0.4239141364959349,
                        0.37527834512567765,
                        0.126316236233007,
                        -0.3176698774786722,
                        -0.21063841924008325,
                        -0.04769404582951725,
                        0.4804422453338575,
                        -0.34498931457110266,
                        -0.15869539581214476,
                        0.15605456054101924
                    ],
                    [
                        0.01037969585448129,
                        0.47538937828776046,
                        -0.10212920019028532,
                        -0.2933149482052494,
                        -0.03381275084600285,
                        -0.057309508171297166,
                        -0.20409759750658793,
                        -0.0055773316854180206,
                        0.0004917880964875067,
                        0.1184617264239771,
                        0.0434404538711224,
                        0.0518995436914643,
                        0.09748820028580246,
                        -0.0824630643838701,
                        0.16341707930043614,
                        0.15303166147298197,
                        0.2529509856571956,
                        0.0009200883890228876,
                        0.3286811160220048,
                        -0.22842500276366762,
                        -0.023732440381920017,
                        -0.04256059261196074,
                        0.2938922781375173,
                        -0.20715925612302694,
                        0.14782644388177965
                    ],
                    [
                        0.4637014880951217,
                        0.11187120759365128,
                        0.18273337074951782,
                        -0.1417060172772386,
                        0.23394643174598206,
                        0.038026662852378684,
                        -0.16835007874953684,
                        0.10384074558323286,
                        0.11826670708025129,
                        -0.3007229515659024,
                        0.020157857536539047,
                        -0.1993966114331761,
                        -0.06168648703850432,
                        0.1291857318362839,
                        -0.12035060866056098,
                        0.14002340923182252,
                        -0.40108830285591135,
                        0.09312694487627698,
                        0.10100836097664563,
                        -0.026630582906107387,
                        -0.04660080759044777,
                        -0.04998052420151204,
                        0.11112077685071522,
                        -0.12241774955402628,
                        -0.28837074975418153
                    ],
                    [
                        0.029907560234681912,
                        0.15360499418629145,
                        0.03654846980608719,
                        0.2958805189152137,
                        -0.2634626920915571,
                        -0.32499009534723167,
                        0.2849628247885254,
                        0.3348152206883662,
                        -0.024826789356840778,
                        0.1868894752934368,
                        -0.14851215893434272,
                        -0.1974706097689334,
                        -0.21676099204337632,
                        -0.09066749648806337,
                        -0.19326731368359953,
                        0.02399130462169551,
                        -0.27312310171747245,
                        -0.18408073065710395,
                        -0.0960618808685103,
                        0.1530561557087275,
                        -0.05050322702392201,
                        0.061102161648825426,
                        -0.08565678785043605,
                        -0.11206219388079362,
                        0.09541654924556418
                    ],
                    [
                        0.16748212899195378,
                        -0.2519506759560811,
                        0.11205917428900121,
                        0.06869753520566148,
                        -0.25326704077611456,
                        0.1863474033010977,
                        -0.31887354905104104,
                        -0.04908080704754786,
                        0.025136914314350757,
                        -0.08141668589913521,
                        0.07693710010734815,
                        -0.1397618665284605,
                        0.13582526330363398,
                        -0.10791670888342038,
                        0.21709041903997517,
                        -0.15276335792401352,
                        0.05650477018650434,
                        -0.1671135862374816,
                        -0.022718212295588666,
                        -0.0942022185167882,
                        -0.05705802197260108,
                        -0.24752237060212623,
                        -0.28589124694695245,
                        -0.1988599969585156,
                        0.41224696356583723
                    ],
                    [
                        0.014661292656413054,
                        0.07977878252860232,
                        -0.2795158237525357,
                        -0.18778169750667756,
                        0.2889679854721577,
                        -0.09337349731054201,
                        -0.029918848493933493,
                        0.08273435356337472,
                        -0.04785416545841583,
                        -0.08334372398738876,
                        0.1611945290903075,
                        -0.06538473011574018,
                        -0.19118632206745378,
                        -0.16819522941950468,
                        0.08722512917314132,
                        0.05177175867565447,
                        0.05774680713244419,
                        -0.08882141368112884,
                        -0.0530472361231869,
                        0.21357585862688727,
                        0.1837715153666867,
                        0.1754634820210487,
                        0.0943676432644177,
                        0.24684145784469325,
                        -0.02069404896139398
                    ],
                    [
                        0.1106560472806736,
                        -0.14661436478223064,
                        0.015157951070627172,
                        0.2150426059456787,
                        -0.26257997024715596,
                        0.16475619572635553,
                        -0.16257536566439942,
                        0.18953389760423844,
                        -0.13933214455213178,
                        -0.12600092849548694,
                        0.2201801392475344,
                        -0.04691849622905741,
                        -0.06095737173498336,
                        0.0781636802305901,
                        -0.2197883166265815,
                        -0.07253376231996787,
                        -0.06273458808094266,
                        -0.0022897103866606097,
                        0.22444005542857848,
                        -0.432490872612126,
                        -0.052630668336636266,
                        -0.3039902411380906,
                        -0.24280406684866385,
                        0.08426503087230633,
                        0.040149865455278766
                    ],
                    [
                        -0.13041567607477483,
                        0.24012658067252796,
                        -0.26701867041401905,
                        -0.23403326605493444,
                        -0.05585374652176747,
                        -0.42028013082027055,
                        0.157778579869738,
                        0.19700610665980448,
                        0.2163817824417782,
                        0.05025874399921816,
                        -0.03575059193725896,
                        0.08526791441585009,
                        -0.04805332104139536,
                        -0.004742661242128291,
                        0.10680793570527142,
                        -0.5008778993720534,
                        -0.11212992820759052,
                        -0.08165484621127687,
                        -0.07388441195954754,
                        -0.251860740018412,
                        -0.34960777128113163,
                        0.1007829094866507,
                        -0.1772327178180817,
                        -0.11303867911445378,
                        -0.23402475691796565
                    ],
                    [
                        -0.18207812590027447,
                        -0.25280558674426373,
                        0.35810542288272873,
                        -0.019994936305578675,
                        0.05449562136885336,
                        0.15760426040887976,
                        0.09947264201245185,
                        -0.08345603722668904,
                        -0.28619768223503605,
                        0.14237608591575385,
                        -0.27524928291968964,
                        0.17284096631089974,
                        -0.31045418922548573,
                        -0.13834953386124743,
                        -0.12395459583341889,
                        -0.048365604612135495,
                        0.19680807325008898,
                        -0.2245542050481104,
                        0.12432281668083674,
                        -0.14465445156420606,
                        -0.041033108384850026,
                        0.2968275853365847,
                        0.15805507873302765,
                        -0.2553334554304402,
                        0.05387789327059023
                    ],
                    [
                        -0.26707949627764027,
                        -0.048166741723676826,
                        -0.31394383323220865,
                        -0.17231015908871247,
                        -0.13273095861789372,
                        -0.15708071730029646,
                        -0.0506597069674031,
                        0.11324826654211911,
                        0.08608968929440725,
                        0.27193234722127296,
                        -0.0715444899487569,
                        0.4662832694238788,
                        0.13230807240853745,
                        -0.1657014460993251,
                        0.2953944733317919,
                        -0.29264607512224894,
                        0.22872430833498147,
                        -0.07177878945222942,
                        -0.11598782803123323,
                        -0.11667058460823472,
                        -0.09712105223744855,
                        -0.41255125978478796,
                        -0.28683014423007264,
                        -0.018260859890197326,
                        -0.18436532548333676
                    ],
                    [
                        -0.3339522776726107,
                        -0.30510173866199697,
                        0.03096043952901796,
                        -0.0028445188409902213,
                        -0.016043174572802237,
                        0.05604080334022176,
                        -0.002843759394527756,
                        -0.39180441107549324,
                        -0.03360119765183844,
                        -0.06739390723593255,
                        -0.011364253146283455,
                        0.2008410044951235,
                        0.19347001632641944,
                        -0.06245199708580406,
                        0.12131011467718927,
                        0.152379707735603,
                        0.15152514360041552,
                        0.036483269742333284,
                        -0.011142368131101418,
                        -0.21488591186030812,
                        0.13821446202987908,
                        0.13279310336955039,
                        -0.0253902296917722,
                        -0.12201026406114615,
                        -0.21583404038309625
                    ],
                    [
                        0.2084964614142193,
                        0.15705944545490816,
                        -0.09332454090882233,
                        -0.054754700341914535,
                        -0.014892823410612252,
                        0.24033014185862453,
                        0.18132763319733322,
                        0.04702745959507148,
                        -0.15048547089431744,
                        -0.14470168706801842,
                        0.37123779032254656,
                        0.18757572621083438,
                        0.02893823207803352,
                        -0.3415135984607791,
                        0.035129579331213884,
                        0.09504007951915495,
                        -0.12379085527981151,
                        -0.02825410609939711,
                        -0.4385565659155073,
                        0.19510074069137648,
                        -0.2556264229290632,
                        0.07932002528475574,
                        -0.11245441432696593,
                        0.09157472581636562,
                        0.012485649789979328
                    ],
                    [
                        -0.17607402606425787,
                        0.16141398319111788,
                        -0.0562120784424304,
                        0.19213500521276253,
                        -0.016427366663687333,
                        -0.48543569991191404,
                        -0.15896512011910668,
                        0.07670227421474383,
                        -0.15475976794532165,
                        0.33839053672218666,
                        -0.27731203180058356,
                        0.12971003917020527,
                        0.3616032083550414,
                        -0.048408373166983626,
                        -0.29458285016932173,
                        -0.14065175897098542,
                        -0.022577487784092413,
                        0.05752646641812176,
                        -0.4525864682069483,
                        -0.14658306778604718,
                        0.11941221924537648,
                        -0.23904794690038655,
                        -0.1853240695427862,
                        -0.06852945909216367,
                        0.09515860087739048
                    ],
                    [
                        0.3743299268925689,
                        0.28634993084321997,
                        -0.35220947722696194,
                        0.09070817594474649,
                        -0.10858435353836254,
                        0.40794019793944014,
                        -0.015787457705043584,
                        -0.45996914576251025,
                        0.261160016090435,
                        0.059405929674394876,
                        -0.05462710094433912,
                        0.07072662265191092,
                        0.2779085329173476,
                        0.009069885044270101,
                        -0.061831108814430935,
                        0.036532324395322495,
                        0.13060235124938993,
                        0.12711082776820823,
                        0.0191827816093595,
                        -0.29910008481002287,
                        0.09300512368372102,
                        -0.18276568196255236,
                        0.0011277194642161272,
                        0.10433772785752955,
                        0.05032755951236852
                    ],
                    [
                        -0.0302178076935349,
                        0.11559401749017413,
                        0.11444185903908455,
                        -0.21117293429000195,
                        -0.22452357406384693,
                        0.01393336694762011,
                        -0.23049706940992729,
                        -0.02226547275043768,
                        0.12498017583617638,
                        -0.07454899476940699,
                        0.18492240511346186,
                        -0.03793457381964582,
                        -0.4626602363242845,
                        0.21435322135201884,
                        -0.17688134436025735,
                        -0.06307500956897787,
                        -0.2996720774575175,
                        0.13168188277958226,
                        0.21665255698568858,
                        0.015556683276806184,
                        -0.24827629645216087,
                        -0.032422285569155565,
                        -0.08157406315265954,
                        -0.14724679691024778,
                        -0.1329907238550558
                    ],
                    [
                        -0.22516630645102712,
                        -0.013516027493887162,
                        0.2588522426549968,
                        0.022596613189407713,
                        -0.18527045638542003,
                        -0.17091186272077522,
                        -0.012685963075657353,
                        -0.21391897858217557,
                        0.16382836653252342,
                        -0.12072645144158717,
                        0.04620027276844436,
                        0.03419722900581277,
                        -0.013913451504070529,
                        -0.22402092178710886,
                        -0.0933727710544414,
                        0.3297766657208495,
                        0.20087720438182521,
                        -0.05666554117914835,
                        -0.28779702637788424,
                        0.110301081600673,
                        -0.2907421972208112,
                        0.1536994822164912,
                        0.3648160678534355,
                        -0.021724184374152952,
                        -0.20367107400725334
                    ],
                    [
                        -0.07577796969304793,
                        -0.16075943823637728,
                        0.014673909450239955,
                        -0.17340480878716857,
                        -0.0014540714495150206,
                        -0.23992094292467378,
                        0.10939239090978076,
                        -0.06608624818941365,
                        0.11923020851656987,
                        0.012809718003811322,
                        0.02404423857634487,
                        -0.18259668821889574,
                        0.09579032310351068,
                        0.16185334822363215,
                        0.09143904744668602,
                        0.23293165116535353,
                        -0.47986394162584545,
                        0.4068089629208391,
                        -0.2148015582115046,
                        -0.1949646882070154,
                        0.03834098371299177,
                        0.16086409760087925,
                        -0.07981119825853045,
                        0.021852160550206605,
                        -0.32712629978053825
                    ],
                    [
                        0.013293870561981275,
                        0.05231493089344239,
                        0.14296340850004882,
                        -0.24426824141927952,
                        0.16138138536314547,
                        -0.012939134039882727,
                        0.11578793170623836,
                        -0.09158635838859987,
                        -0.30000989726015215,
                        -0.32516997788019253,
                        -0.14807859068556242,
                        -0.030990406112615877,
                        0.05634133325252253,
                        -0.17002867486051312,
                        0.467831384374706,
                        0.22650103511120845,
                        0.10271596458701347,
                        -0.04058652260557585,
                        -0.2975979909724609,
                        0.162728591649631,
                        -0.06385434071970722,
                        -0.29903166654265484,
                        0.3055685578211562,
                        -0.01165022807091687,
                        -0.21388003891727336
                    ],
                    [
                        0.17435788064357535,
                        -0.02233134322355547,
                        0.3128114897690528,
                        -0.24623032787031496,
                        -0.21645898851057044,
                        -0.23406362392259755,
                        -0.12801789563252905,
                        0.16233476039670947,
                        0.328050279422715,
                        -0.05338851079132537,
                        0.30857164546767213,
                        0.01517721500613287,
                        -0.06514087169553444,
                        0.1556555880501887,
                        0.01817087120541403,
                        -0.29946698505077884,
                        -0.037094808408850204,
                        -0.05701367845754018,
                        0.05963189360834575,
                        0.050716036777948385,
                        -0.09279617057881845,
                        0.18040091218167725,
                        -0.0307596909827001,
                        0.0903495146306468,
                        0.14319209921223067
                    ],
                    [
                        -0.009238817833795291,
                        -0.04584900950740813,
                        -0.18253459030963753,
                        -0.052751639536046946,
                        -0.5124667399199611,
                        0.13255534189419224,
                        -0.19191682056517437,
                        -0.10205498768699922,
                        -0.02133118040710918,
                        0.061928026567619976,
                        -0.07390499999179696,
                        -0.039675774488528194,
                        0.12608354543302347,
                        -0.1492961830274144,
                        0.0048331370142926855,
                        -0.07989932280620543,
                        -0.28079883312142434,
                        0.003575529270382124,
                        -0.08516163984329059,
                        -0.1070019873715623,
                        0.027620557349909588,
                        0.30250274302628405,
                        -0.12563018514495325,
                        -0.10067778359131235,
                        0.03584716255834733
                    ],
                    [
                        -0.09961633238054995,
                        -0.18327961923910452,
                        -0.2497736780267623,
                        -0.14587420530810793,
                        -0.0016956622277581957,
                        -0.10675511648350161,
                        0.08079308638368449,
                        0.057788466756648095,
                        0.018996356649373162,
                        -0.46184493657769504,
                        -0.19447743819851415,
                        0.16056629129208205,
                        0.043946093769255734,
                        -0.09582685785945692,
                        -0.20050676919609228,
                        -0.052288504292551434,
                        -0.40224286998652214,
                        -0.06008589052670315,
                        -0.046023856636378875,
                        -0.026615255870937073,
                        0.6168159822554365,
                        -0.289551818137905,
                        0.19949051001814885,
                        0.4813352644003522,
                        0.17731899059035794
                    ],
                    [
                        -0.13284247235397703,
                        0.16403949658619374,
                        -0.15260342611784602,
                        -0.3467629475518815,
                        0.2560317929579877,
                        -0.3926166397606665,
                        -0.2918557614742476,
                        -0.17729393578612962,
                        -0.19369745423838436,
                        0.2828190086358366,
                        0.3167009658024782,
                        -0.1524258842527165,
                        0.32135340982351623,
                        0.19072214498013595,
                        -0.35684634798423787,
                        0.03385334733895928,
                        0.1260238212363121,
                        0.23231686750996405,
                        -0.08877078025842758,
                        0.057156402362317255,
                        -0.3083683327935869,
                        -0.24803896334363232,
                        0.15152574606075797,
                        -0.051772375334560174,
                        0.24665559684394173
                    ],
                    [
                        -0.056698582330043004,
                        -0.18495511431434603,
                        0.07447467534554385,
                        0.010123159765416244,
                        -0.1341762932804435,
                        -0.1335845619078291,
                        0.11651328425091297,
                        -0.40903922238741575,
                        -0.3370259874582553,
                        -0.015890120526615186,
                        -0.17332775406834905,
                        0.19928639281108368,
                        -0.1864220689115367,
                        0.16687025458411028,
                        0.0026259293275421075,
                        0.02673827004688294,
                        -0.052928645105544896,
                        -0.2894760290036179,
                        0.07373032345253076,
                        0.14819343043658462,
                        -0.23774931768237542,
                        0.08634090578945267,
                        -0.13540493766669692,
                        -0.2617195501288094,
                        0.1674863631165615
                    ],
                    [
                        -0.05011543465394628,
                        0.20372267079924905,
                        0.0031360113442034394,
                        -0.14716936520563584,
                        0.24607066495858346,
                        -0.08727234631688048,
                        -0.24334279902032604,
                        -0.09678375828226976,
                        -0.16941525397039423,
                        0.11900803828910377,
                        -0.3394851978059221,
                        0.0016419263299788291,
                        0.1415497695127475,
                        -0.03784129117366457,
                        -0.3574484648667945,
                        0.0781572905279159,
                        0.273692357074815,
                        -0.5167173770798137,
                        -0.024925221210804496,
                        0.173273881393447,
                        0.10372073450715831,
                        -0.027646403643771494,
                        -0.2546140847699092,
                        -0.09601566818775276,
                        -0.19433299536565765
                    ]
                ],
                "ActivatorType": "LeakyReLU",
                "GradientAdjustmentParameters": {
                    "StepSize": 0.01,
                    "FirstMomentDecay": 0.9,
                    "SecondMomentDecay": 0.999,
                    "DenominatorFactor": 1e-08,
                    "Type": "Adam"
                },
                "Type": "Standard"
            },
            "DecayRate": 1e-08
        },
        {
            "Type": "WeightDecay",
            "UnderlyingSerializedLayer": {
                "Bias": [
                    0,
                    0,
                    0,
                    0,
                    0,
                    0,
                    0,
                    0,
                    0,
                    0,
                    0,
                    0,
                    0,
                    0,
                    0,
                    0,
                    0,
                    0,
                    0,
                    0,
                    0,
                    0,
                    0,
                    0,
                    0
                ],
                "Weights": [
                    [
                        0.1916368758251097,
                        -0.043411675061166284,
                        0.2812703254005834,
                        -0.0009635927052580167,
                        0.0983603643366391,
                        -0.10597896177593305,
                        -0.04201828189707741,
                        0.02901379090043183,
                        0.22698825182542237,
                        -0.05367791403869792,
                        0.13400911020419948,
                        0.013795493715948435,
                        0.005805409120046171,
                        0.12274469395685395,
                        0.2025232420471597,
                        -0.047137575237894115,
                        0.09304609994044433,
                        0.36661800903156044,
                        -0.25059707684753335,
                        0.015736245282294142,
                        -0.107359716952605,
                        -0.2030766630400744,
                        -0.08844342249769342,
                        0.2806571995098315,
                        0.4686500471528782
                    ],
                    [
                        -0.2786254397267582,
                        -0.31480768376453816,
                        -0.055618345409791436,
                        -0.17500796252272488,
                        0.10424790919119593,
                        0.09772513961283852,
                        -0.10897804333852355,
                        0.08285701763300889,
                        -0.05073960692341411,
                        0.0032702455672955935,
                        0.13571404227779177,
                        0.05141115838535122,
                        -0.11517157098242653,
                        -0.0938685526404881,
                        -0.045123498769486556,
                        -0.0675528304676279,
                        -0.46927142653335346,
                        0.430844952940435,
                        0.03550738418956554,
                        -0.3211728426863007,
                        -0.23229766082066386,
                        0.042645423389799264,
                        -0.4126495942380437,
                        0.008338974810853652,
                        0.035476925388042944
                    ],
                    [
                        -0.06558976449431153,
                        0.2038276396960387,
                        -0.16278642834791587,
                        0.024446323631899233,
                        -0.09527637135126915,
                        -0.04961818118464953,
                        0.03983755051606312,
                        -0.020029157111689795,
                        0.17057878074391464,
                        0.16606632470118057,
                        0.14850181490565878,
                        -0.06799707790867329,
                        0.18963902470799696,
                        -0.102097596578894,
                        0.09452202073372223,
                        -0.4226489742973525,
                        -0.06543255447618221,
                        0.22802566998141952,
                        -0.19293905328028155,
                        -0.3909031278005448,
                        0.061376194410890574,
                        0.13790328637644864,
                        -0.06808831007801698,
                        -0.1030186568579133,
                        -0.20483470370205278
                    ],
                    [
                        -0.1552902801670489,
                        -0.16548740357767144,
                        0.26127436487147127,
                        0.18768482665821662,
                        0.029226298983324808,
                        -0.28617015333754625,
                        -0.00011973213322018911,
                        0.2036432152857148,
                        0.05913286005583255,
                        -0.011816611085050102,
                        0.0044261440503987875,
                        0.24630114081502075,
                        0.013221597435718623,
                        0.2155014851910668,
                        -0.054539057753991885,
                        0.24233894371481657,
                        -0.1301046286555486,
                        0.2921762844230718,
                        0.11000029208691663,
                        -0.10640637926367456,
                        0.021317184386595158,
                        0.17786546616782037,
                        -0.21108938160793214,
                        -0.2114832048395917,
                        -0.15999737545932313
                    ],
                    [
                        0.18281373135157866,
                        -0.0933384034649608,
                        0.4544005545008347,
                        0.013687384172741818,
                        0.11699955141604623,
                        0.0023214081169937897,
                        0.017866278560436346,
                        -0.09764332804819596,
                        -0.1579099018904003,
                        0.13968687729869136,
                        -0.05817183570627892,
                        -0.015600914870916137,
                        -0.26110220432191467,
                        0.07313821343174252,
                        0.15607173656193396,
                        0.1747399801308373,
                        -0.20414359173590535,
                        0.29681940666699697,
                        -0.03928157782392248,
                        -0.07040558651920387,
                        0.019570773359344356,
                        -0.0689468582668626,
                        0.3655518290466048,
                        0.08836213758022483,
                        -0.07364612456794743
                    ],
                    [
                        -0.08198055412468493,
                        -0.0036793125351225024,
                        0.1547808871673698,
                        -0.2562431366632606,
                        0.4914502280526253,
                        0.04688721126399709,
                        0.20744520994107216,
                        -0.4559024813607204,
                        0.13237460362376208,
                        -0.061561938266664853,
                        -0.1720290536169423,
                        -0.17709505504264006,
                        0.19055875572188097,
                        0.09382795969226403,
                        0.17911526389137056,
                        -0.11857285007913305,
                        0.5563855319550138,
                        0.016379989864702307,
                        0.0696135536122715,
                        -0.13982751567744564,
                        0.05664539369680221,
                        -0.010717666956913865,
                        -0.027991632071497304,
                        0.04027413461584525,
                        -0.04035795305081599
                    ],
                    [
                        -0.48370287536778644,
                        0.08192535094144908,
                        -0.00422849438761845,
                        0.06692608656004669,
                        0.4426324186041042,
                        0.332997923676149,
                        -0.020118871831133558,
                        0.10646115676576934,
                        -0.04682332923012583,
                        0.3098104612137067,
                        0.15377911426166485,
                        0.43901174636134244,
                        0.27587414311763025,
                        -0.037694907893896734,
                        -0.32539370239624477,
                        -0.15242006026819635,
                        -0.025265200368973152,
                        0.04256071645443284,
                        -0.29434897731280607,
                        0.0777129275826047,
                        -0.10925735035338842,
                        0.23863022165411307,
                        0.5075414525404355,
                        0.6178197483090888,
                        -0.10535046108479461
                    ],
                    [
                        -0.103303283510294,
                        0.16530671130675728,
                        0.46624693472583917,
                        0.05564537363259693,
                        -0.04854838726829524,
                        -0.2790332649852943,
                        -0.041882512821404407,
                        -0.030311730444630203,
                        -0.005571308183605435,
                        -0.10581125866356961,
                        -0.10207618047474779,
                        -0.025056148284410353,
                        0.1647427132568204,
                        -0.2571717936229542,
                        -0.2091866639045374,
                        -0.26148489393682983,
                        0.14255727431216617,
                        0.25879375398976256,
                        -0.20284583213095142,
                        0.043765258530362144,
                        -0.002461126842520438,
                        0.2135802905302056,
                        -0.3697935636944769,
                        -0.10223061763787365,
                        0.4004194719409757
                    ],
                    [
                        0.05898456507648203,
                        0.06946560409984627,
                        0.23361149931581587,
                        -0.30495993618390205,
                        0.011497051998758522,
                        -0.0036694097955193464,
                        0.01004632777686241,
                        0.12873650953331447,
                        -0.27602897817687777,
                        -0.06320621719721169,
                        0.10565144031805176,
                        -0.02990114782077869,
                        0.14851938237506404,
                        0.2504676620836721,
                        0.2614437049951592,
                        0.025958474090648484,
                        0.10149593707948874,
                        0.050103113959617265,
                        -0.13653891166574372,
                        0.2176563559964358,
                        0.1860032334494299,
                        0.08075283753479957,
                        0.052957077448798164,
                        0.08453844013514678,
                        -0.4666872074226305
                    ],
                    [
                        0.060320933707768656,
                        -0.10838955978783152,
                        -0.07961825961272212,
                        -0.048426799020626604,
                        -0.12191407432024073,
                        -0.045439317271316754,
                        0.11909649863667632,
                        -0.11421006740315176,
                        -0.09477325869816079,
                        0.005297477837921872,
                        -0.23433080570060383,
                        0.4248157916198208,
                        -0.025638354910964414,
                        -0.12257338068715261,
                        -0.2184272100645327,
                        -0.00020642568782132986,
                        -0.07409018345399386,
                        -0.06573164413812964,
                        0.01155144953211552,
                        0.2481931645543409,
                        -0.061834581661664424,
                        -0.002736277336226186,
                        -0.03910502134738067,
                        0.3885254145025072,
                        -0.19662716827172522
                    ],
                    [
                        -0.1408752104255518,
                        0.17491840476346784,
                        0.06966105938157728,
                        0.1281159708349669,
                        -0.02564222258079282,
                        0.10828145054949606,
                        0.12417880092496987,
                        0.22085062642237407,
                        -0.30599230264379584,
                        0.08119392719250001,
                        -0.08724466666368551,
                        -0.13655408502516472,
                        -0.1951718122568837,
                        -0.3709031099097608,
                        0.03511063172904164,
                        0.2407019328509361,
                        0.13098965642013266,
                        0.05999718983301133,
                        0.14185348308220094,
                        -0.16949391618917498,
                        0.1789604920833181,
                        -0.2051365013039023,
                        0.20742666252740471,
                        0.21277362659421173,
                        -0.0017632892252826644
                    ],
                    [
                        -0.06785543505097341,
                        0.17623616622949778,
                        0.10337012130175083,
                        0.11167087516831753,
                        -0.3704012036759319,
                        -0.08673089973061666,
                        -0.09794661706103767,
                        0.09772283247030661,
                        -0.16866930993949278,
                        -0.239651559994459,
                        0.33508626831851274,
                        0.14732570386481567,
                        0.1239995439526658,
                        -0.2481469314742769,
                        0.2709196980499337,
                        0.2737335193711395,
                        0.08440363265764399,
                        -0.1598292829553603,
                        -0.19938159872608202,
                        0.18891109764689998,
                        -0.2474347714386861,
                        0.25569121829585895,
                        -0.052749715403713315,
                        -0.12213337499402871,
                        0.3064744914383711
                    ],
                    [
                        -0.3187980505859753,
                        0.007234639349385012,
                        -0.26289502408888643,
                        -0.16529905245756701,
                        -0.29975334744820825,
                        0.07916488718796408,
                        0.16783282191581617,
                        -0.1000630140696559,
                        0.0873410327482404,
                        0.4382981000007611,
                        0.10680647782965891,
                        -0.09590039275716328,
                        -0.3182095160611596,
                        -0.11696040244226924,
                        0.013001790044259377,
                        -0.15445352814024418,
                        0.15884257859430048,
                        -0.029180508727066342,
                        -0.23902717579550395,
                        -0.04190231381788507,
                        -0.2571297151002686,
                        -0.17483143974911258,
                        0.31432800725205423,
                        -0.41226453855659273,
                        -0.4850974468626518
                    ],
                    [
                        -0.03763682431302359,
                        -0.45383064317138644,
                        0.19977098215639733,
                        -0.2770474005601599,
                        -0.039102349626627037,
                        0.30515356867289256,
                        0.07782320333503173,
                        -0.08516481602891565,
                        -0.15441529638134746,
                        0.5159759486530858,
                        0.2531544031816671,
                        -0.012244474681987513,
                        0.16495840096686035,
                        -0.1663989863040933,
                        0.03176936530776429,
                        -0.0494583660424611,
                        0.2793576594502396,
                        -0.01800251211934181,
                        0.18813675542087285,
                        -0.06396860781154991,
                        0.6212227891881941,
                        0.17674195583403918,
                        -0.08944197869552595,
                        -0.01767929071739604,
                        -0.08819615287286532
                    ],
                    [
                        -0.09701718805716059,
                        -0.3799882104822252,
                        -0.012080595437713584,
                        -0.14204803929005352,
                        0.00014375115047584553,
                        -0.07380988782285429,
                        -0.30474428753497285,
                        -0.06242087653146037,
                        0.047786323126574305,
                        0.3280317235053889,
                        0.05574873381518446,
                        -0.16335914471037252,
                        -0.01672697145975446,
                        -0.04583063607552615,
                        0.2683652857574822,
                        0.17546780421780336,
                        -0.1180392143896779,
                        0.15750487047958206,
                        -0.14642345746069615,
                        -0.09569464271892347,
                        0.09888018401550103,
                        0.08366745768889168,
                        -0.10362559323591403,
                        0.07989925704591125,
                        0.21100184593794968
                    ],
                    [
                        0.07855331950144182,
                        0.32667466117519245,
                        -0.14021368190551273,
                        0.02110979673780693,
                        -0.3975079455844666,
                        -0.03552654776095469,
                        0.22344003016773378,
                        -0.23033596196154216,
                        0.04085591326219936,
                        -0.26521353422390914,
                        -0.055917015114667915,
                        -0.19470829909013385,
                        -0.4936209647952586,
                        0.2160524556851664,
                        0.11858094057543905,
                        -0.02324300198783691,
                        -0.22751913561038162,
                        0.22834812826873577,
                        -0.10669822260670939,
                        -0.18841482037812163,
                        -0.07959465498481884,
                        -0.07166436583540214,
                        -0.02736306699597557,
                        0.11828591907830655,
                        -0.1014478648875772
                    ],
                    [
                        -0.0459295801073213,
                        -0.009213681025022109,
                        -0.24616243470549654,
                        -0.053510015612281914,
                        -0.3016809885759056,
                        0.304358246242337,
                        0.3454796748896504,
                        -0.32646644509250927,
                        0.4119796405836808,
                        -0.0673244888088323,
                        -0.1782449053937877,
                        0.0016560361830989013,
                        0.02291571417447085,
                        -0.056865063468983304,
                        0.270249915437025,
                        0.10358359446046195,
                        -0.2847977121263762,
                        0.19802141520309202,
                        0.1550204685404386,
                        -0.15765860593122258,
                        0.06315664993204842,
                        0.013026843762454544,
                        -0.25097803462856405,
                        -0.05192371630799263,
                        0.19169284659352645
                    ],
                    [
                        0.06555372371212784,
                        0.17787235730645654,
                        0.19356169783473787,
                        0.26708738837728785,
                        -0.1625524559188295,
                        0.13269728112874568,
                        -0.39139407022318495,
                        -0.06951944759142221,
                        -0.29682443689621424,
                        -0.048314836815452664,
                        -0.17739100155148735,
                        -0.06701745349880482,
                        0.11217310988703028,
                        -0.30274893192312025,
                        -0.13283682509100672,
                        -0.2494015322626975,
                        -0.4585235529842311,
                        0.07452753991600265,
                        -0.04398905837904879,
                        0.09537028175781778,
                        0.24929525830444602,
                        0.1476527800721936,
                        -0.0846985728650744,
                        -0.03320676062101718,
                        -0.03445630576090003
                    ],
                    [
                        0.2805615976168858,
                        0.11205628546767812,
                        -0.039910637372971854,
                        0.20404913480028486,
                        0.09027339522398374,
                        -0.15199440640565565,
                        0.15394826323702396,
                        0.15300137774186143,
                        -0.13849654285642618,
                        -0.2159791083157101,
                        -0.06712554210611478,
                        -0.2719984675326796,
                        -0.01619343063569894,
                        -0.01818587375972982,
                        0.2242510319683992,
                        -0.022782973576422283,
                        -0.29431354568678664,
                        -0.10648227341720638,
                        0.2292359681989351,
                        -0.018635450876846846,
                        0.5275861999885657,
                        0.037572467477224106,
                        -0.27581274819031454,
                        0.14683310729087695,
                        -0.156521026947672
                    ],
                    [
                        -0.13309742150453258,
                        0.26332999757997144,
                        0.12270709926554241,
                        -0.07636581745528727,
                        0.33433163192709076,
                        0.07001406563885859,
                        0.056625247669840506,
                        -0.2213399951799987,
                        0.1790244290212559,
                        -0.058689625775336686,
                        -0.05280204064150597,
                        -0.1684954537821051,
                        -0.055102225774024564,
                        -0.21576056027706192,
                        0.058487053262653244,
                        0.2816845461855732,
                        0.4913713436469099,
                        -0.24858634401102836,
                        0.06662194111529261,
                        -0.056943256290600944,
                        0.06422551108918159,
                        -0.1675272456652939,
                        0.0718631184333736,
                        0.1578532428417314,
                        0.10340297601200217
                    ],
                    [
                        -0.09907401133969279,
                        -0.06769209613744596,
                        0.1400056582103902,
                        -0.07081277311635406,
                        -0.20201638526601637,
                        0.021673318525739046,
                        -0.6000584145663451,
                        0.1524518715909544,
                        0.08356885985453243,
                        0.1556739413395026,
                        -0.22916995912712107,
                        -0.2865278101429286,
                        -0.029843586148726033,
                        -0.08676839152156296,
                        0.17617409570307635,
                        -0.04114130111729991,
                        0.29410530449160693,
                        0.08392311761344197,
                        -0.2698599584124756,
                        -0.1568584755012574,
                        -0.17244640968156577,
                        0.11846346802965194,
                        -0.3972068938975344,
                        0.050449011531149696,
                        0.07845239742635148
                    ],
                    [
                        -0.12176009850336451,
                        -0.1647278675655993,
                        -0.5143587702963918,
                        0.08525645557170008,
                        0.19418924348942115,
                        -0.3856738247789029,
                        -0.16270684588693682,
                        0.1430801864485227,
                        0.019939313251509966,
                        0.139966610002172,
                        -0.20383317686974825,
                        0.13316516409872672,
                        -0.3769714089955618,
                        -0.41221875946008313,
                        0.3240860137945348,
                        0.11648851436046642,
                        -0.0607605593540292,
                        -0.1266821704642365,
                        -0.14386475943071203,
                        -0.27102452423362944,
                        0.10425999594747047,
                        0.11588058855552158,
                        0.1907703624307756,
                        0.17047325095429938,
                        -0.306438636348088
                    ],
                    [
                        -0.2372566569271217,
                        0.2112166199895619,
                        0.2335855852351612,
                        0.04545813174954006,
                        0.06624643571661593,
                        0.14941682545369792,
                        0.05545218314332644,
                        -0.052087996747229526,
                        -0.04295232431425983,
                        0.19965445265325915,
                        0.02615258153928029,
                        -0.021873733293860113,
                        -0.047533611327106,
                        0.3242825722572169,
                        0.11602783747493398,
                        0.12257543067175812,
                        0.34052627528924584,
                        -0.2512970906038231,
                        0.10185109204844295,
                        0.2737936772383658,
                        0.15066606326400045,
                        0.14526068243999915,
                        -0.196553544102598,
                        -0.14743189159214626,
                        -0.07075209063811656
                    ],
                    [
                        0.20868419834081503,
                        -0.28248478238646596,
                        0.14858381753918312,
                        0.21634322834000586,
                        -0.03273669156361377,
                        0.06473334509074254,
                        0.12388948325432106,
                        0.07446989752588305,
                        -0.07911620297299897,
                        -0.12459827857169357,
                        0.1906030749677755,
                        0.1766032943610618,
                        -0.1090941540741786,
                        0.19865082506760676,
                        -0.17207863258362566,
                        0.10009570613622308,
                        0.08143340998796424,
                        -0.17668930748133949,
                        0.39885889830886345,
                        0.22336657803218546,
                        -0.023280837410277803,
                        0.24232702029285572,
                        0.03147143233058722,
                        -0.030816483414829055,
                        0.2092024507503485
                    ],
                    [
                        -0.12606806351764052,
                        -0.12003115537293473,
                        -0.05686004593353287,
                        0.19491008020116962,
                        -0.06269795703288247,
                        -0.04649313173402454,
                        -0.07236307583934375,
                        -0.23423868352909993,
                        0.084877435561864,
                        -0.4818993014290026,
                        -0.03461703403808999,
                        0.13509974996919968,
                        -0.01616160934355133,
                        -0.21105362665372476,
                        0.10103780914127979,
                        -0.10375091262815839,
                        0.16507003249893998,
                        0.11032731167716221,
                        -0.05054060038637226,
                        -0.04300063841995873,
                        -0.054503122157761486,
                        -0.1843608627885317,
                        0.18929805418198598,
                        0.1802474517609163,
                        0.26363754486104246
                    ]
                ],
                "ActivatorType": "LeakyReLU",
                "GradientAdjustmentParameters": {
                    "StepSize": 0.01,
                    "FirstMomentDecay": 0.9,
                    "SecondMomentDecay": 0.999,
                    "DenominatorFactor": 1e-08,
                    "Type": "Adam"
                },
                "Type": "Standard"
            },
            "DecayRate": 1e-08
        },
        {
            "Type": "WeightDecay",
            "UnderlyingSerializedLayer": {
                "Bias": [
                    0,
                    0,
                    0,
                    0,
                    0,
                    0,
                    0,
                    0,
                    0,
                    0
                ],
                "Weights": [
                    [
                        0.2612695519188326,
                        2.559298851669155e-05,
                        -0.053899559131033406,
                        -0.24709291307740722,
                        -0.18535803512484722,
                        0.04336176835029541,
                        -0.2487469886016178,
                        -0.1999367812226073,
                        0.20815222663388427,
                        -0.16405183895593503
                    ],
                    [
                        0.2895243849751927,
                        -0.16080453433145483,
                        0.05635920565139364,
                        -0.03953861328722225,
                        0.2611941945659965,
                        -0.23116096674933348,
                        0.27820696333892986,
                        -0.05346541423785969,
                        -0.048309830510801156,
                        0.10306963408177479
                    ],
                    [
                        -0.01536337221722963,
                        0.11003544675553208,
                        0.20569866533548942,
                        -0.269989136790211,
                        0.043350724795466845,
                        0.2444373999478633,
                        0.19073343460940415,
                        0.05297167189126365,
                        0.01570505210988619,
                        -0.03840436300584596
                    ],
                    [
                        -0.29778374503435673,
                        -0.16151358939711363,
                        0.07226001919743445,
                        0.25654458038316874,
                        -0.09107647319400286,
                        -0.08417086712757679,
                        0.303411552441734,
                        -0.08733002441281427,
                        0.12654367148738596,
                        -0.0013748856595681583
                    ],
                    [
                        -0.24897043700786534,
                        -0.26020484840908137,
                        -0.4146204884823199,
                        -0.10878561427751221,
                        -0.23876971133558472,
                        0.029355034116995256,
                        -0.43154884744136623,
                        0.20211317937223727,
                        -0.134435959044477,
                        0.05815979887240724
                    ],
                    [
                        -0.3727579825170857,
                        -0.05470654075560684,
                        0.03030200116540288,
                        0.23320258562867974,
                        -0.003879725033933833,
                        0.00012287302870266393,
                        -0.1367428572911071,
                        0.012850945360196448,
                        0.030546469111434906,
                        -0.0445718861593859
                    ],
                    [
                        0.007656822051763008,
                        0.01058504633744188,
                        -0.04992479197176328,
                        0.0825994684607375,
                        0.33531862082911523,
                        -0.04197865411845283,
                        -0.33925095214091544,
                        -0.1184358594478411,
                        -0.14337315479951454,
                        0.2176353047114039
                    ],
                    [
                        0.0588697343460068,
                        -0.15635444759162873,
                        0.023288527675841473,
                        -0.04656003919487689,
                        -0.18132896954112798,
                        0.20303716519031745,
                        -0.2725264928111874,
                        -0.04099739582217343,
                        -0.1868673480218275,
                        0.37721263787954307
                    ],
                    [
                        -0.06802966162894718,
                        0.18789904304560023,
                        -0.13212074831212614,
                        -0.3294531673098472,
                        0.29019134224130794,
                        0.257466954480431,
                        0.0329442616530316,
                        0.11240540150645134,
                        -0.16865815276550303,
                        0.15468671760770442
                    ],
                    [
                        0.3107044151729181,
                        -0.10825721600242406,
                        0.2915959689841695,
                        -0.2844452182635011,
                        0.029922414444996565,
                        -0.12023211924114044,
                        -0.06589196460262235,
                        0.22505254018595716,
                        -0.1071938806349362,
                        -0.19489910126385093
                    ],
                    [
                        0.2639996773609387,
                        0.33194166181658996,
                        0.2941733692337065,
                        -0.16037977013319257,
                        -0.006677738172013946,
                        0.38126196313618554,
                        -0.1492973524201176,
                        -0.09984548224650455,
                        0.1874202605557611,
                        0.2515288995061822
                    ],
                    [
                        -0.12066076224953658,
                        -0.13745669874695557,
                        0.18895799503894628,
                        -0.02142712676941137,
                        -0.028784704101883676,
                        0.16715306584882497,
                        -0.15865779533350655,
                        -0.43223013927929516,
                        -0.2614402643875826,
                        -0.35939296897000717
                    ],
                    [
                        -0.3798355939665011,
                        -0.19230781980966632,
                        -0.18730688241984977,
                        0.026636400569709645,
                        0.1773617042124177,
                        -0.45957330451255124,
                        0.18392481561574547,
                        0.015401602618948983,
                        -0.30228172225455924,
                        -0.11274118843431176
                    ],
                    [
                        -0.1554408174387053,
                        -0.4247335821223637,
                        0.01602590025400223,
                        -0.1632005700250105,
                        0.10215643937141837,
                        0.004173959722252952,
                        -0.2500654360440297,
                        0.07234061937221453,
                        -0.00034935332165454214,
                        -0.08594196685320687
                    ],
                    [
                        0.10474336914681999,
                        0.05790056920641341,
                        -0.17961810715135876,
                        -0.15643871303035423,
                        0.25277363879114406,
                        -0.06673881826105327,
                        -0.18295927242890908,
                        0.09491112138930259,
                        0.23051962361466974,
                        -0.03758812379887011
                    ],
                    [
                        -0.12668012139694168,
                        -0.26645511307162645,
                        0.1105908858827752,
                        0.04503008913780382,
                        -0.05140509505863078,
                        0.1171344028529344,
                        -0.10154880651704197,
                        -0.10105078786648168,
                        0.1861060439665979,
                        -0.22547393519379888
                    ],
                    [
                        0.33129798671333344,
                        0.04545430902243444,
                        -0.16486152866347084,
                        -0.13967468143638165,
                        -0.16441885403849332,
                        -0.19221164904285365,
                        0.24856478612338676,
                        0.03719578408836262,
                        0.3854864208150061,
                        -0.08656331826018066
                    ],
                    [
                        -0.12327538397761198,
                        0.11384645565311387,
                        -0.06837273774900975,
                        0.04865642274025562,
                        -0.20863970174573343,
                        0.037713097649659306,
                        0.14731218151296663,
                        -0.025381798837468123,
                        -0.19009323642790543,
                        -0.006812743718685909
                    ],
                    [
                        -0.04854828099126014,
                        0.05173324776837327,
                        0.46111628455782805,
                        0.0330596552908336,
                        0.34814299587632785,
                        -0.29081025881759615,
                        0.1443409265612372,
                        -0.32068393311947907,
                        0.47146934212553016,
                        -0.030844993982116556
                    ],
                    [
                        0.011341493946258385,
                        0.41142311260817543,
                        -0.02517486543961931,
                        -0.059944544845376424,
                        -0.07447798721972268,
                        0.13055999559765127,
                        0.4297120651885634,
                        -0.0437091731142837,
                        -0.47854326716745216,
                        -0.062018289319758
                    ],
                    [
                        -0.23208873875065195,
                        -0.05368009466803203,
                        -0.34562861323762445,
                        -0.29626740858764533,
                        -0.02417712636497592,
                        0.09186492856388057,
                        0.01825122584207232,
                        0.16658369903973824,
                        0.005663204967993419,
                        -0.03555924409836552
                    ],
                    [
                        0.05277838034487911,
                        -0.058041847679440206,
                        0.16740778010959312,
                        0.11628174917860588,
                        0.33567291296987767,
                        -0.10576227535868016,
                        0.2925229263232124,
                        -0.13578904576167095,
                        -0.09140993412760462,
                        0.07437725388692809
                    ],
                    [
                        0.16749236737783882,
                        -0.1165190161907971,
                        -0.16494815577384148,
                        -0.10345925806287178,
                        0.15010050831153843,
                        0.26825289515789835,
                        0.0754382192746083,
                        0.14289701324737256,
                        0.077184504379785,
                        0.2638976333340379
                    ],
                    [
                        0.4157199692347163,
                        0.16430004296037992,
                        0.18612760830234715,
                        0.20859677134206867,
                        0.15728028094260812,
                        0.21399114365178507,
                        -0.013149529529280408,
                        -0.19903218658323457,
                        0.16298866068627094,
                        0.370353444082151
                    ],
                    [
                        0.08479510414151897,
                        -0.2145758435066576,
                        -0.1258735888693727,
                        -0.38581680570440835,
                        -0.1195106196612025,
                        -0.0034562930596122193,
                        0.08501903372154258,
                        -0.2166100586413635,
                        -0.08748787368791967,
                        -0.09328414031270033
                    ]
                ],
                "ActivatorType": "LeakyReLU",
                "GradientAdjustmentParameters": {
                    "StepSize": 0.01,
                    "FirstMomentDecay": 0.9,
                    "SecondMomentDecay": 0.999,
                    "DenominatorFactor": 1e-08,
                    "Type": "Adam"
                },
                "Type": "Standard"
            },
            "DecayRate": 1e-08
        },
        {
            "Type": "WeightDecay",
            "UnderlyingSerializedLayer": {
                "Bias": [
                    0,
                    0,
                    0,
                    0,
                    0,
                    0,
                    0,
                    0,
                    0,
                    0
                ],
                "Weights": [
                    [
                        -0.3364817027139845,
                        -0.14396694457848735,
                        0.11347800642358981,
                        -0.13922346504530564,
                        0.5546417955476688,
                        -0.23936760110747224,
                        -0.07626280579441023,
                        0.2047487393089839,
                        0.09512759824975495,
                        -0.28747345231925614
                    ],
                    [
                        -0.5305554189223856,
                        0.1450445801794378,
                        -0.10377710376209563,
                        0.38772987475150134,
                        0.5399793624919548,
                        0.24196627501318788,
                        -0.2777544488226907,
                        0.09404192913738277,
                        0.3513662603474523,
                        0.07485712061234588
                    ],
                    [
                        -0.780006552861748,
                        -0.21544036551803683,
                        -0.512950609722658,
                        -0.04132106348547978,
                        -0.20155960042103158,
                        0.3560551417609444,
                        0.3080425639500146,
                        -0.37630339582642897,
                        -0.2278256681354292,
                        0.03747947941115082
                    ],
                    [
                        0.14608705745032033,
                        -0.5082498222461624,
                        0.08581789781753994,
                        0.26133406964660677,
                        -0.23761815794130123,
                        0.5195121901345394,
                        -0.06441453107896597,
                        0.5676061812359786,
                        -0.32115494652467474,
                        -0.07693956034836513
                    ],
                    [
                        -0.13827903132885755,
                        -0.2800919997952355,
                        -0.09213861444458304,
                        -0.17576385173848977,
                        0.46911717950274584,
                        0.04282157327187536,
                        0.15095248857511057,
                        -0.23658927066882118,
                        0.13292300347100125,
                        -0.3624180240448197
                    ],
                    [
                        -0.5286072856024965,
                        0.15433968496225817,
                        0.7074707584010894,
                        -0.1347430101063028,
                        0.2813226802549736,
                        0.6766061621625008,
                        -0.02594908494797219,
                        -0.23394470528720832,
                        -0.41492026233135193,
                        -0.12428116141921702
                    ],
                    [
                        -0.43014608331628856,
                        -0.19212745091530048,
                        -0.26835638718071475,
                        -0.16590116216679146,
                        0.4493380716498953,
                        -0.12334425044642547,
                        0.31114463293759675,
                        -0.490637076239634,
                        -0.5115457604693457,
                        0.21469912757431237
                    ],
                    [
                        -0.3843957737410942,
                        -0.01821842481061997,
                        0.11298648972836066,
                        -0.05823761499163516,
                        0.21529990594167264,
                        0.12124613432579211,
                        0.6570957307794484,
                        -0.12695098252716272,
                        -0.496335077706125,
                        -0.4223788008161611
                    ],
                    [
                        0.2232435691607379,
                        -0.278465164262475,
                        0.09062592454935935,
                        -0.4513029500329826,
                        0.30886292553737865,
                        -0.2134777923529398,
                        0.17532970341693963,
                        0.03437763843663716,
                        -0.43379908916594234,
                        0.21030781305970564
                    ],
                    [
                        0.2980700981352494,
                        -0.4353150312923586,
                        0.05648747307549394,
                        0.31020891926294636,
                        0.22287848294389134,
                        0.398864260592934,
                        0.32483484049247247,
                        -0.15369519024490055,
                        -0.313014515921313,
                        0.04507232099858506
                    ]
                ],
                "ActivatorType": "LeakyReLU",
                "GradientAdjustmentParameters": {
                    "StepSize": 0.01,
                    "FirstMomentDecay": 0.9,
                    "SecondMomentDecay": 0.999,
                    "DenominatorFactor": 1e-08,
                    "Type": "Adam"
                },
                "Type": "Standard"
            },
            "DecayRate": 1e-08
        },
        {
            "Type": "WeightDecay",
            "UnderlyingSerializedLayer": {
                "Bias": [
                    0
                ],
                "Weights": [
                    [
                        -0.17155490837987422
                    ],
                    [
                        0.25792524810616724
                    ],
                    [
                        -0.8547709336746817
                    ],
                    [
                        0.08241160697354723
                    ],
                    [
                        -0.11268074445132481
                    ],
                    [
                        0.026148057513383217
                    ],
                    [
                        -0.5046681749017133
                    ],
                    [
                        0.23923493648951033
                    ],
                    [
                        -0.019118996402013477
                    ],
                    [
                        -0.23599268188314138
                    ]
                ],
                "ActivatorType": "LeakyReLU",
                "GradientAdjustmentParameters": {
                    "StepSize": 0.01,
                    "FirstMomentDecay": 0.9,
                    "SecondMomentDecay": 0.999,
                    "DenominatorFactor": 1e-08,
                    "Type": "Adam"
                },
                "Type": "Standard"
            },
            "DecayRate": 1e-08
        }
    ]
}
