{
  "merchantID": {
    "value": "",
    "type": "password",
    "class": "",
    "panel": "credentials",
    "section": "credentials",
    "sort": 1,
    "label": "Merchant ID",
    "description": "Ihre PayPal Merchant ID"
  },
  "clientID": {
    "value": "",
    "type": "password",
    "class": "",
    "panel": "credentials",
    "section": "credentials",
    "sort": 2,
    "label": "Client ID",
    "description": "Ihre PayPal Client ID"
  },
  "clientSecret": {
    "value": "",
    "type": "password",
    "class": "",
    "sort": 3,
    "panel": "credentials",
    "section": "credentials",
    "label": "Client Secret",
    "description": "Ihr PayPal Client Secret"
  },
  "smartPaymentButtons_shape": {
    "value": "rect",
    "type": "selectbox",
    "class": "",
    "panel": "display",
    "section": "smartPaymentButtons",
    "sort": 1,
    "description": "Hier k\u00f6nnen Sie die Form der Zahlungsbuttons \u00e4ndern",
    "label": "Form",
    "options": [
      {
        "value": "pill",
        "label": "abgerundet"
      },
      {
        "value": "rect",
        "label": "rechteckig (abgerundete Ecken)"
      }
    ]
  },
  "smartPaymentButtons_color": {
    "value": "gold",
    "type": "selectbox",
    "class": "",
    "panel": "display",
    "section": "smartPaymentButtons",
    "sort": 2,
    "label": "Farbschema",
    "loadAfter": "snippets\/buttonPreview.tpl",
    "description": "Hier k\u00f6nnen Sie die Farbe der Zahlungsbuttons \u00e4ndern",
    "options": [
      {
        "value": "blue",
        "label": "blau"
      },
      {
        "value": "black",
        "label": "schwarz"
      },
      {
        "value": "white",
        "label": "wei\u00df"
      },
      {
        "value": "silver",
        "label": "silber"
      },
      {
        "value": "gold",
        "label": "gold"
      }
    ]
  },
  "vaultingDisplay_activateVaulting": {
    "value": "Y",
    "triggerWarn": [
      "N"
    ],
    "type": "selectbox",
    "class": "",
    "panel": "expressBuy",
    "section": "vaultingDisplay",
    "sort": 10,
    "description": "Hier k\u00f6nnen Sie Vaulting aktivieren",
    "label": "Vaulting aktivieren",
    "loadAfter": "snippets\/selectToggleScript.tpl",
    "options": [
      {
        "value": "Y",
        "label": "Ja"
      },
      {
        "value": "N",
        "label": "Nein"
      }
    ]
  },
  "expressBuyDisplay_activate": {
    "value": "Y",
    "triggerWarn": [
      "N"
    ],
    "type": "selectbox",
    "class": "",
    "panel": "expressBuy",
    "section": "expressBuyDisplay",
    "sort": 10,
    "description": "Hier k\u00f6nnen Sie Expresskauf aktivieren",
    "label": "Expresskauf aktivieren",
    "loadAfter": "snippets\/selectToggleScript.tpl",
    "options": [
      {
        "value": "Y",
        "label": "Ja"
      },
      {
        "value": "N",
        "label": "Nein"
      }
    ]
  },
  "expressBuyDisplay_handleInvoiceAddress": {
    "value": "E",
    "type": "selectbox",
    "panel": "expressBuy",
    "section": "expressBuyDisplay",
    "sort": 15,
    "class": "d-none expressBuyDisplay_activate_toggle",
    "description": "Hier legen Sie fest, wie fehlende Rechnungsadressdaten vervollst\u00e4ndigt werden sollen",
    "label": "Fehlende Adressdaten vervollst\u00e4ndigen",
    "options": [
      {
        "value": "E",
        "label": "Aus Lieferadresse erg\u00e4nzen und zur \u00dcberpr\u00fcfung anzeigen"
      },
      {
        "value": "Y",
        "label": "Aus Lieferadresse erg\u00e4nzen und fortfahren"
      },
      {
        "value": "O",
        "label": "Komplette Lieferadresse als Rechnungsadresse verwenden"
      },
      {
        "value": "N",
        "label": "Fehlende Daten durch Kunden erg\u00e4nzen lassen"
      }
    ]
  },
  "expressBuyDisplay_showInProductDetails": {
    "value": "Y",
    "type": "selectbox",
    "panel": "expressBuy",
    "section": "expressBuyDisplay",
    "sort": 20,
    "class": "d-none expressBuyDisplay_activate_toggle singleActivator_expressBuyDisplay",
    "description": "Expresskauf in den Artikeldetails anzeigen",
    "label": "Expresskauf in den Artikeldetails anzeigen",
    "loadAfter": "snippets\/advancedSettings.tpl",
    "options": [
      {
        "value": "Y",
        "label": "Ja"
      },
      {
        "value": "N",
        "label": "Nein"
      }
    ]
  },
  "expressBuyDisplay_showInCart": {
    "value": "Y",
    "type": "selectbox",
    "panel": "expressBuy",
    "section": "expressBuyDisplay",
    "sort": 30,
    "class": "d-none expressBuyDisplay_activate_toggle singleActivator_expressBuyDisplay",
    "description": "Expresskauf im Warenkorb anzeigen",
    "label": "Expresskauf im Warenkorb anzeigen",
    "loadAfter": "snippets\/advancedSettings.tpl",
    "options": [
      {
        "value": "Y",
        "label": "Ja"
      },
      {
        "value": "N",
        "label": "Nein"
      }
    ]
  },
  "expressBuyDisplay_showInOrderProcess": {
    "value": "Y",
    "type": "selectbox",
    "panel": "expressBuy",
    "section": "expressBuyDisplay",
    "sort": 40,
    "class": "d-none expressBuyDisplay_activate_toggle singleActivator_expressBuyDisplay",
    "description": "Anzeige im Bestellvorgang",
    "label": "Anzeige im Bestellvorgang",
    "loadAfter": "snippets\/advancedSettings.tpl",
    "options": [
      {
        "value": "Y",
        "label": "Ja"
      },
      {
        "value": "N",
        "label": "Nein"
      }
    ]
  },
  "expressBuyDisplay_showInMiniCart": {
    "value": "Y",
    "type": "selectbox",
    "panel": "expressBuy",
    "section": "expressBuyDisplay",
    "vars": {
      "section": "expressBuyDisplay"
    },
    "sort": 50,
    "class": "d-none expressBuyDisplay_activate_toggle singleActivator_expressBuyDisplay",
    "description": "Expresskauf im Mini-Warenkorb anzeigen",
    "label": "Expresskauf im Mini-Warenkorb anzeigen",
    "loadAfter": [
      "snippets\/advancedSettings.tpl",
      "snippets\/advancedSettingsScript.tpl"
    ],
    "options": [
      {
        "value": "Y",
        "label": "Ja"
      },
      {
        "value": "N",
        "label": "Nein"
      }
    ]
  },
  "ACDCDisplay_activate3DSecure": {
    "value": "Y",
    "type": "selectbox",
    "class": "singleActivator_ACDCDisplay",
    "panel": "ACDC",
    "section": "ACDCDisplay",
    "sort": 10,
    "description": "3D Secure aktivieren (Empfohlen)",
    "label": "3D Secure aktivieren",
    "loadAfter": "snippets\/selectToggleScript.tpl",
    "options": [
      {
        "value": "Y",
        "label": "Ja (Empfohlen)"
      },
      {
        "value": "N",
        "label": "Nein"
      }
    ]
  },
  "ACDCDisplay_mode3DSecure": {
    "value": "SCA_WHEN_REQUIRED",
    "type": "selectbox",
    "class": "d-none ACDCDisplay_activate3DSecure_toggle",
    "panel": "ACDC",
    "section": "ACDCDisplay",
    "sort": 20,
    "description": "3D Secure SCA Beschreibung",
    "label": "3D Secure SCA",
    "options": [
      {
        "value": "SCA_WHEN_REQUIRED",
        "label": "Wenn ben\u00f6tigt (Empfohlen)"
      },
      {
        "value": "SCA_ALWAYS",
        "label": "Immer"
      }
    ]
  },
  "ApplePayDisplay_activated": {
    "value": "N",
    "type": "selectbox",
    "class": "singleActivator_ApplePayDisplay",
    "panel": "ApplePay",
    "section": "ApplePayDisplay",
    "sort": 10,
    "description": "Ihr Shop muss f\u00fcr Apple Pay registriert werden",
    "label": "Haben Sie die Registrierung durchgef\u00fchrt",
    "loadAfter": "snippets\/selectToggleScript.tpl",
    "options": [
      {
        "value": "Y",
        "label": "Ja"
      },
      {
        "value": "N",
        "label": "Nein"
      }
    ]
  },
  "ApplePayDisplay_version": {
    "value": "1.0",
    "type": "hidden",
    "class": "hidden",
    "panel": "ApplePay",
    "section": "ApplePayDisplay",
    "sort": 11,
    "description": "",
    "label": ""
  },
  "instalmentBannerDisplay_activate": {
    "value": "Y",
    "triggerWarn": [
      "N"
    ],
    "type": "selectbox",
    "class": "",
    "panel": "instalmentBanner",
    "section": "instalmentBannerDisplay",
    "sort": 10,
    "description": "PayPal Ratenzahlung Banner aktivieren",
    "label": "PayPal Ratenzahlung Banner aktivieren",
    "loadAfter": "snippets\/selectToggleScript.tpl",
    "options": [
      {
        "value": "Y",
        "label": "Ja"
      },
      {
        "value": "N",
        "label": "Nein"
      }
    ]
  },
  "instalmentBannerDisplay_showInProductDetails": {
    "value": "Y",
    "type": "selectbox",
    "panel": "instalmentBanner",
    "section": "instalmentBannerDisplay",
    "sort": 20,
    "class": "d-none instalmentBannerDisplay_activate_toggle singleActivator_instalmentBannerDisplay",
    "description": "Anzeige auf der Artikeldetailseite",
    "label": "Anzeige auf der Artikeldetailseite",
    "loadAfter": "snippets\/advancedSettings.tpl",
    "options": [
      {
        "value": "Y",
        "label": "Ja"
      },
      {
        "value": "N",
        "label": "Nein"
      }
    ]
  },
  "instalmentBannerDisplay_showInCart": {
    "value": "Y",
    "type": "selectbox",
    "panel": "instalmentBanner",
    "section": "instalmentBannerDisplay",
    "sort": 30,
    "class": "d-none instalmentBannerDisplay_activate_toggle singleActivator_instalmentBannerDisplay",
    "description": "Anzeige im Warenkorb",
    "label": "Anzeige im Warenkorb",
    "loadAfter": "snippets\/advancedSettings.tpl",
    "options": [
      {
        "value": "Y",
        "label": "Ja"
      },
      {
        "value": "N",
        "label": "Nein"
      }
    ]
  },
  "instalmentBannerDisplay_showInOrderProcess": {
    "value": "Y",
    "type": "selectbox",
    "panel": "instalmentBanner",
    "section": "instalmentBannerDisplay",
    "sort": 40,
    "class": "d-none instalmentBannerDisplay_activate_toggle singleActivator_instalmentBannerDisplay",
    "description": "Anzeige im Bestellvorgang",
    "label": "Anzeige im Bestellvorgang",
    "loadAfter": "snippets\/advancedSettings.tpl",
    "options": [
      {
        "value": "Y",
        "label": "Ja"
      },
      {
        "value": "N",
        "label": "Nein"
      }
    ]
  },
  "instalmentBannerDisplay_showInMiniCart": {
    "value": "Y",
    "type": "selectbox",
    "panel": "instalmentBanner",
    "vars": {
      "section": "instalmentBannerDisplay"
    },
    "section": "instalmentBannerDisplay",
    "sort": 50,
    "class": "d-none instalmentBannerDisplay_activate_toggle singleActivator_instalmentBannerDisplay",
    "description": "Anzeige im Mini-Warenkorb",
    "label": "Anzeige im Mini-Warenkorb",
    "loadAfter": [
      "snippets\/advancedSettings.tpl",
      "snippets\/advancedSettingsScript.tpl"
    ],
    "options": [
      {
        "value": "Y",
        "label": "Ja"
      },
      {
        "value": "N",
        "label": "Nein"
      }
    ]
  },
  "general_templateSupport": {
    "value": "NOVA",
    "type": "selectbox",
    "vars": {
      "scopes": [
        "productDetails",
        "miniCart",
        "cart",
        "orderProcess"
      ],
      "tplDefaults": {
        "NOVA": {
          "instalmentBannerDisplay": {
            "selector": {
              "productDetails": "#add-to-cart.product-buy",
              "cart": "#cart-checkout-btn",
              "orderProcess": "#fieldset-payment .row",
              "miniCart": ".cart-dropdown-buttons:first"
            },
            "method": {
              "productDetails": "after",
              "cart": "after",
              "orderProcess": "after",
              "miniCart": "after"
            }
          },
          "expressBuyDisplay": {
            "selector": {
              "productDetails": "#add-to-cart",
              "cart": "#cart-checkout-btn",
              "orderProcess": "#order_register_or_login",
              "miniCart": ".cart-dropdown-buttons:first"
            },
            "method": {
              "productDetails": "append",
              "cart": "after",
              "orderProcess": "after",
              "miniCart": "append"
            }
          }
        }
      },
      "sections": [
        "expressBuyDisplay",
        "instalmentBannerDisplay"
      ]
    },
    "class": "",
    "panel": "general",
    "section": "general",
    "sort": 10,
    "description": "templateSupportDescription",
    "label": "Template Unterst\u00fctzung",
    "loadAfter": "snippets\/templateSupportScript.tpl",
    "options": [
      {
        "value": "NOVA",
        "label": "NOVA"
      },
      {
        "value": "custom",
        "label": "Individuell"
      }
    ]
  },
  "general_purchaseDescription": {
    "value": "Y",
    "type": "selectbox",
    "panel": "general",
    "section": "general",
    "sort": 20,
    "class": "",
    "description": "longPurchaseDescriptionDescription",
    "label": "Beschreibung der Kaufdetails",
    "options": [
      {
        "value": "Y",
        "label": "Auflistung der Artikelnamen"
      },
      {
        "value": "N",
        "label": "Eigener Text \u00fcber Sprachvariable"
      }
    ]
  },
  "consentManager_activate": {
    "value": "N",
    "type": "selectbox",
    "panel": "general",
    "section": "consentManager",
    "sort": 30,
    "class": "",
    "description": "consentManagerActivateDescription",
    "label": "Consent-Manager aktivieren",
    "options": [
      {
        "value": "Y",
        "label": "Ja"
      },
      {
        "value": "N",
        "label": "Nein"
      }
    ]
  },
  "paymentMethods_enabled": {
    "value": [
      "bancontact",
      "blik",
      "eps",
      "ideal",
      "mercadopago",
      "mybank",
      "p24",
      "sepa",
      "sofort",
      "venmo",
      "card",
      "credit",
      "paylater",
      "satispay"
    ],
    "type": "activationList",
    "vars": {
      "selectGroups": {
        "cards_fundingSource": [
          "card"
        ],
        "credit_fundingSource": [
          "credit",
          "paylater"
        ],
        "bank_fundingSource": [
          "bancontact",
          "blik",
          "eps",
          "ideal",
          "mercadopago",
          "mybank",
          "p24",
          "sepa",
          "sofort",
          "venmo"
        ]
      }
    },
    "class": "",
    "panel": "paymentMethodsPanel",
    "section": "paymentMethods",
    "sort": 70,
    "label": "paymentMethodsPanel",
    "label2": "paymentMethodsPanelCountries",
    "description": "Legen Sie hier fest, welche Zahlungsarten generell angezeigt werden sollen.",
    "options": [
      {
        "label": "bancontact",
        "value": "bancontact",
        "extended": {
          "card": "Alle von PayPal unterst\u00fctzten L\u00e4nder",
          "credit": "Australien, Frankreich, Gro\u00dfbritannien, Italien, Spanien, Vereinigte Staaten",
          "paylater": "Deutschland",
          "bancontact": "Belgien",
          "blik": "Polen",
          "eps": "\u00d6sterreich",
          "ideal": "Niederlande",
          "mercadopago": "Brasilien, Mexico",
          "mybank": "Italien",
          "p24": "Polen",
          "sepa": "Deutschland",
          "sofort": "\u00d6sterreich, Belgien, Deutschland, Italien, Niederlande, Spanien, Gro\u00dfbritannien",
          "venmo": "Vereinigte Staaten",
          "satispay": "Luxemburg, \u00d6sterreich, Belgien, Frankreich, Deutschland, Irland, Italien, Niederlande, Spanien"
        },
        "action": {
          "bancontact": "APMSettings",
          "blik": "APMSettings",
          "eps": "APMSettings",
          "ideal": "APMSettings",
          "mercadopago": "APMSettings",
          "mybank": "APMSettings",
          "p24": "APMSettings",
          "sepa": "APMSettings",
          "sofort": "APMSettings",
          "venmo": "APMSettings",
          "card": "APMSettings",
          "credit": "APMSettings",
          "paylater": "APMSettings",
          "satispay": "APMSettings"
        }
      },
      {
        "label": "blik",
        "value": "blik",
        "extended": {
          "card": "Alle von PayPal unterst\u00fctzten L\u00e4nder",
          "credit": "Australien, Frankreich, Gro\u00dfbritannien, Italien, Spanien, Vereinigte Staaten",
          "paylater": "Deutschland",
          "bancontact": "Belgien",
          "blik": "Polen",
          "eps": "\u00d6sterreich",
          "ideal": "Niederlande",
          "mercadopago": "Brasilien, Mexico",
          "mybank": "Italien",
          "p24": "Polen",
          "sepa": "Deutschland",
          "sofort": "\u00d6sterreich, Belgien, Deutschland, Italien, Niederlande, Spanien, Gro\u00dfbritannien",
          "venmo": "Vereinigte Staaten",
          "satispay": "Luxemburg, \u00d6sterreich, Belgien, Frankreich, Deutschland, Irland, Italien, Niederlande, Spanien"
        },
        "action": {
          "bancontact": "APMSettings",
          "blik": "APMSettings",
          "eps": "APMSettings",
          "ideal": "APMSettings",
          "mercadopago": "APMSettings",
          "mybank": "APMSettings",
          "p24": "APMSettings",
          "sepa": "APMSettings",
          "sofort": "APMSettings",
          "venmo": "APMSettings",
          "card": "APMSettings",
          "credit": "APMSettings",
          "paylater": "APMSettings",
          "satispay": "APMSettings"
        }
      },
      {
        "label": "eps",
        "value": "eps",
        "extended": {
          "card": "Alle von PayPal unterst\u00fctzten L\u00e4nder",
          "credit": "Australien, Frankreich, Gro\u00dfbritannien, Italien, Spanien, Vereinigte Staaten",
          "paylater": "Deutschland",
          "bancontact": "Belgien",
          "blik": "Polen",
          "eps": "\u00d6sterreich",
          "ideal": "Niederlande",
          "mercadopago": "Brasilien, Mexico",
          "mybank": "Italien",
          "p24": "Polen",
          "sepa": "Deutschland",
          "sofort": "\u00d6sterreich, Belgien, Deutschland, Italien, Niederlande, Spanien, Gro\u00dfbritannien",
          "venmo": "Vereinigte Staaten",
          "satispay": "Luxemburg, \u00d6sterreich, Belgien, Frankreich, Deutschland, Irland, Italien, Niederlande, Spanien"
        },
        "action": {
          "bancontact": "APMSettings",
          "blik": "APMSettings",
          "eps": "APMSettings",
          "ideal": "APMSettings",
          "mercadopago": "APMSettings",
          "mybank": "APMSettings",
          "p24": "APMSettings",
          "sepa": "APMSettings",
          "sofort": "APMSettings",
          "venmo": "APMSettings",
          "card": "APMSettings",
          "credit": "APMSettings",
          "paylater": "APMSettings",
          "satispay": "APMSettings"
        }
      },
      {
        "label": "ideal",
        "value": "ideal",
        "extended": {
          "card": "Alle von PayPal unterst\u00fctzten L\u00e4nder",
          "credit": "Australien, Frankreich, Gro\u00dfbritannien, Italien, Spanien, Vereinigte Staaten",
          "paylater": "Deutschland",
          "bancontact": "Belgien",
          "blik": "Polen",
          "eps": "\u00d6sterreich",
          "ideal": "Niederlande",
          "mercadopago": "Brasilien, Mexico",
          "mybank": "Italien",
          "p24": "Polen",
          "sepa": "Deutschland",
          "sofort": "\u00d6sterreich, Belgien, Deutschland, Italien, Niederlande, Spanien, Gro\u00dfbritannien",
          "venmo": "Vereinigte Staaten",
          "satispay": "Luxemburg, \u00d6sterreich, Belgien, Frankreich, Deutschland, Irland, Italien, Niederlande, Spanien"
        },
        "action": {
          "bancontact": "APMSettings",
          "blik": "APMSettings",
          "eps": "APMSettings",
          "ideal": "APMSettings",
          "mercadopago": "APMSettings",
          "mybank": "APMSettings",
          "p24": "APMSettings",
          "sepa": "APMSettings",
          "sofort": "APMSettings",
          "venmo": "APMSettings",
          "card": "APMSettings",
          "credit": "APMSettings",
          "paylater": "APMSettings",
          "satispay": "APMSettings"
        }
      },
      {
        "label": "mercadopago",
        "value": "mercadopago",
        "extended": {
          "card": "Alle von PayPal unterst\u00fctzten L\u00e4nder",
          "credit": "Australien, Frankreich, Gro\u00dfbritannien, Italien, Spanien, Vereinigte Staaten",
          "paylater": "Deutschland",
          "bancontact": "Belgien",
          "blik": "Polen",
          "eps": "\u00d6sterreich",
          "ideal": "Niederlande",
          "mercadopago": "Brasilien, Mexico",
          "mybank": "Italien",
          "p24": "Polen",
          "sepa": "Deutschland",
          "sofort": "\u00d6sterreich, Belgien, Deutschland, Italien, Niederlande, Spanien, Gro\u00dfbritannien",
          "venmo": "Vereinigte Staaten",
          "satispay": "Luxemburg, \u00d6sterreich, Belgien, Frankreich, Deutschland, Irland, Italien, Niederlande, Spanien"
        },
        "action": {
          "bancontact": "APMSettings",
          "blik": "APMSettings",
          "eps": "APMSettings",
          "ideal": "APMSettings",
          "mercadopago": "APMSettings",
          "mybank": "APMSettings",
          "p24": "APMSettings",
          "sepa": "APMSettings",
          "sofort": "APMSettings",
          "venmo": "APMSettings",
          "card": "APMSettings",
          "credit": "APMSettings",
          "paylater": "APMSettings",
          "satispay": "APMSettings"
        }
      },
      {
        "label": "mybank",
        "value": "mybank",
        "extended": {
          "card": "Alle von PayPal unterst\u00fctzten L\u00e4nder",
          "credit": "Australien, Frankreich, Gro\u00dfbritannien, Italien, Spanien, Vereinigte Staaten",
          "paylater": "Deutschland",
          "bancontact": "Belgien",
          "blik": "Polen",
          "eps": "\u00d6sterreich",
          "ideal": "Niederlande",
          "mercadopago": "Brasilien, Mexico",
          "mybank": "Italien",
          "p24": "Polen",
          "sepa": "Deutschland",
          "sofort": "\u00d6sterreich, Belgien, Deutschland, Italien, Niederlande, Spanien, Gro\u00dfbritannien",
          "venmo": "Vereinigte Staaten",
          "satispay": "Luxemburg, \u00d6sterreich, Belgien, Frankreich, Deutschland, Irland, Italien, Niederlande, Spanien"
        },
        "action": {
          "bancontact": "APMSettings",
          "blik": "APMSettings",
          "eps": "APMSettings",
          "ideal": "APMSettings",
          "mercadopago": "APMSettings",
          "mybank": "APMSettings",
          "p24": "APMSettings",
          "sepa": "APMSettings",
          "sofort": "APMSettings",
          "venmo": "APMSettings",
          "card": "APMSettings",
          "credit": "APMSettings",
          "paylater": "APMSettings",
          "satispay": "APMSettings"
        }
      },
      {
        "label": "p24",
        "value": "p24",
        "extended": {
          "card": "Alle von PayPal unterst\u00fctzten L\u00e4nder",
          "credit": "Australien, Frankreich, Gro\u00dfbritannien, Italien, Spanien, Vereinigte Staaten",
          "paylater": "Deutschland",
          "bancontact": "Belgien",
          "blik": "Polen",
          "eps": "\u00d6sterreich",
          "ideal": "Niederlande",
          "mercadopago": "Brasilien, Mexico",
          "mybank": "Italien",
          "p24": "Polen",
          "sepa": "Deutschland",
          "sofort": "\u00d6sterreich, Belgien, Deutschland, Italien, Niederlande, Spanien, Gro\u00dfbritannien",
          "venmo": "Vereinigte Staaten",
          "satispay": "Luxemburg, \u00d6sterreich, Belgien, Frankreich, Deutschland, Irland, Italien, Niederlande, Spanien"
        },
        "action": {
          "bancontact": "APMSettings",
          "blik": "APMSettings",
          "eps": "APMSettings",
          "ideal": "APMSettings",
          "mercadopago": "APMSettings",
          "mybank": "APMSettings",
          "p24": "APMSettings",
          "sepa": "APMSettings",
          "sofort": "APMSettings",
          "venmo": "APMSettings",
          "card": "APMSettings",
          "credit": "APMSettings",
          "paylater": "APMSettings",
          "satispay": "APMSettings"
        }
      },
      {
        "label": "sepa",
        "value": "sepa",
        "extended": {
          "card": "Alle von PayPal unterst\u00fctzten L\u00e4nder",
          "credit": "Australien, Frankreich, Gro\u00dfbritannien, Italien, Spanien, Vereinigte Staaten",
          "paylater": "Deutschland",
          "bancontact": "Belgien",
          "blik": "Polen",
          "eps": "\u00d6sterreich",
          "ideal": "Niederlande",
          "mercadopago": "Brasilien, Mexico",
          "mybank": "Italien",
          "p24": "Polen",
          "sepa": "Deutschland",
          "sofort": "\u00d6sterreich, Belgien, Deutschland, Italien, Niederlande, Spanien, Gro\u00dfbritannien",
          "venmo": "Vereinigte Staaten",
          "satispay": "Luxemburg, \u00d6sterreich, Belgien, Frankreich, Deutschland, Irland, Italien, Niederlande, Spanien"
        },
        "action": {
          "bancontact": "APMSettings",
          "blik": "APMSettings",
          "eps": "APMSettings",
          "ideal": "APMSettings",
          "mercadopago": "APMSettings",
          "mybank": "APMSettings",
          "p24": "APMSettings",
          "sepa": "APMSettings",
          "sofort": "APMSettings",
          "venmo": "APMSettings",
          "card": "APMSettings",
          "credit": "APMSettings",
          "paylater": "APMSettings",
          "satispay": "APMSettings"
        }
      },
      {
        "label": "sofort",
        "value": "sofort",
        "extended": {
          "card": "Alle von PayPal unterst\u00fctzten L\u00e4nder",
          "credit": "Australien, Frankreich, Gro\u00dfbritannien, Italien, Spanien, Vereinigte Staaten",
          "paylater": "Deutschland",
          "bancontact": "Belgien",
          "blik": "Polen",
          "eps": "\u00d6sterreich",
          "ideal": "Niederlande",
          "mercadopago": "Brasilien, Mexico",
          "mybank": "Italien",
          "p24": "Polen",
          "sepa": "Deutschland",
          "sofort": "\u00d6sterreich, Belgien, Deutschland, Italien, Niederlande, Spanien, Gro\u00dfbritannien",
          "venmo": "Vereinigte Staaten",
          "satispay": "Luxemburg, \u00d6sterreich, Belgien, Frankreich, Deutschland, Irland, Italien, Niederlande, Spanien"
        },
        "action": {
          "bancontact": "APMSettings",
          "blik": "APMSettings",
          "eps": "APMSettings",
          "ideal": "APMSettings",
          "mercadopago": "APMSettings",
          "mybank": "APMSettings",
          "p24": "APMSettings",
          "sepa": "APMSettings",
          "sofort": "APMSettings",
          "venmo": "APMSettings",
          "card": "APMSettings",
          "credit": "APMSettings",
          "paylater": "APMSettings",
          "satispay": "APMSettings"
        }
      },
      {
        "label": "venmo",
        "value": "venmo",
        "extended": {
          "card": "Alle von PayPal unterst\u00fctzten L\u00e4nder",
          "credit": "Australien, Frankreich, Gro\u00dfbritannien, Italien, Spanien, Vereinigte Staaten",
          "paylater": "Deutschland",
          "bancontact": "Belgien",
          "blik": "Polen",
          "eps": "\u00d6sterreich",
          "ideal": "Niederlande",
          "mercadopago": "Brasilien, Mexico",
          "mybank": "Italien",
          "p24": "Polen",
          "sepa": "Deutschland",
          "sofort": "\u00d6sterreich, Belgien, Deutschland, Italien, Niederlande, Spanien, Gro\u00dfbritannien",
          "venmo": "Vereinigte Staaten",
          "satispay": "Luxemburg, \u00d6sterreich, Belgien, Frankreich, Deutschland, Irland, Italien, Niederlande, Spanien"
        },
        "action": {
          "bancontact": "APMSettings",
          "blik": "APMSettings",
          "eps": "APMSettings",
          "ideal": "APMSettings",
          "mercadopago": "APMSettings",
          "mybank": "APMSettings",
          "p24": "APMSettings",
          "sepa": "APMSettings",
          "sofort": "APMSettings",
          "venmo": "APMSettings",
          "card": "APMSettings",
          "credit": "APMSettings",
          "paylater": "APMSettings",
          "satispay": "APMSettings"
        }
      },
      {
        "label": "card",
        "value": "card",
        "extended": {
          "card": "Alle von PayPal unterst\u00fctzten L\u00e4nder",
          "credit": "Australien, Frankreich, Gro\u00dfbritannien, Italien, Spanien, Vereinigte Staaten",
          "paylater": "Deutschland",
          "bancontact": "Belgien",
          "blik": "Polen",
          "eps": "\u00d6sterreich",
          "ideal": "Niederlande",
          "mercadopago": "Brasilien, Mexico",
          "mybank": "Italien",
          "p24": "Polen",
          "sepa": "Deutschland",
          "sofort": "\u00d6sterreich, Belgien, Deutschland, Italien, Niederlande, Spanien, Gro\u00dfbritannien",
          "venmo": "Vereinigte Staaten",
          "satispay": "Luxemburg, \u00d6sterreich, Belgien, Frankreich, Deutschland, Irland, Italien, Niederlande, Spanien"
        },
        "action": {
          "bancontact": "APMSettings",
          "blik": "APMSettings",
          "eps": "APMSettings",
          "ideal": "APMSettings",
          "mercadopago": "APMSettings",
          "mybank": "APMSettings",
          "p24": "APMSettings",
          "sepa": "APMSettings",
          "sofort": "APMSettings",
          "venmo": "APMSettings",
          "card": "APMSettings",
          "credit": "APMSettings",
          "paylater": "APMSettings",
          "satispay": "APMSettings"
        }
      },
      {
        "label": "credit",
        "value": "credit",
        "extended": {
          "card": "Alle von PayPal unterst\u00fctzten L\u00e4nder",
          "credit": "Australien, Frankreich, Gro\u00dfbritannien, Italien, Spanien, Vereinigte Staaten",
          "paylater": "Deutschland",
          "bancontact": "Belgien",
          "blik": "Polen",
          "eps": "\u00d6sterreich",
          "ideal": "Niederlande",
          "mercadopago": "Brasilien, Mexico",
          "mybank": "Italien",
          "p24": "Polen",
          "sepa": "Deutschland",
          "sofort": "\u00d6sterreich, Belgien, Deutschland, Italien, Niederlande, Spanien, Gro\u00dfbritannien",
          "venmo": "Vereinigte Staaten",
          "satispay": "Luxemburg, \u00d6sterreich, Belgien, Frankreich, Deutschland, Irland, Italien, Niederlande, Spanien"
        },
        "action": {
          "bancontact": "APMSettings",
          "blik": "APMSettings",
          "eps": "APMSettings",
          "ideal": "APMSettings",
          "mercadopago": "APMSettings",
          "mybank": "APMSettings",
          "p24": "APMSettings",
          "sepa": "APMSettings",
          "sofort": "APMSettings",
          "venmo": "APMSettings",
          "card": "APMSettings",
          "credit": "APMSettings",
          "paylater": "APMSettings",
          "satispay": "APMSettings"
        }
      },
      {
        "label": "paylater",
        "value": "paylater",
        "extended": {
          "card": "Alle von PayPal unterst\u00fctzten L\u00e4nder",
          "credit": "Australien, Frankreich, Gro\u00dfbritannien, Italien, Spanien, Vereinigte Staaten",
          "paylater": "Deutschland",
          "bancontact": "Belgien",
          "blik": "Polen",
          "eps": "\u00d6sterreich",
          "ideal": "Niederlande",
          "mercadopago": "Brasilien, Mexico",
          "mybank": "Italien",
          "p24": "Polen",
          "sepa": "Deutschland",
          "sofort": "\u00d6sterreich, Belgien, Deutschland, Italien, Niederlande, Spanien, Gro\u00dfbritannien",
          "venmo": "Vereinigte Staaten",
          "satispay": "Luxemburg, \u00d6sterreich, Belgien, Frankreich, Deutschland, Irland, Italien, Niederlande, Spanien"
        },
        "action": {
          "bancontact": "APMSettings",
          "blik": "APMSettings",
          "eps": "APMSettings",
          "ideal": "APMSettings",
          "mercadopago": "APMSettings",
          "mybank": "APMSettings",
          "p24": "APMSettings",
          "sepa": "APMSettings",
          "sofort": "APMSettings",
          "venmo": "APMSettings",
          "card": "APMSettings",
          "credit": "APMSettings",
          "paylater": "APMSettings",
          "satispay": "APMSettings"
        }
      },
      {
        "label": "satispay",
        "value": "satispay",
        "extended": {
          "card": "Alle von PayPal unterst\u00fctzten L\u00e4nder",
          "credit": "Australien, Frankreich, Gro\u00dfbritannien, Italien, Spanien, Vereinigte Staaten",
          "paylater": "Deutschland",
          "bancontact": "Belgien",
          "blik": "Polen",
          "eps": "\u00d6sterreich",
          "ideal": "Niederlande",
          "mercadopago": "Brasilien, Mexico",
          "mybank": "Italien",
          "p24": "Polen",
          "sepa": "Deutschland",
          "sofort": "\u00d6sterreich, Belgien, Deutschland, Italien, Niederlande, Spanien, Gro\u00dfbritannien",
          "venmo": "Vereinigte Staaten",
          "satispay": "Luxemburg, \u00d6sterreich, Belgien, Frankreich, Deutschland, Irland, Italien, Niederlande, Spanien"
        },
        "action": {
          "bancontact": "APMSettings",
          "blik": "APMSettings",
          "eps": "APMSettings",
          "ideal": "APMSettings",
          "mercadopago": "APMSettings",
          "mybank": "APMSettings",
          "p24": "APMSettings",
          "sepa": "APMSettings",
          "sofort": "APMSettings",
          "venmo": "APMSettings",
          "card": "APMSettings",
          "credit": "APMSettings",
          "paylater": "APMSettings",
          "satispay": "APMSettings"
        }
      }
    ]
  },
  "instalmentBannerDisplay_productDetails_layout": {
    "wrapperStart": "<div class=\"advancedSettingsWrapper_instalmentBannerDisplay card-border mb-5 pt-3\">",
    "value": "flex",
    "type": "selectbox",
    "class": "productDetails_advancedSetting",
    "panel": "instalmentBanner",
    "section": "instalmentBannerDisplay",
    "sort": 21,
    "description": "layoutDescription",
    "label": "layout",
    "options": [
      {
        "value": "flex",
        "label": "layout_flex"
      },
      {
        "value": "text",
        "label": "layout_text"
      }
    ]
  },
  "instalmentBannerDisplay_productDetails_logoType": {
    "value": "primary",
    "type": "selectbox",
    "class": "productDetails_advancedSetting",
    "panel": "instalmentBanner",
    "section": "instalmentBannerDisplay",
    "sort": 22,
    "description": "logoTypeDescription",
    "label": "logoType",
    "options": [
      {
        "value": "primary",
        "label": "logoType_primary"
      },
      {
        "value": "alternative",
        "label": "logoType_alternative"
      },
      {
        "value": "inline",
        "label": "logoType_inline"
      },
      {
        "value": "none",
        "label": "logoType_none"
      }
    ]
  },
  "instalmentBannerDisplay_productDetails_textSize": {
    "value": 12,
    "type": "text",
    "class": "productDetails_advancedSetting",
    "panel": "instalmentBanner",
    "section": "instalmentBannerDisplay",
    "sort": 23,
    "description": "textSizeDescription",
    "label": "textSize"
  },
  "instalmentBannerDisplay_productDetails_textColor": {
    "value": "black",
    "type": "selectbox",
    "class": "productDetails_advancedSetting",
    "panel": "instalmentBanner",
    "section": "instalmentBannerDisplay",
    "sort": 24,
    "description": "textColor",
    "label": "textColor",
    "options": [
      {
        "value": "white",
        "label": "textColor_white"
      },
      {
        "value": "black",
        "label": "textColor_black"
      }
    ]
  },
  "instalmentBannerDisplay_productDetails_layoutRatio": {
    "value": "8x1",
    "type": "selectbox",
    "class": "productDetails_advancedSetting",
    "panel": "instalmentBanner",
    "section": "instalmentBannerDisplay",
    "sort": 25,
    "description": "layoutRatioDescription",
    "label": "layoutRatio",
    "options": [
      {
        "value": "1x1",
        "label": "1x1"
      },
      {
        "value": "1x4",
        "label": "1x4"
      },
      {
        "value": "8x1",
        "label": "8x1"
      },
      {
        "value": "20x1",
        "label": "20x1"
      }
    ]
  },
  "instalmentBannerDisplay_productDetails_layoutType": {
    "value": "white",
    "type": "selectbox",
    "class": "productDetails_advancedSetting",
    "panel": "instalmentBanner",
    "section": "instalmentBannerDisplay",
    "sort": 26,
    "description": "layoutTypeDescription",
    "label": "layoutType",
    "options": [
      {
        "value": "white",
        "label": "layoutType_white"
      },
      {
        "value": "black",
        "label": "layoutType_black"
      },
      {
        "value": "blue",
        "label": "layoutType_blue"
      },
      {
        "value": "grey",
        "label": "layoutType_grey"
      }
    ]
  },
  "instalmentBannerDisplay_productDetails_phpqSelector": {
    "value": "#add-to-cart.product-buy",
    "type": "text",
    "class": "productDetails_advancedSetting",
    "panel": "instalmentBanner",
    "section": "instalmentBannerDisplay",
    "sort": 27,
    "description": "phpqSelectorDescription",
    "label": "phpqSelector"
  },
  "instalmentBannerDisplay_productDetails_phpqMethod": {
    "wrapperEnd": "<\/div>",
    "value": "after",
    "vars": {
      "scope": "productDetails"
    },
    "type": "selectbox",
    "class": "productDetails_advancedSetting",
    "panel": "instalmentBanner",
    "section": "instalmentBannerDisplay",
    "sort": 28,
    "description": "phpqMethodDescription",
    "label": "phpqMethod",
    "loadAfter": "snippets\/instalmentBannerPreview.tpl",
    "options": [
      {
        "value": "after",
        "label": "phpq_after"
      },
      {
        "value": "append",
        "label": "phpq_append"
      },
      {
        "value": "before",
        "label": "phpq_before"
      },
      {
        "value": "prepend",
        "label": "phpq_prepend"
      }
    ]
  },
  "instalmentBannerDisplay_miniCart_layout": {
    "wrapperStart": "<div class=\"advancedSettingsWrapper_instalmentBannerDisplay card-border mb-5 pt-3\">",
    "value": "text",
    "type": "selectbox",
    "class": "miniCart_advancedSetting",
    "panel": "instalmentBanner",
    "section": "instalmentBannerDisplay",
    "sort": 51,
    "description": "layoutDescription",
    "label": "layout",
    "options": [
      {
        "value": "flex",
        "label": "layout_flex"
      },
      {
        "value": "text",
        "label": "layout_text"
      }
    ]
  },
  "instalmentBannerDisplay_miniCart_logoType": {
    "value": "primary",
    "type": "selectbox",
    "class": "miniCart_advancedSetting",
    "panel": "instalmentBanner",
    "section": "instalmentBannerDisplay",
    "sort": 52,
    "description": "logoTypeDescription",
    "label": "logoType",
    "options": [
      {
        "value": "primary",
        "label": "logoType_primary"
      },
      {
        "value": "alternative",
        "label": "logoType_alternative"
      },
      {
        "value": "inline",
        "label": "logoType_inline"
      },
      {
        "value": "none",
        "label": "logoType_none"
      }
    ]
  },
  "instalmentBannerDisplay_miniCart_textSize": {
    "value": 12,
    "type": "text",
    "class": "miniCart_advancedSetting",
    "panel": "instalmentBanner",
    "section": "instalmentBannerDisplay",
    "sort": 53,
    "description": "textSizeDescription",
    "label": "textSize"
  },
  "instalmentBannerDisplay_miniCart_textColor": {
    "value": "black",
    "type": "selectbox",
    "class": "miniCart_advancedSetting",
    "panel": "instalmentBanner",
    "section": "instalmentBannerDisplay",
    "sort": 54,
    "description": "textColor",
    "label": "textColor",
    "options": [
      {
        "value": "white",
        "label": "textColor_white"
      },
      {
        "value": "black",
        "label": "textColor_black"
      }
    ]
  },
  "instalmentBannerDisplay_miniCart_layoutRatio": {
    "value": "8x1",
    "type": "selectbox",
    "class": "miniCart_advancedSetting",
    "panel": "instalmentBanner",
    "section": "instalmentBannerDisplay",
    "sort": 55,
    "description": "layoutRatioDescription",
    "label": "layoutRatio",
    "options": [
      {
        "value": "1x1",
        "label": "1x1"
      },
      {
        "value": "1x4",
        "label": "1x4"
      },
      {
        "value": "8x1",
        "label": "8x1"
      },
      {
        "value": "20x1",
        "label": "20x1"
      }
    ]
  },
  "instalmentBannerDisplay_miniCart_layoutType": {
    "value": "white",
    "type": "selectbox",
    "class": "miniCart_advancedSetting",
    "panel": "instalmentBanner",
    "section": "instalmentBannerDisplay",
    "sort": 56,
    "description": "layoutTypeDescription",
    "label": "layoutType",
    "options": [
      {
        "value": "white",
        "label": "layoutType_white"
      },
      {
        "value": "black",
        "label": "layoutType_black"
      },
      {
        "value": "blue",
        "label": "layoutType_blue"
      },
      {
        "value": "grey",
        "label": "layoutType_grey"
      }
    ]
  },
  "instalmentBannerDisplay_miniCart_phpqSelector": {
    "value": ".cart-dropdown-buttons:first",
    "type": "text",
    "class": "miniCart_advancedSetting",
    "panel": "instalmentBanner",
    "section": "instalmentBannerDisplay",
    "sort": 57,
    "description": "phpqSelectorDescription",
    "label": "phpqSelector"
  },
  "instalmentBannerDisplay_miniCart_phpqMethod": {
    "wrapperEnd": "<\/div>",
    "value": "after",
    "vars": {
      "scope": "miniCart"
    },
    "type": "selectbox",
    "class": "miniCart_advancedSetting",
    "panel": "instalmentBanner",
    "section": "instalmentBannerDisplay",
    "sort": 58,
    "description": "phpqMethodDescription",
    "label": "phpqMethod",
    "loadAfter": "snippets\/instalmentBannerPreview.tpl",
    "options": [
      {
        "value": "after",
        "label": "phpq_after"
      },
      {
        "value": "append",
        "label": "phpq_append"
      },
      {
        "value": "before",
        "label": "phpq_before"
      },
      {
        "value": "prepend",
        "label": "phpq_prepend"
      }
    ]
  },
  "instalmentBannerDisplay_cart_layout": {
    "wrapperStart": "<div class=\"advancedSettingsWrapper_instalmentBannerDisplay card-border mb-5 pt-3\">",
    "value": "text",
    "type": "selectbox",
    "class": "cart_advancedSetting",
    "panel": "instalmentBanner",
    "section": "instalmentBannerDisplay",
    "sort": 31,
    "description": "layoutDescription",
    "label": "layout",
    "options": [
      {
        "value": "flex",
        "label": "layout_flex"
      },
      {
        "value": "text",
        "label": "layout_text"
      }
    ]
  },
  "instalmentBannerDisplay_cart_logoType": {
    "value": "primary",
    "type": "selectbox",
    "class": "cart_advancedSetting",
    "panel": "instalmentBanner",
    "section": "instalmentBannerDisplay",
    "sort": 32,
    "description": "logoTypeDescription",
    "label": "logoType",
    "options": [
      {
        "value": "primary",
        "label": "logoType_primary"
      },
      {
        "value": "alternative",
        "label": "logoType_alternative"
      },
      {
        "value": "inline",
        "label": "logoType_inline"
      },
      {
        "value": "none",
        "label": "logoType_none"
      }
    ]
  },
  "instalmentBannerDisplay_cart_textSize": {
    "value": 12,
    "type": "text",
    "class": "cart_advancedSetting",
    "panel": "instalmentBanner",
    "section": "instalmentBannerDisplay",
    "sort": 33,
    "description": "textSizeDescription",
    "label": "textSize"
  },
  "instalmentBannerDisplay_cart_textColor": {
    "value": "black",
    "type": "selectbox",
    "class": "cart_advancedSetting",
    "panel": "instalmentBanner",
    "section": "instalmentBannerDisplay",
    "sort": 34,
    "description": "textColor",
    "label": "textColor",
    "options": [
      {
        "value": "white",
        "label": "textColor_white"
      },
      {
        "value": "black",
        "label": "textColor_black"
      }
    ]
  },
  "instalmentBannerDisplay_cart_layoutRatio": {
    "value": "8x1",
    "type": "selectbox",
    "class": "cart_advancedSetting",
    "panel": "instalmentBanner",
    "section": "instalmentBannerDisplay",
    "sort": 35,
    "description": "layoutRatioDescription",
    "label": "layoutRatio",
    "options": [
      {
        "value": "1x1",
        "label": "1x1"
      },
      {
        "value": "1x4",
        "label": "1x4"
      },
      {
        "value": "8x1",
        "label": "8x1"
      },
      {
        "value": "20x1",
        "label": "20x1"
      }
    ]
  },
  "instalmentBannerDisplay_cart_layoutType": {
    "value": "white",
    "type": "selectbox",
    "class": "cart_advancedSetting",
    "panel": "instalmentBanner",
    "section": "instalmentBannerDisplay",
    "sort": 36,
    "description": "layoutTypeDescription",
    "label": "layoutType",
    "options": [
      {
        "value": "white",
        "label": "layoutType_white"
      },
      {
        "value": "black",
        "label": "layoutType_black"
      },
      {
        "value": "blue",
        "label": "layoutType_blue"
      },
      {
        "value": "grey",
        "label": "layoutType_grey"
      }
    ]
  },
  "instalmentBannerDisplay_cart_phpqSelector": {
    "value": "#cart-checkout-btn",
    "type": "text",
    "class": "cart_advancedSetting",
    "panel": "instalmentBanner",
    "section": "instalmentBannerDisplay",
    "sort": 37,
    "description": "phpqSelectorDescription",
    "label": "phpqSelector"
  },
  "instalmentBannerDisplay_cart_phpqMethod": {
    "wrapperEnd": "<\/div>",
    "value": "after",
    "vars": {
      "scope": "cart"
    },
    "type": "selectbox",
    "class": "cart_advancedSetting",
    "panel": "instalmentBanner",
    "section": "instalmentBannerDisplay",
    "sort": 38,
    "description": "phpqMethodDescription",
    "label": "phpqMethod",
    "loadAfter": "snippets\/instalmentBannerPreview.tpl",
    "options": [
      {
        "value": "after",
        "label": "phpq_after"
      },
      {
        "value": "append",
        "label": "phpq_append"
      },
      {
        "value": "before",
        "label": "phpq_before"
      },
      {
        "value": "prepend",
        "label": "phpq_prepend"
      }
    ]
  },
  "instalmentBannerDisplay_orderProcess_layout": {
    "wrapperStart": "<div class=\"advancedSettingsWrapper_instalmentBannerDisplay card-border mb-5 pt-3\">",
    "value": "flex",
    "type": "selectbox",
    "class": "orderProcess_advancedSetting",
    "panel": "instalmentBanner",
    "section": "instalmentBannerDisplay",
    "sort": 41,
    "description": "layoutDescription",
    "label": "layout",
    "options": [
      {
        "value": "flex",
        "label": "layout_flex"
      },
      {
        "value": "text",
        "label": "layout_text"
      }
    ]
  },
  "instalmentBannerDisplay_orderProcess_logoType": {
    "value": "primary",
    "type": "selectbox",
    "class": "orderProcess_advancedSetting",
    "panel": "instalmentBanner",
    "section": "instalmentBannerDisplay",
    "sort": 42,
    "description": "logoTypeDescription",
    "label": "logoType",
    "options": [
      {
        "value": "primary",
        "label": "logoType_primary"
      },
      {
        "value": "alternative",
        "label": "logoType_alternative"
      },
      {
        "value": "inline",
        "label": "logoType_inline"
      },
      {
        "value": "none",
        "label": "logoType_none"
      }
    ]
  },
  "instalmentBannerDisplay_orderProcess_textSize": {
    "value": 12,
    "type": "text",
    "class": "orderProcess_advancedSetting",
    "panel": "instalmentBanner",
    "section": "instalmentBannerDisplay",
    "sort": 43,
    "description": "textSizeDescription",
    "label": "textSize"
  },
  "instalmentBannerDisplay_orderProcess_textColor": {
    "value": "black",
    "type": "selectbox",
    "class": "orderProcess_advancedSetting",
    "panel": "instalmentBanner",
    "section": "instalmentBannerDisplay",
    "sort": 44,
    "description": "textColor",
    "label": "textColor",
    "options": [
      {
        "value": "white",
        "label": "textColor_white"
      },
      {
        "value": "black",
        "label": "textColor_black"
      }
    ]
  },
  "instalmentBannerDisplay_orderProcess_layoutRatio": {
    "value": "20x1",
    "type": "selectbox",
    "class": "orderProcess_advancedSetting",
    "panel": "instalmentBanner",
    "section": "instalmentBannerDisplay",
    "sort": 45,
    "description": "layoutRatioDescription",
    "label": "layoutRatio",
    "options": [
      {
        "value": "1x1",
        "label": "1x1"
      },
      {
        "value": "1x4",
        "label": "1x4"
      },
      {
        "value": "8x1",
        "label": "8x1"
      },
      {
        "value": "20x1",
        "label": "20x1"
      }
    ]
  },
  "instalmentBannerDisplay_orderProcess_layoutType": {
    "value": "white",
    "type": "selectbox",
    "class": "orderProcess_advancedSetting",
    "panel": "instalmentBanner",
    "section": "instalmentBannerDisplay",
    "sort": 46,
    "description": "layoutTypeDescription",
    "label": "layoutType",
    "options": [
      {
        "value": "white",
        "label": "layoutType_white"
      },
      {
        "value": "black",
        "label": "layoutType_black"
      },
      {
        "value": "blue",
        "label": "layoutType_blue"
      },
      {
        "value": "grey",
        "label": "layoutType_grey"
      }
    ]
  },
  "instalmentBannerDisplay_orderProcess_phpqSelector": {
    "value": "#fieldset-payment .row",
    "type": "text",
    "class": "orderProcess_advancedSetting",
    "panel": "instalmentBanner",
    "section": "instalmentBannerDisplay",
    "sort": 47,
    "description": "phpqSelectorDescription",
    "label": "phpqSelector"
  },
  "instalmentBannerDisplay_orderProcess_phpqMethod": {
    "wrapperEnd": "<\/div>",
    "value": "after",
    "vars": {
      "scope": "orderProcess"
    },
    "type": "selectbox",
    "class": "orderProcess_advancedSetting",
    "panel": "instalmentBanner",
    "section": "instalmentBannerDisplay",
    "sort": 48,
    "description": "phpqMethodDescription",
    "label": "phpqMethod",
    "loadAfter": "snippets\/instalmentBannerPreview.tpl",
    "options": [
      {
        "value": "after",
        "label": "phpq_after"
      },
      {
        "value": "append",
        "label": "phpq_append"
      },
      {
        "value": "before",
        "label": "phpq_before"
      },
      {
        "value": "prepend",
        "label": "phpq_prepend"
      }
    ]
  },
  "expressBuyDisplay_productDetails_phpqSelector": {
    "wrapperStart": "<div class=\"advancedSettingsWrapper_expressBuyDisplay card-border mb-5 pt-3\">",
    "value": "#add-to-cart",
    "type": "text",
    "class": "productDetails_advancedSetting",
    "panel": "expressBuy",
    "section": "expressBuyDisplay",
    "sort": 21,
    "description": "phpqSelectorDescription",
    "label": "phpqSelector"
  },
  "expressBuyDisplay_productDetails_phpqMethod": {
    "wrapperEnd": "<\/div>",
    "value": "append",
    "type": "selectbox",
    "class": "productDetails_advancedSetting",
    "panel": "expressBuy",
    "section": "expressBuyDisplay",
    "sort": 22,
    "description": "phpqMethodDescription",
    "label": "phpqMethod",
    "options": [
      {
        "value": "after",
        "label": "phpq_after"
      },
      {
        "value": "append",
        "label": "phpq_append"
      },
      {
        "value": "before",
        "label": "phpq_before"
      },
      {
        "value": "prepend",
        "label": "phpq_prepend"
      }
    ]
  },
  "expressBuyDisplay_miniCart_phpqSelector": {
    "wrapperStart": "<div class=\"advancedSettingsWrapper_expressBuyDisplay card-border mb-5 pt-3\">",
    "value": ".cart-dropdown-buttons:first",
    "type": "text",
    "class": "miniCart_advancedSetting",
    "panel": "expressBuy",
    "section": "expressBuyDisplay",
    "sort": 51,
    "description": "phpqSelectorDescription",
    "label": "phpqSelector"
  },
  "expressBuyDisplay_miniCart_phpqMethod": {
    "wrapperEnd": "<\/div>",
    "value": "append",
    "type": "selectbox",
    "class": "miniCart_advancedSetting",
    "panel": "expressBuy",
    "section": "expressBuyDisplay",
    "sort": 52,
    "description": "phpqMethodDescription",
    "label": "phpqMethod",
    "options": [
      {
        "value": "after",
        "label": "phpq_after"
      },
      {
        "value": "append",
        "label": "phpq_append"
      },
      {
        "value": "before",
        "label": "phpq_before"
      },
      {
        "value": "prepend",
        "label": "phpq_prepend"
      }
    ]
  },
  "expressBuyDisplay_cart_phpqSelector": {
    "wrapperStart": "<div class=\"advancedSettingsWrapper_expressBuyDisplay card-border mb-5 pt-3\">",
    "value": "#cart-checkout-btn",
    "type": "text",
    "class": "cart_advancedSetting",
    "panel": "expressBuy",
    "section": "expressBuyDisplay",
    "sort": 31,
    "description": "phpqSelectorDescription",
    "label": "phpqSelector"
  },
  "expressBuyDisplay_cart_phpqMethod": {
    "wrapperEnd": "<\/div>",
    "value": "after",
    "type": "selectbox",
    "class": "cart_advancedSetting",
    "panel": "expressBuy",
    "section": "expressBuyDisplay",
    "sort": 32,
    "description": "phpqMethodDescription",
    "label": "phpqMethod",
    "options": [
      {
        "value": "after",
        "label": "phpq_after"
      },
      {
        "value": "append",
        "label": "phpq_append"
      },
      {
        "value": "before",
        "label": "phpq_before"
      },
      {
        "value": "prepend",
        "label": "phpq_prepend"
      }
    ]
  },
  "expressBuyDisplay_orderProcess_phpqSelector": {
    "wrapperStart": "<div class=\"advancedSettingsWrapper_expressBuyDisplay card-border mb-5 pt-3\">",
    "value": "#order_register_or_login",
    "type": "text",
    "class": "orderProcess_advancedSetting",
    "panel": "expressBuy",
    "section": "expressBuyDisplay",
    "sort": 41,
    "description": "phpqSelectorDescription",
    "label": "phpqSelector"
  },
  "expressBuyDisplay_orderProcess_phpqMethod": {
    "wrapperEnd": "<\/div>",
    "value": "after",
    "type": "selectbox",
    "class": "orderProcess_advancedSetting",
    "panel": "expressBuy",
    "section": "expressBuyDisplay",
    "sort": 42,
    "description": "phpqMethodDescription",
    "label": "phpqMethod",
    "options": [
      {
        "value": "after",
        "label": "phpq_after"
      },
      {
        "value": "append",
        "label": "phpq_append"
      },
      {
        "value": "before",
        "label": "phpq_before"
      },
      {
        "value": "prepend",
        "label": "phpq_prepend"
      }
    ]
  }
}
