{
    "items": [
        {
            "modificationInfo": {
                "createdAt": "2019-02-05T10:23:58.461+00:00",
                "updatedAt": "2019-02-05T10:23:58.461+00:00",
                "deletedAt": "2019-02-05T10:23:58.461+00:00",
                "state": "New"
            },
            "shippingMethodId": "FULF0ASHPMETHD01",
            "name": "string",
            "trackingUrlSchema": "string",
            "carrierCode": "string",
            "carrierName": "string",
            "note": "This is a custom note.",
            "cutoffTime": "string",
            "shippingType": "Standard"
        }
    ],
    "_page": {
        "limit": 0,
        "offset": 0,
        "total": 0
    },
    "_links": {
        "previous": "string",
        "next": "string"
    }
}
