{
    "warehouseId": "FULF04XX-12345-0001",
    "quantityBlocked": 15.05,
    "quantity": 15.05,
    "note": "The Interdimensional Goggles are a gadget created by Rick to observe realities across different dimensions by matching it to the wearer's DNA.",
    "batch": "Elor",
    "bestBefore": {
        "year": 1989,
        "month": 11,
        "day": 22
    },
    "fulfillerTimestamp": "2020-03-02T08:49:37.9090000+00:00",
    "fulfillerStockChangeId": "BK23004"
}