{
    "returnItemId": "MERC05PosFDSE",
    "jfsku": "MERC01PRDCT",
    "merchantSku": "ART2394871",
    "outboundId": "MERC02AXEV",
    "condition": "Unknown",
    "outboundItemId": "5",
    "quantity": 203.202,
    "reason": "NoReason",
    "reasonNote": "This is a custom note.",
    "conditionNote": "This is a custom note.",
    "state": "Announced",
    "stockChanges": [
        {
            "stockChangeId": {
                "warehouseId": "FULF04XX-12345-0001",
                "jfsku": "MERC01PRDCT",
                "stockVersion": 30220
            },
            "merchantSku": "ART2394871",
            "quantity": 203.202,
            "quantityBlocked": 203.202
        }
    ]
}
