{
    "fulfillerId": "FULF",
    "modificationInfo": {
        "createdAt": "2019-02-05T10:23:58.461+00:00",
        "updatedAt": "2019-02-05T10:23:58.461+00:00",
        "deletedAt": "2019-02-05T10:23:58.461+00:00",
        "state": "New"
    },
    "shippingMethodIds": [
        "string"
    ],
    "warehouseId": "FULF04XX-12345-0001",
    "name": "string",
    "address": {
        "city": "string",
        "company": "string",
        "country": "DE",
        "email": "string",
        "extraAddressLine": "string",
        "extraLine": "string",
        "fax": "string",
        "firstName": "string",
        "lastName": "string",
        "mobile": "string",
        "phone": "string",
        "salutation": "string",
        "state": "string",
        "street": "string",
        "zip": "12345"
    }
}
