<?xml version="1.0" encoding="ASCII"?>
<sdkproject:SdkProject xmi:version="2.0" xmlns:xmi="http://www.omg.org/XMI" xmlns:xsi="http://www.w3.org/2001/XMLSchema-instance" xmlns:sdkproject="http://www.xilinx.com/sdkproject" name="hello" location="C:/projects/vsmd/zybo/manual/vitis/hello" platform="C:/projects/vsmd/zybo/manual/vitis/zybo_freertos/export/zybo_freertos/zybo_freertos.xpfm" platformUID="xilinx:::0.0(custom)" systemProject="hello_system" sysConfig="zybo_freertos" runtime="C/C++" cpu="freertos10_xilinx_domain" cpuInstance="ps7_cortexa9_0" os="freertos10_xilinx" mssSignature="82218fda894a8dd3329027e9a41912f5">
  <configuration name="Debug" id="xilinx.gnu.armv7.exe.debug.1265396487">
    <configBuildOptions xsi:type="sdkproject:SdkOptions"/>
    <lastBuildOptions xsi:type="sdkproject:SdkOptions"/>
  </configuration>
  <configuration name="Release" id="xilinx.gnu.armv7.exe.release.85910729" dirty="true">
    <configBuildOptions xsi:type="sdkproject:SdkOptions"/>
  </configuration>
  <template appTemplateName="freertos_hello_world"/>
</sdkproject:SdkProject>
