<?xml version="1.0" encoding="utf-8"?>
<!-- Generator: Adobe Illustrator 16.0.0, SVG Export Plug-In . SVG Version: 6.00 Build 0)  -->
<!DOCTYPE svg PUBLIC "-//W3C//DTD SVG 1.1//EN" "http://www.w3.org/Graphics/SVG/1.1/DTD/svg11.dtd">
<svg version="1.1" id="Capa_1" xmlns="http://www.w3.org/2000/svg" xmlns:xlink="http://www.w3.org/1999/xlink" x="0px" y="0px"
	 width="707px" height="200px" viewBox="0 0 707 200" enable-background="new 0 0 707 200" xml:space="preserve">
<g>
	<path fill="#00567D" d="M182.951,14.362c3.34,0,6.061,2.716,6.061,6.133c0,1.09-0.313,2.18-0.857,3.111
		c0.311-0.081,0.621-0.081,0.857-0.081c3.416,0,6.136,2.799,6.136,6.137c0,3.342-2.719,6.139-6.136,6.139
		c-3.341,0-6.061-2.797-6.061-6.139c0,3.342-2.798,6.139-6.137,6.139c-3.34,0-6.135-2.797-6.135-6.139
		c0-3.338,2.795-6.137,6.135-6.137c0.312,0,0.54,0,0.854,0.081c-0.543-0.931-0.854-2.021-0.854-3.111
		C176.814,17.078,179.531,14.362,182.951,14.362"/>
	<path fill="#00567D" d="M153.28,16.692c3.341-0.543,6.446,1.787,6.987,5.127c0.157,1.088,0,2.175-0.384,3.184
		c0.308-0.076,0.541-0.154,0.855-0.235c3.333-0.463,6.445,1.787,6.99,5.129c0.541,3.341-1.709,6.447-5.05,6.993
		c-3.341,0.54-6.525-1.788-6.99-5.052c0.465,3.265-1.787,6.447-5.127,6.994c-3.343,0.464-6.448-1.789-6.994-5.128
		c-0.54-3.338,1.791-6.449,5.131-6.989c0.231-0.077,0.539-0.077,0.854-0.077c-0.704-0.779-1.169-1.788-1.4-2.953
		C147.688,20.342,149.939,17.236,153.28,16.692"/>
	<path fill="#00567D" d="M494.195,140.274c-3.575,0.779-5.36,2.332-5.36,4.742c0,1.007,0.308,1.863,1.086,2.563
		c0.7,0.776,1.792,1.088,3.264,1.088h1.012c1.629-0.235,2.873-0.854,3.805-2.021c1.009-1.32,1.555-2.796,1.555-4.507v-2.253
		C497.453,139.886,495.666,140.042,494.195,140.274 M494.195,152.472c-0.934,0.312-1.866,0.389-2.952,0.389
		c-2.487,0-4.427-0.698-5.902-2.176c-1.48-1.396-2.251-3.182-2.251-5.358c0-4.895,3.729-7.612,11.106-8.313
		c1.161-0.073,2.404-0.156,3.805-0.156h1.555v-1.861c0-2.487-1.711-3.805-5.206-3.805c-3.417,0.075-5.282,1.317-5.746,3.805
		l-4.743-0.701c0.312-2.016,1.327-3.727,3.188-4.968c1.708-1.244,4.042-1.865,7.147-2.021h0.933c1.865,0,3.416,0.154,4.66,0.467
		c1.165,0.31,2.176,0.853,3.027,1.629c0.779,0.699,1.399,1.555,1.711,2.407c0.311,0.935,0.468,2.41,0.468,4.506v11.111
		c0,1.553,0.229,3.261,0.696,4.972h-5.281c-0.469-1.554-0.696-3.188-0.854-4.972C498.469,150.064,496.683,151.772,494.195,152.472z
		 M468.716,157.366h0.933c4.354,0,6.447-1.088,6.447-3.264c0-0.854-0.39-1.476-1.087-1.862c-0.78-0.389-1.63-0.623-2.565-0.623h-5.9
		c-1.164,0-2.483-0.154-4.042-0.623c-0.775,0.778-1.161,1.478-1.161,2.178c0,1.083,0.617,2.099,2.015,2.952
		C464.52,156.821,466.312,157.284,468.716,157.366z M468.716,146.411h4.506c2.562,0,4.506,0.62,5.903,1.862
		c1.4,1.325,2.174,2.954,2.174,4.818c0,2.329-1.083,4.274-3.26,5.748c-2.099,1.553-5.206,2.255-9.323,2.331h-0.233
		c-8.001,0-11.964-2.251-11.964-6.68c0-2.173,1.244-3.807,3.577-4.971c-1.479-1.245-2.251-2.641-2.251-4.042
		c0-2.176,1.319-3.805,3.881-5.125c-2.251-1.321-3.341-3.263-3.341-5.672c0-2.017,0.779-3.805,2.487-5.2
		c1.629-1.478,4.195-2.176,7.611-2.176h0.232c1.476,0,3.03,0.153,4.506,0.542c0.78-3.183,2.719-4.74,5.979-4.74h2.022v4.276h-1.712
		c-0.696,0-1.397,0.075-1.941,0.233c-0.542,0.23-1.091,0.774-1.629,1.782c1.941,1.556,2.948,3.343,2.948,5.282
		c0,2.174-0.933,3.962-2.794,5.36c-1.784,1.476-4.192,2.178-7.224,2.178c-1.399,0-2.871-0.234-4.583-0.621
		c-1.162,0.463-1.71,1.318-1.71,2.403c0,0.546,0.312,1.09,0.859,1.634c0.539,0.466,1.393,0.775,2.483,0.775H468.716L468.716,146.411
		z M468.716,138.954c2.951-0.074,4.426-1.476,4.426-4.272c0-1.084-0.384-2.017-1.163-2.793c-0.698-0.7-1.787-1.088-3.263-1.088
		c-1.477,0-2.563,0.388-3.417,1.164c-0.779,0.776-1.164,1.786-1.164,2.95c0,1.168,0.386,2.176,1.164,2.874
		c0.774,0.779,1.865,1.165,3.338,1.165H468.716z M441.296,148.667c1.63-0.235,2.873-0.854,3.807-2.021
		c1.088-1.32,1.633-2.796,1.633-4.507v-2.253c-2.098,0-3.884,0.156-5.439,0.389c-3.568,0.779-5.355,2.332-5.355,4.742
		c0,1.007,0.387,1.863,1.083,2.563c0.704,0.776,1.789,1.088,3.265,1.088H441.296L441.296,148.667z M441.296,137.013
		c1.166-0.074,2.487-0.157,3.807-0.157h1.633v-1.862c0-2.485-1.787-3.805-5.204-3.805h-0.235c-3.259,0.075-5.124,1.319-5.592,3.805
		l-4.659-0.699c0.231-2.018,1.317-3.727,3.104-4.969c1.709-1.243,4.117-1.865,7.147-2.02h0.934c1.94,0,3.416,0.153,4.659,0.465
		c1.164,0.312,2.177,0.854,3.031,1.629c0.849,0.699,1.396,1.556,1.706,2.409c0.312,0.934,0.469,2.408,0.469,4.504v11.112
		c0,1.554,0.312,3.26,0.771,4.971h-5.282c-0.46-1.553-0.771-3.188-0.85-4.971c-1.091,2.64-2.877,4.35-5.439,5.049
		c-0.854,0.312-1.864,0.387-2.951,0.387c-2.404,0-4.427-0.698-5.899-2.174c-1.48-1.397-2.177-3.184-2.177-5.359
		C430.269,140.431,433.917,137.712,441.296,137.013z M402.148,148.667c1.554-0.235,2.874-0.854,3.728-2.021
		c1.087-1.32,1.633-2.796,1.633-4.507v-2.253c-2.097,0-3.884,0.156-5.359,0.389c-3.652,0.779-5.439,2.332-5.439,4.742
		c0,1.007,0.389,1.863,1.09,2.563c0.697,0.776,1.866,1.088,3.26,1.088H402.148L402.148,148.667z M402.148,137.013
		c1.16-0.074,2.409-0.157,3.806-0.157h1.554v-1.862c0-2.485-1.786-3.805-5.206-3.805c-3.495,0.075-5.356,1.319-5.746,3.805
		l-4.738-0.699c0.232-2.018,1.322-3.727,3.184-4.969c1.634-1.243,4.042-1.865,7.147-2.02H403c1.948,0,3.498,0.153,4.668,0.465
		c1.239,0.312,2.25,0.854,3.025,1.629c0.854,0.699,1.396,1.556,1.787,2.409c0.312,0.934,0.468,2.408,0.468,4.504v11.112
		c0,1.554,0.229,3.26,0.698,4.971h-5.283c-0.468-1.553-0.779-3.188-0.854-4.971c-1.086,2.64-2.871,4.35-5.359,5.049
		c-0.933,0.312-1.941,0.387-2.951,0.387c-2.488,0-4.429-0.698-5.983-2.174c-1.475-1.397-2.171-3.184-2.171-5.359
		C391.043,140.431,394.693,137.712,402.148,137.013z M402.148,119.926l6.6-3.729l1.555,3.648l-8.154,3.498l-2.022,0.774
		l-1.008-2.563L402.148,119.926z M425.141,152.396h-5.593v-33.169h5.593V152.396z M323.695,148.51h0.311
		c2.721,0,4.586-1.32,5.593-3.962l4.972,0.696c-0.623,2.18-1.863,4.043-3.803,5.44c-1.867,1.478-4.199,2.176-7.072,2.176
		c-3.417,0-6.138-1.168-8.234-3.418c-2.094-2.251-3.105-5.359-3.105-9.321c0-3.651,1.014-6.757,3.105-9.166
		c2.019-2.331,4.738-3.571,8.234-3.649h0.311c3.494,0,6.213,1.164,8.154,3.571c1.94,2.409,2.876,5.518,2.876,9.245v0.621h-16.935
		c0,1.706,0.152,3.031,0.469,4.041c0.311,1.008,0.932,1.862,1.861,2.642C321.371,148.042,322.379,148.432,323.695,148.51z
		 M323.695,137.166h5.518c0-1.705-0.545-3.184-1.554-4.267c-1.091-1.166-2.409-1.711-3.885-1.711c-1.63,0-2.872,0.545-3.884,1.553
		c-1.006,1.086-1.635,2.561-1.787,4.425H323.695z M385.524,152.396h-6.057v-29.052l-9.245,29.052h-3.183l-9.242-29.052v29.052
		h-4.896v-33.17h9.398l6.993,21.282l6.834-21.282h9.398v33.17H385.524z M296.509,148.275c1.401,0,2.563-0.54,3.652-1.705
		c1.006-1.167,1.555-2.721,1.555-4.507v-4.194c0-2.021-0.466-3.497-1.476-4.659c-0.934-1.09-2.178-1.635-3.652-1.635
		c-1.708,0-2.951,0.701-3.884,2.099c-0.931,1.476-1.397,3.572-1.397,6.447C291.307,145.561,293.094,148.275,296.509,148.275z
		 M296.509,126.914c2.409,0.39,4.12,1.787,5.207,4.198v-11.887h5.514v33.17h-5.203v-4.972c-1.169,2.951-2.954,4.738-5.518,5.283
		c-0.538,0.076-1.086,0.153-1.708,0.153c-3.027,0-5.355-1.244-6.989-3.729c-1.555-2.561-2.408-5.668-2.408-9.398
		c0-3.42,0.853-6.446,2.563-9.008c1.631-2.645,4.04-3.887,7.145-3.887C295.576,126.838,296.044,126.838,296.509,126.914z"/>
	<path fill="#00567D" d="M573.809,76.582c-1.862,0-3.26,0.774-4.191,2.25c-0.933,1.479-1.4,3.494-1.4,5.98
		c0,2.645,0.547,4.662,1.475,6.061c1.013,1.396,2.334,2.174,4.043,2.174c3.809-0.075,5.67-2.872,5.67-8.387
		c0-2.486-0.467-4.508-1.399-5.904c-0.855-1.477-2.251-2.174-4.114-2.174H573.809 M573.809,97.556h-0.229
		c-3.65,0-6.448-1.247-8.311-3.886c-1.941-2.644-2.957-5.592-2.957-8.935c0-3.649,1.091-6.681,3.188-9.088
		c2.095-2.408,4.893-3.572,8.309-3.65c3.424,0,6.139,1.166,8.237,3.572c2.172,2.333,3.183,5.361,3.183,9.166
		c0,3.806-1.086,6.913-3.26,9.322C579.795,96.309,577.074,97.556,573.809,97.556z M504.289,93.202h0.312
		c2.798,0,4.585-1.319,5.594-3.962l5.048,0.7c-0.697,2.177-1.94,4.041-3.806,5.518c-1.94,1.397-4.271,2.099-7.147,2.099
		c-3.414,0-6.131-1.09-8.229-3.422c-2.099-2.251-3.109-5.358-3.109-9.24c0-3.729,1.011-6.84,3.109-9.245
		c2.098-2.333,4.814-3.573,8.229-3.651h0.312c3.498,0,6.214,1.243,8.154,3.651c1.944,2.33,2.878,5.438,2.878,9.163v0.699h-16.936
		c0,1.634,0.156,2.953,0.467,3.963c0.313,1.012,1.013,1.863,1.941,2.643C501.963,92.814,503.046,93.202,504.289,93.202z
		 M504.289,81.938h5.518c0-1.786-0.547-3.26-1.553-4.349c-1.086-1.087-2.33-1.708-3.881-1.708c-1.558,0.078-2.877,0.542-3.889,1.554
		c-1.008,1.084-1.552,2.563-1.787,4.502L504.289,81.938L504.289,81.938z M541.497,97.088h-5.594V81.706
		c0-1.552-0.385-2.796-1.086-3.649c-0.779-0.775-1.708-1.245-2.72-1.245c-1.476,0-2.719,0.702-3.806,1.945s-1.634,3.183-1.634,5.668
		v12.663h-5.592V72.542h5.052v5.669c1.784-4.117,4.275-6.215,7.455-6.215c2.176,0,4.042,0.7,5.593,2.098
		c1.555,1.32,2.33,3.729,2.33,7.146L541.497,97.088L541.497,97.088z M559.907,92.736v4.35c-1.633,0.313-2.951,0.545-3.884,0.545
		c-1.477,0-2.719-0.31-3.807-0.932c-1.088-0.545-1.864-1.401-2.408-2.408c-0.468-1.01-0.696-2.643-0.696-4.738V76.812h-3.109v-4.268
		h3.42l0.545-6.371l4.502-0.465v6.838h4.97v4.267h-4.97v11.964c0,1.552,0.311,2.644,0.856,3.185c0.545,0.543,1.63,0.854,3.181,0.854
		C558.976,92.814,559.438,92.736,559.907,92.736z M420.866,93.359c1.64-0.235,2.874-0.855,3.806-1.941
		c1.09-1.325,1.633-2.877,1.633-4.585v-2.251c-2.098,0-3.884,0.153-5.438,0.465c-3.57,0.697-5.354,2.25-5.354,4.658
		c0,1.01,0.385,1.866,1.085,2.646c0.7,0.696,1.787,1.083,3.264,1.083C420.244,93.435,420.556,93.359,420.866,93.359z
		 M420.866,81.706c1.243-0.077,2.488-0.153,3.806-0.153c0.394,0,0.937,0,1.633,0.076v-1.863c0-2.563-1.785-3.805-5.202-3.805h-0.236
		c-3.259,0-5.124,1.32-5.514,3.805l-4.738-0.697c0.236-2.098,1.318-3.729,3.11-5.048c1.706-1.243,4.112-1.863,7.142-2.022h0.934
		c1.941,0,3.417,0.158,4.66,0.469c1.169,0.311,2.255,0.851,3.028,1.629c0.86,0.775,1.398,1.552,1.709,2.486
		c0.315,0.854,0.543,2.328,0.543,4.428v11.107c0,1.631,0.237,3.259,0.705,4.971h-5.286c-0.465-1.478-0.774-3.184-0.854-4.971
		c-1.09,2.721-2.875,4.35-5.438,5.125c-0.854,0.234-1.861,0.314-2.947,0.314c-2.409,0-4.432-0.701-5.903-2.099
		c-1.476-1.477-2.176-3.263-2.176-5.44C409.839,85.123,413.487,82.408,420.866,81.706z M475.162,97.088h-5.82V81.783
		c0-3.186-1.48-4.738-4.275-4.738c-1.629,0-2.955,0.546-3.962,1.787c-0.935,1.166-1.477,2.951-1.477,5.358v12.896h-5.902V81.781
		c0-3.184-1.318-4.813-3.964-4.813c-1.63,0-2.948,0.621-4.038,1.939c-1.087,1.324-1.63,3.03-1.63,5.282v12.896h-5.75V72.542h5.359
		v5.206c1.788-3.81,4.503-5.75,8.234-5.75c3.648,0,5.981,1.941,7.068,5.75c2.022-3.81,4.738-5.75,8.233-5.75
		c2.329,0,4.275,0.78,5.746,2.251c1.401,1.478,2.177,3.265,2.177,5.441V97.088L475.162,97.088z M487.592,69.67h-5.594v-5.75h5.594
		V69.67z M487.592,97.088h-5.594V72.541h5.594V97.088z M315.464,72.542h5.595l5.979,16.155l5.125-16.155h4.427l-9.552,27.963
		c-0.543,1.706-1.4,3.03-2.409,3.961c-1.007,0.933-2.408,1.396-4.274,1.396c-0.771,0-1.781,0-3.182-0.152v-4.351h2.644
		c1.161,0,2.019-0.156,2.563-0.546c0.538-0.387,1.006-1.088,1.316-2.018c0.391-1.012,0.547-1.556,0.547-1.711
		c0-0.154-0.236-0.621-0.547-1.553l-8.234-22.37l-0.232-0.621H315.464z M360.593,97.088h-5.203v-5.281
		c-1.397,3.804-3.959,5.749-7.769,5.749c-2.25,0-4.037-0.702-5.359-2.022c-1.32-1.4-1.945-3.34-1.945-5.828V72.542h5.675v15.999
		c0,1.711,0.386,2.877,1.165,3.42c0.775,0.543,1.555,0.852,2.252,0.852c1.244,0,2.486-0.545,3.727-1.629
		c1.244-1.091,1.865-3.342,1.865-6.836V72.542h5.593V97.088L360.593,97.088z M387.622,97.088h-5.514V81.706
		c0-1.552-0.389-2.796-1.163-3.649c-0.775-0.775-1.634-1.245-2.721-1.245c-1.396,0-2.719,0.702-3.806,1.945
		c-1.086,1.243-1.634,3.183-1.634,5.668v12.663h-5.51V72.542h5.05v5.669c1.786-4.117,4.271-6.215,7.453-6.215
		c2.176,0,4.037,0.7,5.518,2.098c1.548,1.32,2.327,3.729,2.327,7.146L387.622,97.088L387.622,97.088z M406.423,92.736v4.35
		c-1.634,0.313-2.955,0.545-3.811,0.545c-1.553,0-2.794-0.31-3.881-0.932c-1.089-0.545-1.864-1.401-2.333-2.408
		c-0.543-1.01-0.774-2.643-0.774-4.738V76.812h-3.106v-4.268h3.417l0.547-6.371l4.502-0.465v6.838h4.972v4.267h-4.972v11.964
		c0,1.552,0.311,2.644,0.855,3.185c0.621,0.543,1.629,0.854,3.184,0.854C405.485,92.814,405.954,92.736,406.423,92.736z
		 M315.464,96.389l0.231,0.699h-6.524l-2.72-8.078h-13.049l-2.641,8.078h-5.203l11.261-33.789h7.536L315.464,96.389z M304.82,84.191
		l-4.971-15.066l-4.896,15.066H304.82z"/>
	<path fill="#00567D" d="M212.622,16.692c3.266,0.544,5.593,3.649,5.048,6.991c-0.152,1.166-0.621,2.174-1.318,2.953
		c0.232,0,0.543,0,0.854,0.077c3.341,0.541,5.591,3.651,5.048,6.99c-0.469,3.34-3.647,5.592-6.988,5.128
		c-3.342-0.546-5.594-3.729-5.053-6.994c-0.54,3.265-3.649,5.592-6.99,5.052c-3.338-0.546-5.668-3.652-5.129-6.993
		c0.547-3.343,3.73-5.592,6.994-5.129c0.311,0.08,0.623,0.158,0.854,0.235c-0.389-1.009-0.543-2.096-0.311-3.184
		C206.096,18.479,209.28,16.15,212.622,16.692"/>
	<path fill="#00567D" d="M228.467,58.018c-14.365-4.507-29.667-6.994-45.516-6.994c-15.846,0-31.147,2.486-45.594,6.994
		l-4.121-11.496c15.694-4.971,32.395-7.69,49.715-7.69c17.244,0,33.943,2.719,49.631,7.69L228.467,58.018"/>
	<path fill="#00567D" d="M134.637,30.442c3.184-1.01,6.679,0.773,7.686,3.96c1.091,3.185-0.697,6.679-3.88,7.689
		c-3.183,1.088-6.681-0.699-7.689-3.883c-0.386-1.091-0.386-2.256-0.153-3.265c-0.311,0.158-0.546,0.234-0.854,0.312
		c-3.185,1.089-6.6-0.7-7.695-3.882c-1.003-3.264,0.779-6.681,3.963-7.767c3.184-1.008,6.679,0.774,7.693,3.958
		c0.307,1.089,0.386,2.175,0.15,3.265C134.094,30.676,134.404,30.596,134.637,30.442"/>
	<path fill="#00567D" d="M239.887,23.606c3.184,1.086,4.972,4.503,3.885,7.767c-1.008,3.182-4.506,4.971-7.69,3.882
		c-0.231-0.077-0.543-0.153-0.774-0.312c0.232,1.009,0.152,2.174-0.156,3.265c-1.009,3.184-4.507,4.971-7.691,3.883
		c-3.264-1.01-4.971-4.504-3.964-7.689c1.091-3.187,4.511-4.97,7.69-3.96c0.311,0.154,0.547,0.235,0.858,0.387
		c-0.237-1.09-0.237-2.176,0.153-3.265C233.205,24.381,236.703,22.599,239.887,23.606"/>
	<path fill="#00567D" d="M155.378,99.961c1.708,0,3.104,1.399,3.104,3.107c0,1.631-1.396,3.03-3.104,3.03
		c-1.633,0-3.03-1.399-3.03-3.03C152.348,101.36,153.745,99.961,155.378,99.961"/>
	<path fill="#00567D" d="M179.842,99.961c1.711,0,3.109,1.399,3.109,3.107c0,1.631-1.398,3.03-3.109,3.03
		c-1.63,0-3.027-1.399-3.027-3.03C176.814,101.36,178.212,99.961,179.842,99.961"/>
	<path fill="#00567D" d="M173.789,99.961c1.625,0,3.025,1.399,3.025,3.107c0,1.631-1.4,3.03-3.025,3.03
		c-1.715,0-3.109-1.399-3.109-3.03C170.68,101.36,172.072,99.961,173.789,99.961"/>
	<path fill="#00567D" d="M173.789,93.904c1.625,0,3.025,1.32,3.025,3.031c0,1.706-1.4,3.026-3.025,3.026
		c-1.715,0-3.109-1.32-3.109-3.026C170.68,95.223,172.072,93.904,173.789,93.904"/>
	<path fill="#00567D" d="M161.51,99.961c1.711,0,3.109,1.399,3.109,3.107c0,1.631-1.398,3.03-3.109,3.03
		c-1.705,0-3.027-1.399-3.027-3.03C158.482,101.36,159.805,99.961,161.51,99.961"/>
	<path fill="#00567D" d="M161.51,93.904c1.711,0,3.109,1.32,3.109,3.031c0,1.706-1.398,3.026-3.109,3.026
		c-1.705,0-3.027-1.32-3.027-3.026C158.482,95.223,159.805,93.904,161.51,93.904"/>
	<path fill="#00567D" d="M171.922,157.284c-7.536-1.472-15.072-0.696-22.605,2.489c-1.081,0.387-2.098,0.854-3.105,1.397
		c0,0.542,0.15,1.166,0.307,1.786c0.473,1.321,1.323,2.405,2.331,3.108c0.233-0.08,0.314-0.157,0.467-0.157
		c7.533-3.184,15.069-3.963,22.605-2.486c3.649,0.699,7.38,2.021,11.029,3.886c3.727,1.784,7.453,3.107,11.106,3.882l13.364-2.715
		l7.688-1.478c2.561-0.7,4.506-3.107,4.506-5.902c-4.039,2.094-8.158,3.419-12.193,4.115c-8.158,1.397-16.313,0-24.471-4.039
		C179.302,159.307,175.571,158.064,171.922,157.284 M149.316,153.637l3.031-1.165v-3.575h-6.136v5.984
		C147.218,154.569,148.31,154.101,149.316,153.637z M149.316,141.287l3.031-1.555v-9.165h6.135v-6.139h6.137v-9.164
		c0-1.633,1.322-3.03,3.031-3.03c1.712,0,3.03,1.397,3.03,3.03v3.108h12.271v-6.139h6.06v-18.33c0-1.711,1.395-3.107,3.106-3.107
		s3.03,1.396,3.03,3.107v9.399h12.275v-3.343c0-1.633,1.318-3.027,3.027-3.027s3.029,1.395,3.029,3.027v12.273h6.137V78.213
		c-4.039,0.385-8.158,0.619-12.193,0.619c-8.236,0-16.549-1.008-24.471-2.871c-3.648,0.852-7.301,1.553-11.027,2.019
		c-7.538,0.931-15.148,1.089-22.607,0.468c-1.081-0.076-2.098-0.234-3.105-0.311v64.705L149.316,141.287z M171.922,183.386
		l-22.605-4.507l-5.518-1.083c-5.589-1.168-9.784-5.828-9.784-11.73V63.299c4.975,1.395,10.098,2.328,15.301,2.873
		c7.534,0.777,15.149,0.545,22.605-0.546c3.728-0.545,7.38-1.318,11.028-2.328c7.922,2.174,16.234,3.336,24.472,3.336
		c8.23,0,16.462-1.162,24.464-3.336V165.83c0,5.904-4.273,10.797-9.783,11.965l-14.681,2.95l-24.472,4.893L171.922,183.386z
		 M171.922,169.561c-3.652-0.778-7.304-0.934-11.035-0.545l11.035,2.174l11.029,2.174
		C179.302,171.576,175.571,170.259,171.922,169.561z M182.951,155.033c8.157,4.116,16.313,5.437,24.471,4.116
		c4.034-0.697,8.154-2.093,12.193-4.116v-6.137c-4.039,2.098-8.158,3.421-12.193,4.116c-6.139,1.012-12.275,0.467-18.41-1.552v3.571
		L182.951,155.033L182.951,155.033z M207.422,142.841h-12.275v4.039c4.117,0.699,8.154,0.699,12.275,0
		c4.034-0.698,8.154-2.021,12.193-4.039H207.422z"/>
</g>
</svg>
