{
    "t53jqm": {
        "geom": "{\"type\":\"Polygon\",\"coordinates\":[[[136.986215429403,-25.3028110467242],[137.979826803443,-25.2860740452855],[138.002446716061,-26.1889391677024],[137.00130811844,-26.2063614580712],[136.986215429403,-25.3028110467242]]]}",
        "epsgcode": 32753
    },
    "t53jqn": {
        "geom": "{\"type\":\"Polygon\",\"coordinates\":[[[136.971855309854,-24.4005861289078],[137.958304337434,-24.3845235514671],[137.979862094078,-25.2875170016184],[136.986238976112,-25.3042550902465],[136.971855309854,-24.4005861289078]]]}",
        "epsgcode": 32753
    },
    "t53jrm": {
        "geom": "{\"type\":\"Polygon\",\"coordinates\":[[[137.978834854868,-25.2860940943916],[138.497663905434,-25.274515762286],[138.502691119372,-26.1998085056414],[138.001447265069,-26.1889600375925],[137.978834854868,-25.2860940943916]]]}",
        "epsgcode": 32753
    },
    "t53jrn": {
        "geom": "{\"type\":\"Polygon\",\"coordinates\":[[[137.957319527855,-24.3845427927889],[138.494267971029,-24.3729208773857],[138.497115660027,-25.2761523706582],[137.978870133797,-25.2875370520267],[137.957319527855,-24.3845427927889]]]}",
        "epsgcode": 32753
    },
    "t53kqp": {
        "geom": "{\"type\":\"Polygon\",\"coordinates\":[[[136.958172891729,-23.4977045220578],[137.937797155715,-23.4823075376615],[137.958325349831,-24.3854255254677],[136.971869329496,-24.4014887729044],[136.958172891729,-23.4977045220578]]]}",
        "epsgcode": 32753
    },
    "t53kqq": {
        "geom": "{\"type\":\"Polygon\",\"coordinates\":[[[136.945156207186,-22.5947111611929],[137.918287385692,-22.5799710419095],[137.937817155674,-23.4832096340971],[136.958186235591,-23.4986072795115],[136.945156207186,-22.5947111611929]]]}",
        "epsgcode": 32753
    },
    "t53kqr": {
        "geom": "{\"type\":\"Polygon\",\"coordinates\":[[[136.932793011839,-21.6921513371124],[137.899756735057,-21.6780594563981],[137.918317814338,-22.5814145857086],[136.945176508618,-22.5961557490589],[136.932793011839,-21.6921513371124]]]}",
        "epsgcode": 32753
    },
    "t53kra": {
        "geom": "{\"type\":\"Polygon\",\"coordinates\":[[[137.819745012921,-17.1647466960621],[138.470920430959,-17.1544164765164],[138.472968987661,-18.058179774173],[137.833831221119,-18.068623311776],[137.819745012921,-17.1647466960621]]]}",
        "epsgcode": 32753
    },
    "t53krb": {
        "geom": "{\"type\":\"Polygon\",\"coordinates\":[[[137.806509943816,-16.2622234061462],[138.468654370726,-16.2522271716267],[138.470950654253,-17.1560405689959],[137.81976685622,-17.1661912393438],[137.806509943816,-16.2622234061462]]]}",
        "epsgcode": 32753
    },
    "t53krp": {
        "geom": "{\"type\":\"Polygon\",\"coordinates\":[[[137.93681914889,-23.4823259817636],[138.490587921407,-23.4707194165819],[138.493707209278,-24.3740163043477],[137.957340533282,-24.385444767592],[137.93681914889,-23.4823259817636]]]}",
        "epsgcode": 32753
    },
    "t53krq": {
        "geom": "{\"type\":\"Polygon\",\"coordinates\":[[[137.917315851208,-22.5799886992343],[138.487230688556,-22.5684404805682],[138.490616416618,-23.4718013447292],[137.936839142214,-23.4832280789909],[137.917315851208,-22.5799886992343]]]}",
        "epsgcode": 32753
    },
    "t53krr": {
        "geom": "{\"type\":\"Polygon\",\"coordinates\":[[[137.89879134852,-21.6780763372674],[138.484206213016,-21.6666276400096],[138.487271564184,-22.570063563082],[137.917346269759,-22.5814322442841],[137.89879134852,-21.6780763372674]]]}",
        "epsgcode": 32753
    },
    "t53krs": {
        "geom": "{\"type\":\"Polygon\",\"coordinates\":[[[137.881196155818,-20.7755102249545],[138.481485109828,-20.7642013524488],[138.484232238967,-21.6677098177263],[137.898809406536,-21.678978667329],[137.881196155818,-20.7755102249545]]]}",
        "epsgcode": 32753
    },
    "t53krt": {
        "geom": "{\"type\":\"Polygon\",\"coordinates\":[[[137.864516174839,-19.872835815398],[138.47850652336,-19.8617164912456],[138.48093457715,-20.7652953203538],[137.881213286326,-20.7764126653659],[137.864516174839,-19.872835815398]]]}",
        "epsgcode": 32753
    },
    "t53kru": {
        "geom": "{\"type\":\"Polygon\",\"coordinates\":[[[137.848736768755,-18.9705988853425],[138.475857832925,-18.9597049048935],[138.478541966433,-19.863340107607],[137.864542139519,-19.874279889918],[137.848736768755,-18.9705988853425]]]}",
        "epsgcode": 32753
    },
    "t53krv": {
        "geom": "{\"type\":\"Polygon\",\"coordinates\":[[[137.833816731059,-18.0677205655546],[138.47351360339,-18.0570869628769],[138.475880287306,-18.9607874260144],[137.848752117124,-18.9715015338654],[137.833816731059,-18.0677205655546]]]}",
        "epsgcode": 32753
    },
    "t54jts": {
        "geom": "{\"type\":\"Polygon\",\"coordinates\":[[[138.495832288096,-25.2947415700726],[139.014380271122,-25.3028190720639],[138.99929210131,-26.2063698120519],[138.49900795117,-26.1985372753783],[138.495832288096,-25.2947415700726]]]}",
        "epsgcode": 32754
    },
    "t54jtt": {
        "geom": "{\"type\":\"Polygon\",\"coordinates\":[[[138.492055949144,-24.3924737737094],[139.028736090647,-24.4005938308224],[139.014356731464,-25.3042631161075],[138.49520344935,-25.2963554251022],[138.492055949144,-24.3924737737094]]]}",
        "epsgcode": 32754
    },
    "t54jus": {
        "geom": "{\"type\":\"Polygon\",\"coordinates\":[[[139.013387437056,-25.3028056951622],[140.007708487422,-25.3128523964533],[140.000163757892,-26.2168140404612],[138.998291735206,-26.2063558873606],[139.013387437056,-25.3028056951622]]]}",
        "epsgcode": 32754
    },
    "t54jut": {
        "geom": "{\"type\":\"Polygon\",\"coordinates\":[[[139.027750423283,-24.4005809930164],[140.014886914562,-24.4102227765982],[140.007696716668,-25.3142970923744],[139.013363885646,-25.3042497383368],[139.027750423283,-24.4005809930164]]]}",
        "epsgcode": 32754
    },
    "t54jvn": {
        "geom": "{\"type\":\"Polygon\",\"coordinates\":[[[139.973675539779,-28.9238295005193],[141.000820785613,-28.9277411669667],[141.000828068797,-29.8313698018336],[139.964570496145,-29.8273118593371],[139.973675539779,-28.9238295005193]]]}",
        "epsgcode": 32754
    },
    "t54jvp": {
        "geom": "{\"type\":\"Polygon\",\"coordinates\":[[[139.982363779245,-28.0211259050334],[141.000813835873,-28.024893892935],[141.000820792723,-28.9286437734933],[139.973666651852,-28.9247319621925],[139.982363779245,-28.0211259050334]]]}",
        "epsgcode": 32754
    },
    "t54jvq": {
        "geom": "{\"type\":\"Polygon\",\"coordinates\":[[[139.99065411172,-27.1188429270482],[141.000807204455,-27.122469639231],[141.000813846737,-28.0263382551639],[139.982350198441,-28.0225700393084],[139.99065411172,-27.1188429270482]]]}",
        "epsgcode": 32754
    },
    "t54jvr": {
        "geom": "{\"type\":\"Polygon\",\"coordinates\":[[[139.998570022486,-26.2159000740829],[141.000800872567,-26.2193876190625],[141.000807210936,-27.1233724829951],[139.990646009666,-27.1197456305953],[139.998570022486,-26.2159000740829]]]}",
        "epsgcode": 32754
    },
    "t54jvs": {
        "geom": "{\"type\":\"Polygon\",\"coordinates\":[[[140.006119102661,-25.3128416890927],[141.000794834133,-25.31619214226],[141.000800878749,-26.2202905776178],[139.998562293398,-26.2168028945545],[140.006119102661,-25.3128416890927]]]}",
        "epsgcode": 32754
    },
    "t54jvt": {
        "geom": "{\"type\":\"Polygon\",\"coordinates\":[[[140.013309023155,-24.410212500815],[141.000789083013,-24.4134279051674],[141.000794843563,-25.3176370551918],[140.006107313061,-25.314286384318],[140.013309023155,-24.410212500815]]]}",
        "epsgcode": 32754
    },
    "t54jwn": {
        "geom": "{\"type\":\"Polygon\",\"coordinates\":[[[140.999794803597,-28.9277411693121],[142.026939927107,-28.9238248075549],[142.03605042849,-29.827306990887],[140.999792982801,-29.8313698042667],[140.999794803597,-28.9277411693121]]]}",
        "epsgcode": 32754
    },
    "t54jwp": {
        "geom": "{\"type\":\"Polygon\",\"coordinates\":[[[140.999796541032,-28.0248938951942],[142.018246479675,-28.0211213844392],[142.026948820362,-28.9247272690543],[140.999794801819,-28.9286437758388],[140.999796541032,-28.0248938951942]]]}",
        "epsgcode": 32754
    },
    "t54jwq": {
        "geom": "{\"type\":\"Polygon\",\"coordinates\":[[[140.999798198886,-27.1224696414056],[142.009951177698,-27.1188385759422],[142.01826006862,-28.0225655184407],[140.999796538316,-28.0263382574233],[140.999798198886,-27.1224696414056]]]}",
        "epsgcode": 32754
    },
    "t54jwr": {
        "geom": "{\"type\":\"Polygon\",\"coordinates\":[[[140.999799781858,-26.2193876211536],[142.002030521824,-26.2158958899361],[142.009959284609,-27.1197412793211],[140.999798197266,-27.1233724851697],[140.999799781858,-26.2193876211536]]]}",
        "epsgcode": 32754
    },
    "t54jws": {
        "geom": "{\"type\":\"Polygon\",\"coordinates\":[[[140.999801291467,-25.3161921442689],[141.99447691639,-25.3128376694159],[142.002038255545,-26.2167987102422],[140.999799780313,-26.220290579709],[140.999801291467,-25.3161921442689]]]}",
        "epsgcode": 32754
    },
    "t54jwt": {
        "geom": "{\"type\":\"Polygon\",\"coordinates\":[[[140.999802729247,-24.4134279070953],[141.987282685896,-24.4102086431577],[141.994488713057,-25.3142823643801],[140.999801289109,-25.3176370572008],[140.999802729247,-24.4134279070953]]]}",
        "epsgcode": 32754
    },
    "t54jxn": {
        "geom": "{\"type\":\"Polygon\",\"coordinates\":[[[142.025914148882,-28.9238326275997],[143.052651486615,-28.9120939194751],[143.070849756257,-29.8151374969189],[142.035015554013,-29.8273151033495],[142.025914148882,-28.9238326275997]]]}",
        "epsgcode": 32754
    },
    "t54jxp": {
        "geom": "{\"type\":\"Polygon\",\"coordinates\":[[[142.017229381396,-28.0211289172578],[143.035285994576,-28.0098213208332],[143.052669251086,-28.9129959466309],[142.025923033257,-28.9247350893888],[142.017229381396,-28.0211289172578]]]}",
        "epsgcode": 32754
    },
    "t54jxq": {
        "geom": "{\"type\":\"Polygon\",\"coordinates\":[[[142.008942361925,-27.1188458263369],[143.018715551738,-27.1079621385052],[143.035313139229,-28.0112647713024],[142.017242956773,-28.022573051715],[142.008942361925,-27.1188458263369]]]}",
        "epsgcode": 32754
    },
    "t54jxr": {
        "geom": "{\"type\":\"Polygon\",\"coordinates\":[[[142.001029614567,-26.2159028621209],[143.002893254163,-26.2054367623134],[143.018731745979,-27.1088644214294],[142.008950460741,-27.119748529996],[142.001029614567,-26.2159028621209]]]}",
        "epsgcode": 32754
    },
    "t54jxs": {
        "geom": "{\"type\":\"Polygon\",\"coordinates\":[[[141.993483551233,-25.3128443675388],[142.987803962889,-25.3027896340656],[143.002908703151,-26.2063391685558],[142.001037340566,-26.216805682703],[141.993483551233,-25.3128443675388]]]}",
        "epsgcode": 32754
    },
    "t54jxt": {
        "geom": "{\"type\":\"Polygon\",\"coordinates\":[[[141.986296504076,-24.4102150713021],[142.973432376647,-24.4005655791897],[142.987827528399,-25.3042336761968],[141.993495336122,-25.3142890629382],[141.986296504076,-24.4102150713021]]]}",
        "epsgcode": 32754
    },
    "t54jyn": {
        "geom": "{\"type\":\"Polygon\",\"coordinates\":[[[143.051011218098,-28.9121189179752],[144.001548671478,-28.8941011699582],[144.001479599245,-29.7972677739546],[143.069194970745,-29.8151634299781],[143.051011218098,-28.9121189179752]]]}",
        "epsgcode": 32754
    },
    "t54jyp": {
        "geom": "{\"type\":\"Polygon\",\"coordinates\":[[[143.033659579342,-28.0098454013432],[144.00177317508,-27.991925793099],[144.001579812958,-28.8951828113605],[143.051028968397,-28.9130209460564],[143.033659579342,-28.0098454013432]]]}",
        "epsgcode": 32754
    },
    "t54jyq": {
        "geom": "{\"type\":\"Polygon\",\"coordinates\":[[[143.017102356105,-27.1079853163522],[144.001534219239,-27.0902159182315],[144.001818169471,-27.9935484696908],[143.03368670234,-28.0112888532688],[143.017102356105,-27.1079853163522]]]}",
        "epsgcode": 32754
    },
    "t54jyr": {
        "geom": "{\"type\":\"Polygon\",\"coordinates\":[[[143.001292681778,-26.2054590509465],[144.001419512163,-26.1878779754827],[144.001563084355,-27.0912978430969],[143.017118537427,-27.1088876001723],[143.001292681778,-26.2054590509465]]]}",
        "epsgcode": 32754
    },
    "t54jys": {
        "geom": "{\"type\":\"Polygon\",\"coordinates\":[[[142.986215429403,-25.3028110467242],[143.979826803443,-25.2860740452855],[144.002446716061,-26.1889391677024],[143.00130811844,-26.2063614580712],[142.986215429403,-25.3028110467242]]]}",
        "epsgcode": 32754
    },
    "t54jyt": {
        "geom": "{\"type\":\"Polygon\",\"coordinates\":[[[142.971855309853,-24.4005861289078],[143.958304337434,-24.3845235514671],[143.979862094078,-25.2875170016184],[142.986238976112,-25.3042550902465],[142.971855309853,-24.4005861289078]]]}",
        "epsgcode": 32754
    },
    "t54jzs": {
        "geom": "{\"type\":\"Polygon\",\"coordinates\":[[[143.978834854868,-25.2860940943916],[144.497663905434,-25.274515762286],[144.502691119372,-26.1998085056414],[144.001447265069,-26.1889600375925],[143.978834854868,-25.2860940943916]]]}",
        "epsgcode": 32754
    },
    "t54jzt": {
        "geom": "{\"type\":\"Polygon\",\"coordinates\":[[[143.957319527855,-24.3845427927889],[144.494267971029,-24.3729208773857],[144.497115660027,-25.2761523706582],[143.978870133797,-25.2875370520267],[143.957319527855,-24.3845427927889]]]}",
        "epsgcode": 32754
    },
    "t54kta": {
        "geom": "{\"type\":\"Polygon\",\"coordinates\":[[[138.482030365177,-21.6841164671634],[139.067786691017,-21.6921580939928],[139.055406902733,-22.5961628172938],[138.484563738392,-22.5882329817698],[138.482030365177,-21.6841164671634]]]}",
        "epsgcode": 32754
    },
    "t54ktb": {
        "geom": "{\"type\":\"Polygon\",\"coordinates\":[[[138.478890629937,-20.7809976789978],[139.0795259429,-20.7889515848592],[139.067774642873,-21.6930610681338],[138.482011534535,-21.6851996046608],[138.478890629937,-20.7809976789978]]]}",
        "epsgcode": 32754
    },
    "t54ktc": {
        "geom": "{\"type\":\"Polygon\",\"coordinates\":[[[138.47631386873,-19.8778135954924],[139.090654392941,-19.885644098493],[139.079514513777,-20.7898546618107],[138.478872635419,-20.7820809295899],[138.47631386873,-19.8778135954924]]]}",
        "epsgcode": 32754
    },
    "t54ktd": {
        "geom": "{\"type\":\"Polygon\",\"coordinates\":[[[138.47370720198,-18.9750999707086],[139.101181837,-18.9827813559419],[139.090637070121,-19.8870891801186],[138.476288124512,-19.8794386356202],[138.47370720198,-18.9750999707086]]]}",
        "epsgcode": 32754
    },
    "t54kte": {
        "geom": "{\"type\":\"Polygon\",\"coordinates\":[[[138.471082331184,-18.0717762962991],[139.111135794378,-18.0792833242579],[139.101171597206,-18.983684627227],[138.473690862967,-18.9761834361246],[138.471082331184,-18.0717762962991]]]}",
        "epsgcode": 32754
    },
    "t54ktf": {
        "geom": "{\"type\":\"Polygon\",\"coordinates\":[[[138.468989473036,-17.168394311027],[139.120523661632,-17.1756958239609],[139.111126127351,-18.0801866869654],[138.471066808867,-18.0728598628043],[138.468989473036,-17.168394311027]]]}",
        "epsgcode": 32754
    },
    "t54ktg": {
        "geom": "{\"type\":\"Polygon\",\"coordinates\":[[[138.466848105184,-16.2654911790965],[139.129353248059,-16.2725649645442],[139.120509089096,-17.1771413442049],[138.468403770513,-17.1700127351309],[138.466848105184,-16.2654911790965]]]}",
        "epsgcode": 32754
    },
    "t54ktu": {
        "geom": "{\"type\":\"Polygon\",\"coordinates\":[[[138.488315853051,-23.4895814679073],[139.042414411541,-23.4977119047872],[139.028722075203,-24.4014964751402],[138.49144341216,-24.3935467547525],[138.488315853051,-23.4895814679073]]]}",
        "epsgcode": 32754
    },
    "t54ktv": {
        "geom": "{\"type\":\"Polygon\",\"coordinates\":[[[138.485176401732,-22.5866175875111],[139.055427198085,-22.5947182289272],[139.042401071675,-23.4986146625578],[138.488295324566,-23.4906643676578],[138.485176401732,-22.5866175875111]]]}",
        "epsgcode": 32754
    },
    "t54kua": {
        "geom": "{\"type\":\"Polygon\",\"coordinates\":[[[139.066820519716,-21.692146831401],[140.034413154104,-21.7006054843366],[140.028223035744,-22.6049994840891],[139.054434550611,-22.5961510357259],[139.066820519716,-21.692146831401]]]}",
        "epsgcode": 32754
    },
    "t54kub": {
        "geom": "{\"type\":\"Polygon\",\"coordinates\":[[[139.078565632789,-20.7889408345022],[140.040282930117,-20.7970147583371],[140.034407129847,-21.7015088449079],[139.066808465556,-21.6930498050268],[139.078565632789,-20.7889408345022]]]}",
        "epsgcode": 32754
    },
    "t54kuc": {
        "geom": "{\"type\":\"Polygon\",\"coordinates\":[[[139.089699639206,-19.8856338545095],[140.045847241528,-19.8933274543892],[140.040277215439,-20.7979182171878],[139.078554197959,-20.7898439109445],[139.089699639206,-19.8856338545095]]]}",
        "epsgcode": 32754
    },
    "t54kud": {
        "geom": "{\"type\":\"Polygon\",\"coordinates\":[[[139.100232339695,-18.9827716125156],[140.051110995518,-18.9900892595107],[140.045838580025,-19.8947731402271],[139.089682307737,-19.8870789353295],[139.100232339695,-18.9827716125156]]]}",
        "epsgcode": 32754
    },
    "t54kue": {
        "geom": "{\"type\":\"Polygon\",\"coordinates\":[[[139.110191267275,-18.0792740765038],[140.056087960172,-18.086219442023],[140.051105875614,-18.9909929044148],[139.100222094788,-18.9836748833026],[139.110191267275,-18.0792740765038]]]}",
        "epsgcode": 32754
    },
    "t54kuf": {
        "geom": "{\"type\":\"Polygon\",\"coordinates\":[[[139.119583822176,-17.1756870670102],[140.060781841354,-17.1822638102192],[140.056083126693,-18.087123174578],[139.110181595421,-18.0801774387182],[139.119583822176,-17.1756870670102]]]}",
        "epsgcode": 32754
    },
    "t54kug": {
        "geom": "{\"type\":\"Polygon\",\"coordinates\":[[[139.128417817576,-16.272556693544],[140.065196550681,-16.2787684612201],[140.060774555197,-17.1837099165612],[139.119569242364,-17.1771325864728],[139.128417817576,-16.272556693544]]]}",
        "epsgcode": 32754
    },
    "t54kuu": {
        "geom": "{\"type\":\"Polygon\",\"coordinates\":[[[139.04143557289,-23.4976995990096],[140.021726481547,-23.5069417768994],[140.01487990638,-24.4111258226345],[139.027736400842,-24.4014836367987],[139.04143557289,-23.4976995990096]]]}",
        "epsgcode": 32754
    },
    "t54kuv": {
        "geom": "{\"type\":\"Polygon\",\"coordinates\":[[[139.054454856096,-22.5947064481938],[140.028233183844,-22.6035542697469],[140.021719811259,-23.5078449309959],[139.041422226365,-23.4986023562519],[139.054454856096,-22.5947064481938]]]}",
        "epsgcode": 32754
    },
    "t54kva": {
        "geom": "{\"type\":\"Polygon\",\"coordinates\":[[[140.032866526592,-21.7005964695583],[141.000773439356,-21.7034172837164],[141.000778398616,-22.6079408686178],[140.026666497018,-22.6049900538624],[140.032866526592,-21.7005964695583]]]}",
        "epsgcode": 32754
    },
    "t54kvb": {
        "geom": "{\"type\":\"Polygon\",\"coordinates\":[[[140.038745700974,-20.7970061536043],[141.000768736757,-20.7996986581842],[141.000773444182,-21.7043207729247],[140.032860492689,-21.7014998297172],[140.038745700974,-20.7970061536043]]]}",
        "epsgcode": 32754
    },
    "t54kvc": {
        "geom": "{\"type\":\"Polygon\",\"coordinates\":[[[140.044318921721,-19.8933192550038],[141.000764278897,-19.8958849204053],[141.000768741335,-20.8006022441622],[140.038739977146,-20.7979096120473],[140.044318921721,-19.8933192550038]]]}",
        "epsgcode": 32754
    },
    "t54kvd": {
        "geom": "{\"type\":\"Polygon\",\"coordinates\":[[[140.049591103861,-18.9900814608111],[141.000760061843,-18.9925217459673],[141.000764285837,-19.8973308073726],[140.04431024635,-19.8947649401968],[140.049591103861,-18.9900814608111]]]}",
        "epsgcode": 32754
    },
    "t54kve": {
        "geom": "{\"type\":\"Polygon\",\"coordinates\":[[[140.054576037515,-18.0862120400939],[141.000756074562,-18.0885281705058],[141.000760065945,-18.9934255152402],[140.049585975759,-18.9909851053165],[140.054576037515,-18.0862120400939]]]}",
        "epsgcode": 32754
    },
    "t54kvf": {
        "geom": "{\"type\":\"Polygon\",\"coordinates\":[[[140.059277434471,-17.1822568011581],[141.000752314083,-17.1844499981564],[141.000756078435,-18.089432026173],[140.054571196296,-18.0871157722541],[140.059277434471,-17.1822568011581]]]}",
        "epsgcode": 32754
    },
    "t54kvg": {
        "geom": "{\"type\":\"Polygon\",\"coordinates\":[[[140.063699212603,-16.2787618411382],[141.00074877727,-16.2808333218384],[141.00075231992,-17.1858962995931],[140.059270136647,-17.1837029068746],[140.063699212603,-16.2787618411382]]]}",
        "epsgcode": 32754
    },
    "t54kvu": {
        "geom": "{\"type\":\"Polygon\",\"coordinates\":[[[140.02015954104,-23.5069319270278],[141.000783603399,-23.5100140559047],[141.000789088628,-24.4143310849344],[140.013302003752,-24.4111155464225],[140.02015954104,-23.5069319270278]]]}",
        "epsgcode": 32754
    },
    "t54kvv": {
        "geom": "{\"type\":\"Polygon\",\"coordinates\":[[[140.026676661366,-22.6035448401883],[141.000778390486,-22.6064954458952],[141.000783608743,-23.5109173419352],[140.020152860072,-23.5078350807012],[140.026676661366,-22.6035448401883]]]}",
        "epsgcode": 32754
    },
    "t54kwa": {
        "geom": "{\"type\":\"Polygon\",\"coordinates\":[[[140.999806640161,-21.7034172854077],[141.967713458518,-21.700593085298],[141.973917204791,-22.6049865136376],[140.999805400346,-22.607940870387],[140.999806640161,-21.7034172854077]]]}",
        "epsgcode": 32754
    },
    "t54kwb": {
        "geom": "{\"type\":\"Polygon\",\"coordinates\":[[[140.999807815811,-20.7996986597986],[141.961830759752,-20.7970029232801],[141.967719496038,-21.7014964453021],[140.999806638954,-21.7043207746161],[140.999807815811,-20.7996986597986]]]}",
        "epsgcode": 32754
    },
    "t54kwc": {
        "geom": "{\"type\":\"Polygon\",\"coordinates\":[[[140.999808930276,-19.8958849219437],[141.95625419801,-19.8933161768521],[141.961836487012,-20.7979063815702],[140.999807814666,-20.8006022457766],[140.999808930276,-19.8958849219437]]]}",
        "epsgcode": 32754
    },
    "t54kwd": {
        "geom": "{\"type\":\"Polygon\",\"coordinates\":[[[140.999809984539,-18.9925217474305],[141.950978855319,-18.9900785330819],[141.956262878581,-19.894761861803],[140.999808928541,-19.8973308089111],[140.999809984539,-18.9925217474305]]]}",
        "epsgcode": 32754
    },
    "t54kwe": {
        "geom": "{\"type\":\"Polygon\",\"coordinates\":[[[140.999810981359,-18.0885281718946],[141.945990933295,-18.0862092613172],[141.950983986495,-18.9909821774377],[140.999809983514,-18.9934255167034],[140.999810981359,-18.0885281718946]]]}",
        "epsgcode": 32754
    },
    "t54kwf": {
        "geom": "{\"type\":\"Polygon\",\"coordinates\":[[[140.999811921479,-17.1844499994714],[141.941286717928,-17.1822541698691],[141.945995777415,-18.0871129933293],[140.999810980391,-18.0894320275618],[140.999811921479,-17.1844499994714]]]}",
        "epsgcode": 32754
    },
    "t54kwg": {
        "geom": "{\"type\":\"Polygon\",\"coordinates\":[[[140.999812805682,-16.2808333230804],[141.936862288997,-16.2787593558768],[141.941294020126,-17.1837002753507],[140.99981192002,-17.1858963009082],[140.999812805682,-16.2808333230804]]]}",
        "epsgcode": 32754
    },
    "t54kwu": {
        "geom": "{\"type\":\"Polygon\",\"coordinates\":[[[140.99980409915,-23.5100140577527],[141.98042806143,-23.5069282292631],[141.987289709506,-24.4111116886043],[140.999802727843,-24.4143310868624],[140.99980409915,-23.5100140577527]]]}",
        "epsgcode": 32754
    },
    "t54kwv": {
        "geom": "{\"type\":\"Polygon\",\"coordinates\":[[[140.999805402378,-22.6064954476644],[141.97390703435,-22.6035413002143],[141.980434746404,-23.5078313827778],[140.999804097814,-23.5109173437833],[140.999805402378,-22.6064954476644]]]}",
        "epsgcode": 32754
    },
    "t54kxa": {
        "geom": "{\"type\":\"Polygon\",\"coordinates\":[[[141.966746816605,-21.7005987246051],[142.934338885016,-21.6921333088689],[142.946732271083,-22.5961368900806],[141.972944368378,-22.6049924128335],[141.966746816605,-21.7005987246051]]]}",
        "epsgcode": 32754
    },
    "t54kxb": {
        "geom": "{\"type\":\"Polygon\",\"coordinates\":[[[141.960869991813,-20.7970083060781],[142.922586738539,-20.7889279269894],[142.934350946394,-21.6930362818762],[141.966752848097,-21.7015020848671],[141.960869991813,-20.7970083060781]]]}",
        "epsgcode": 32754
    },
    "t54kxc": {
        "geom": "{\"type\":\"Polygon\",\"coordinates\":[[[141.955298998399,-19.89332130608],[142.911446064491,-19.8856215549785],[142.922598180216,-20.7898310028204],[141.960875713354,-20.7979117646232],[141.955298998399,-19.89332130608]]]}",
        "epsgcode": 32754
    },
    "t54kxd": {
        "geom": "{\"type\":\"Polygon\",\"coordinates\":[[[141.950028923294,-18.9900834116558],[142.900907056305,-18.9827599139831],[142.911463406339,-19.8870666348314],[141.955307670302,-19.8947669914343],[141.950028923294,-18.9900834116558]]]}",
        "epsgcode": 32754
    },
    "t54kxe": {
        "geom": "{\"type\":\"Polygon\",\"coordinates\":[[[141.945045981889,-18.0862138916864],[142.890942164501,-18.0792629731046],[142.900917307347,-18.983663184172],[141.950034049347,-18.9909870562609],[141.945045981889,-18.0862138916864]]]}",
        "epsgcode": 32754
    },
    "t54kxf": {
        "geom": "{\"type\":\"Polygon\",\"coordinates\":[[[141.940346463875,-17.1822585544747],[142.88154398444,-17.1756765528983],[142.890951842147,-18.080166334727],[141.945050821172,-18.0871176239454],[141.940346463875,-17.1822585544747]]]}",
        "epsgcode": 32754
    },
    "t54kxg": {
        "geom": "{\"type\":\"Polygon\",\"coordinates\":[[[141.935926452942,-16.2787634971517],[142.872704698289,-16.272546762893],[142.881558572984,-17.1771220714226],[141.940353758782,-17.1837046603477],[141.935926452942,-16.2787634971517]]]}",
        "epsgcode": 32754
    },
    "t54kxu": {
        "geom": "{\"type\":\"Polygon\",\"coordinates\":[[[141.979448723913,-23.5069343909731],[142.959739032612,-23.4976848239675],[142.973446407484,-24.401468222329],[141.986303520673,-24.4111181170168],[141.979448723913,-23.5069343909731]]]}",
        "epsgcode": 32754
    },
    "t54kxv": {
        "geom": "{\"type\":\"Polygon\",\"coordinates\":[[[141.972934208092,-22.6035471989923],[142.946711953439,-22.5946923035505],[142.95975238713,-23.4985875805754],[141.979455402211,-23.5078375447524],[141.972934208092,-22.6035471989923]]]}",
        "epsgcode": 32754
    },
    "t54kya": {
        "geom": "{\"type\":\"Polygon\",\"coordinates\":[[[142.932793011839,-21.6921513371124],[143.899756735057,-21.6780594563981],[143.918317814338,-22.5814145857086],[142.945176508618,-22.5961557490589],[142.932793011839,-21.6921513371124]]]}",
        "epsgcode": 32754
    },
    "t54kyb": {
        "geom": "{\"type\":\"Polygon\",\"coordinates\":[[[142.92105024324,-20.788945135289],[143.882155702465,-20.7754941117092],[143.899774799067,-21.6789617856876],[142.932805063592,-21.6930543109443],[142.92105024324,-20.788945135289]]]}",
        "epsgcode": 32754
    },
    "t54kyc": {
        "geom": "{\"type\":\"Polygon\",\"coordinates\":[[[142.909918459372,-19.8856379527166],[143.865470185015,-19.872820461012],[143.88217283866,-20.7763965513575],[142.921061675787,-20.7898482119351],[142.909918459372,-19.8856379527166]]]}",
        "epsgcode": 32754
    },
    "t54kyd": {
        "geom": "{\"type\":\"Polygon\",\"coordinates\":[[[142.899387861453,-18.9827755104698],[143.849685541091,-18.9705842811168],[143.865496158312,-19.8742645343248],[142.909935787381,-19.8870830338589],[142.899387861453,-18.9827755104698]]]}",
        "epsgcode": 32754
    },
    "t54kye": {
        "geom": "{\"type\":\"Polygon\",\"coordinates\":[[[142.889430921952,-18.0792777761595],[143.834760550543,-18.0677067041847],[143.849700894555,-18.9714869288931],[142.899398104314,-18.9836787814561],[142.889430921952,-18.0792777761595]]]}",
        "epsgcode": 32754
    },
    "t54kyf": {
        "geom": "{\"type\":\"Polygon\",\"coordinates\":[[[142.880040242108,-17.1756905703151],[143.820684160934,-17.1647335702659],[143.834775045413,-18.068609449667],[142.889440591875,-18.0801811385712],[142.880040242108,-17.1756905703151]]]}",
        "epsgcode": 32754
    },
    "t54kyg": {
        "geom": "{\"type\":\"Polygon\",\"coordinates\":[[[142.871208010295,-16.2725600024396],[143.807444697891,-16.262211008665],[143.820706011485,-17.1661781123765],[142.880054819009,-17.1771360900903],[142.871208010295,-16.2725600024396]]]}",
        "epsgcode": 32754
    },
    "t54kyu": {
        "geom": "{\"type\":\"Polygon\",\"coordinates\":[[[142.958172891729,-23.4977045220578],[143.937797155715,-23.4823075376615],[143.958325349831,-24.3854255254677],[142.971869329496,-24.4014887729044],[142.958172891729,-23.4977045220578]]]}",
        "epsgcode": 32754
    },
    "t54kyv": {
        "geom": "{\"type\":\"Polygon\",\"coordinates\":[[[142.945156207186,-22.5947111611929],[143.918287385692,-22.5799710419095],[143.937817155674,-23.4832096340971],[142.958186235591,-23.4986072795115],[142.945156207186,-22.5947111611929]]]}",
        "epsgcode": 32754
    },
    "t54kza": {
        "geom": "{\"type\":\"Polygon\",\"coordinates\":[[[143.89879134852,-21.6780763372674],[144.484206213016,-21.6666276400096],[144.487271564184,-22.570063563082],[143.917346269759,-22.5814322442841],[143.89879134852,-21.6780763372674]]]}",
        "epsgcode": 32754
    },
    "t54kzb": {
        "geom": "{\"type\":\"Polygon\",\"coordinates\":[[[143.881196155818,-20.7755102249545],[144.481485109828,-20.7642013524488],[144.484232238967,-21.6677098177263],[143.898809406536,-21.678978667329],[143.881196155818,-20.7755102249545]]]}",
        "epsgcode": 32754
    },
    "t54kzc": {
        "geom": "{\"type\":\"Polygon\",\"coordinates\":[[[143.864516174839,-19.872835815398],[144.47850652336,-19.8617164912456],[144.48093457715,-20.7652953203538],[143.881213286326,-20.7764126653659],[143.864516174839,-19.872835815398]]]}",
        "epsgcode": 32754
    },
    "t54kzd": {
        "geom": "{\"type\":\"Polygon\",\"coordinates\":[[[143.848736768755,-18.9705988853425],[144.475857832925,-18.9597049048935],[144.478541966433,-19.863340107607],[143.864542139519,-19.874279889918],[143.848736768755,-18.9705988853425]]]}",
        "epsgcode": 32754
    },
    "t54kze": {
        "geom": "{\"type\":\"Polygon\",\"coordinates\":[[[143.833816731059,-18.0677205655546],[144.47351360339,-18.0570869628769],[144.475880287306,-18.9607874260144],[143.848752117124,-18.9715015338654],[143.833816731059,-18.0677205655546]]]}",
        "epsgcode": 32754
    },
    "t54kzf": {
        "geom": "{\"type\":\"Polygon\",\"coordinates\":[[[143.819745012921,-17.1647466960621],[144.470920430959,-17.1544164765164],[144.472968987661,-18.058179774173],[143.833831221119,-18.068623311776],[143.819745012921,-17.1647466960621]]]}",
        "epsgcode": 32754
    },
    "t54kzg": {
        "geom": "{\"type\":\"Polygon\",\"coordinates\":[[[143.806509943816,-16.2622234061462],[144.468654370726,-16.2522271716267],[144.470950654253,-17.1560405689959],[143.81976685622,-17.1661912393438],[143.806509943816,-16.2622234061462]]]}",
        "epsgcode": 32754
    },
    "t54kzu": {
        "geom": "{\"type\":\"Polygon\",\"coordinates\":[[[143.93681914889,-23.4823259817636],[144.490587921407,-23.4707194165819],[144.493707209278,-24.3740163043477],[143.957340533282,-24.385444767592],[143.93681914889,-23.4823259817636]]]}",
        "epsgcode": 32754
    },
    "t54kzv": {
        "geom": "{\"type\":\"Polygon\",\"coordinates\":[[[143.917315851208,-22.5799886992343],[144.487230688556,-22.5684404805682],[144.490616416618,-23.4718013447292],[143.936839142214,-23.4832280789909],[143.917315851208,-22.5799886992343]]]}",
        "epsgcode": 32754
    },
    "t54luh": {
        "geom": "{\"type\":\"Polygon\",\"coordinates\":[[[139.136715903477,-15.3688028251432],[140.069343413669,-15.3746526035421],[140.065192270218,-16.2796723577962],[139.12840925218,-16.2734602266352],[139.136715903477,-15.3688028251432]]]}",
        "epsgcode": 32754
    },
    "t54lwh": {
        "geom": "{\"type\":\"Polygon\",\"coordinates\":[[[140.999813636238,-15.3765971315857],[141.932706296062,-15.3746440288254],[141.936866578885,-16.2796632519201],[140.999812804825,-16.2817373404879],[140.999813636238,-15.3765971315857]]]}",
        "epsgcode": 32754
    },
    "t54lwj": {
        "geom": "{\"type\":\"Polygon\",\"coordinates\":[[[140.99981441372,-14.4722876311694],[141.928815866294,-14.4704543933094],[141.932710317701,-15.3755480011337],[140.999813635434,-15.3775012242234],[140.99981441372,-14.4722876311694]]]}",
        "epsgcode": 32754
    },
    "t54lwk": {
        "geom": "{\"type\":\"Polygon\",\"coordinates\":[[[140.999815138748,-13.5684512783988],[141.925187900994,-13.5667369044338],[141.928821880488,-14.4719008646715],[140.999814412518,-14.4737342935161],[140.999815138748,-13.5684512783988]]]}",
        "epsgcode": 32754
    },
    "t54lwl": {
        "geom": "{\"type\":\"Polygon\",\"coordinates\":[[[140.999815813153,-12.6640070220113],[141.921813242141,-12.6624107211218],[141.925191402092,-13.5676410173091],[140.999815138049,-13.569355509744],[140.999815813153,-12.6640070220113]]]}",
        "epsgcode": 32754
    },
    "t54lwm": {
        "geom": "{\"type\":\"Polygon\",\"coordinates\":[[[140.99981643737,-11.7595014153925],[141.918689717941,-11.7580223907452],[141.921816490002,-12.6633148982041],[140.999815812504,-12.6649113167344],[140.99981643737,-11.7595014153925]]]}",
        "epsgcode": 32754
    },
    "t54lwn": {
        "geom": "{\"type\":\"Polygon\",\"coordinates\":[[[140.999817011879,-10.8554812215646],[141.915814917176,-10.8541186704689],[141.918694516243,-11.7594691701391],[140.999816436411,-11.7609483817887],[140.999817011879,-10.8554812215646]]]}",
        "epsgcode": 32754
    },
    "t54lwp": {
        "geom": "{\"type\":\"Polygon\",\"coordinates\":[[[140.999817538114,-9.9508653559723],[141.913181677373,-9.94961867777663],[141.915817671077,-10.855022963422],[140.999817011329,-10.8563856306928],[140.999817538114,-9.9508653559723]]]}",
        "epsgcode": 32754
    },
    "t54lwq": {
        "geom": "{\"type\":\"Polygon\",\"coordinates\":[[[140.999818016388,-9.04620066101309],[141.910788422923,-9.04506924573329],[141.913184189702,-9.95052302231468],[140.999817537612,-9.95176981604544],[140.999818016388,-9.04620066101309]]]}",
        "epsgcode": 32754
    },
    "t54lxh": {
        "geom": "{\"type\":\"Polygon\",\"coordinates\":[[[141.931774609979,-15.3746479287617],[142.8644016425,-15.3687934731823],[142.872713268815,-16.2734502954031],[141.935930738546,-16.2796673934373],[141.931774609979,-15.3746479287617]]]}",
        "epsgcode": 32754
    },
    "t54lxj": {
        "geom": "{\"type\":\"Polygon\",\"coordinates\":[[[141.927888065024,-14.4704580539026],[142.856629089203,-14.4649628833891],[142.864409677166,-15.3696970850549],[141.931778627603,-15.3755519013103],[141.927888065024,-14.4704580539026]]]}",
        "epsgcode": 32754
    },
    "t54lxk": {
        "geom": "{\"type\":\"Polygon\",\"coordinates\":[[[141.924263722465,-13.5667403276824],[142.849380858283,-13.5616014440295],[142.856641104789,-14.4664087826702],[141.927894073212,-14.4719045256461],[141.924263722465,-13.5667403276824]]]}",
        "epsgcode": 32754
    },
    "t54lxl": {
        "geom": "{\"type\":\"Polygon\",\"coordinates\":[[[141.920892433426,-12.6624139086045],[142.842638662808,-12.6576289434308],[142.849387853071,-13.5625052020343],[141.924267220068,-13.5676444407942],[141.920892433426,-12.6624139086045]]]}",
        "epsgcode": 32754
    },
    "t54lxm": {
        "geom": "{\"type\":\"Polygon\",\"coordinates\":[[[141.917772028277,-11.7580253440527],[142.83639817251,-11.753591910768],[142.842645151693,-12.6585327681245],[141.920895678043,-12.6633180859217],[141.917772028277,-11.7580253440527]]]}",
        "epsgcode": 32754
    },
    "t54lxn": {
        "geom": "{\"type\":\"Polygon\",\"coordinates\":[[[141.914900098204,-10.8541213912038],[142.830654577987,-10.8500370854843],[142.836407759065,-11.7550381300002],[141.917776821787,-11.75947212382],[141.914900098204,-10.8541213912038]]]}",
        "epsgcode": 32754
    },
    "t54lxp": {
        "geom": "{\"type\":\"Polygon\",\"coordinates\":[[[141.912269487886,-9.949621167138],[142.825393576421,-9.94588419010259],[142.830660080046,-10.8509410304355],[141.914902849355,-10.8550256843889],[141.912269487886,-9.949621167138]]]}",
        "epsgcode": 32754
    },
    "t54lxq": {
        "geom": "{\"type\":\"Polygon\",\"coordinates\":[[[141.909878623285,-9.04507150493892],[142.820612026286,-9.04168002957489],[142.825398595865,-9.94678818855452],[141.912271997707,-9.95052551190675],[141.909878623285,-9.04507150493892]]]}",
        "epsgcode": 32754
    },
    "t54lyh": {
        "geom": "{\"type\":\"Polygon\",\"coordinates\":[[[142.862911581027,-15.3688059412191],[143.795008247828,-15.3590599876433],[143.807457534887,-16.2631139364223],[142.871216573981,-16.2734635357244],[142.862911581027,-15.3688059412191]]]}",
        "epsgcode": 32754
    },
    "t54lyj": {
        "geom": "{\"type\":\"Polygon\",\"coordinates\":[[[142.85514523098,-14.4649745862875],[143.783366260355,-14.4558266978334],[143.795020282351,-15.3599629999076],[142.862919609281,-15.3697095538598],[142.85514523098,-14.4649745862875]]]}",
        "epsgcode": 32754
    },
    "t54lyk": {
        "geom": "{\"type\":\"Polygon\",\"coordinates\":[[[142.847902784948,-13.5616123881709],[143.772509505269,-13.5530575814253],[143.783384257797,-14.457271645408],[142.855157236977,-14.4664204867877],[142.847902784948,-13.5616123881709]]]}",
        "epsgcode": 32754
    },
    "t54lyl": {
        "geom": "{\"type\":\"Polygon\",\"coordinates\":[[[142.841165970574,-12.6576391338557],[143.762410615581,-12.6496734731746],[143.772519982458,-13.553960749065],[142.847909774153,-13.5625161469319],[142.841165970574,-12.6576391338557]]]}",
        "epsgcode": 32754
    },
    "t54lym": {
        "geom": "{\"type\":\"Polygon\",\"coordinates\":[[[142.834930461027,-11.753601352556],[143.753063126905,-11.7462208713783],[143.762420335092,-12.6505767116255],[142.84117245428,-12.6585429593003],[142.834930461027,-11.753601352556]]]}",
        "epsgcode": 32754
    },
    "t54lyn": {
        "geom": "{\"type\":\"Polygon\",\"coordinates\":[[[142.829191450726,-10.850045783753],[143.744459855195,-10.8432464854115],[143.75307748645,-11.7476661587017],[142.83494003993,-11.7550475729819],[142.829191450726,-10.850045783753]]]}",
        "epsgcode": 32754
    },
    "t54lyp": {
        "geom": "{\"type\":\"Polygon\",\"coordinates\":[[[142.823934648255,-9.9458921486804],[143.736579394248,-9.93967104381903],[143.744468096707,-10.8441498514064],[142.829196948394,-10.8509497294457],[142.823934648255,-9.9458921486804]]]}",
        "epsgcode": 32754
    },
    "t54lyq": {
        "geom": "{\"type\":\"Polygon\",\"coordinates\":[[[142.819156914581,-9.04168725235054],[143.729417054328,-9.03604130426072],[143.736586912907,-9.94057446649702],[142.823939663693,-9.94679614786987],[142.819156914581,-9.04168725235054]]]}",
        "epsgcode": 32754
    },
    "t54lyr": {
        "geom": "{\"type\":\"Polygon\",\"coordinates\":[[[142.814854613729,-8.13797806730895],[143.722967399081,-8.13290419271881],[143.729427943285,-9.03748686354509],[142.819164178179,-9.04313372943504],[142.814854613729,-8.13797806730895]]]}",
        "epsgcode": 32754
    },
    "t54lzh": {
        "geom": "{\"type\":\"Polygon\",\"coordinates\":[[[143.794077621369,-15.3590716627516],[144.466693801159,-15.3494393403821],[144.468673387018,-16.2533099966918],[143.806522776552,-16.2631263346288],[143.794077621369,-15.3590716627516]]]}",
        "epsgcode": 32754
    },
    "t54lzj": {
        "geom": "{\"type\":\"Polygon\",\"coordinates\":[[[143.782439497981,-14.4558376565226],[144.465047027465,-14.4465974904537],[144.466711697687,-15.3505222573252],[143.794089651897,-15.3599746757351],[143.782439497981,-14.4558376565226]]]}",
        "epsgcode": 32754
    },
    "t54lzk": {
        "geom": "{\"type\":\"Polygon\",\"coordinates\":[[[143.7715863465,-13.5530678296593],[144.463166888781,-13.5442540527829],[144.464516536079,-14.4482301765375],[143.782457489449,-14.4572826052387],[143.7715863465,-13.5530678296593]]]}",
        "epsgcode": 32754
    },
    "t54lzl": {
        "geom": "{\"type\":\"Polygon\",\"coordinates\":[[[143.761490808975,-12.649683015663],[144.461041949706,-12.6413277395177],[144.46262906797,-13.5453448144674],[143.771596820211,-13.5539709980071],[143.761490808975,-12.649683015663]]]}",
        "epsgcode": 32754
    },
    "t54lzn": {
        "geom": "{\"type\":\"Polygon\",\"coordinates\":[[[143.743546007351,-10.8432546306856],[144.458296784231,-10.8358753378968],[144.459804319741,-11.7399733976314],[143.752160777935,-11.747675001309],[143.743546007351,-10.8432546306856]]]}",
        "epsgcode": 32754
    },
    "t54lzp": {
        "geom": "{\"type\":\"Polygon\",\"coordinates\":[[[143.73566816243,-9.93967849645495],[144.457117370013,-9.93282112585839],[144.458309235085,-10.8369586414601],[143.743554246128,-10.8441579973749],[143.73566816243,-9.93967849645495]]]}",
        "epsgcode": 32754
    },
    "t54lzq": {
        "geom": "{\"type\":\"Polygon\",\"coordinates\":[[[143.728508200216,-9.03604806789264],[144.455706550368,-9.02973615405337],[144.457128757553,-9.93390449144568],[143.735675678593,-9.94058191982357],[143.728508200216,-9.03604806789264]]]}",
        "epsgcode": 32754
    },
    "t55jbh": {
        "geom": "{\"type\":\"Polygon\",\"coordinates\":[[[143.999270719665,-28.8941194374105],[144.949603883137,-28.9121282872679],[144.931425574383,-29.8151731495382],[143.999347049075,-29.7972865578679],[143.999270719665,-28.8941194374105]]]}",
        "epsgcode": 32755
    },
    "t55jbj": {
        "geom": "{\"type\":\"Polygon\",\"coordinates\":[[[143.999039292537,-27.99194354083],[144.966950326888,-28.0098544265783],[144.949586138152,-28.913030315696],[143.999239586655,-28.8952010796242],[143.999039292537,-27.99194354083]]]}",
        "epsgcode": 32755
    },
    "t55jbk": {
        "geom": "{\"type\":\"Polygon\",\"coordinates\":[[[143.999271642504,-27.0902331391883],[144.983502592757,-27.1079940032745],[144.966923212011,-28.0112978790498],[143.99899431028,-27.993566218629],[143.999271642504,-27.0902331391883]]]}",
        "epsgcode": 32755
    },
    "t55jbl": {
        "geom": "{\"type\":\"Polygon\",\"coordinates\":[[[143.999380042085,-26.1878946656157],[144.99930753335,-26.2054674045965],[144.98348641628,-27.1088962874303],[143.999242785109,-27.0913150648522],[143.999380042085,-26.1878946656157]]]}",
        "epsgcode": 32755
    },
    "t55jbm": {
        "geom": "{\"type\":\"Polygon\",\"coordinates\":[[[144.495832288096,-25.2947415700726],[145.014380271122,-25.3028190720639],[144.99929210131,-26.2063698120519],[144.49900795117,-26.1985372753783],[144.495832288096,-25.2947415700726]]]}",
        "epsgcode": 32755
    },
    "t55jbn": {
        "geom": "{\"type\":\"Polygon\",\"coordinates\":[[[144.492055949144,-24.3924737737094],[145.028736090647,-24.4005938308224],[145.014356731464,-25.3042631161075],[144.49520344935,-25.2963554251022],[144.492055949144,-24.3924737737094]]]}",
        "epsgcode": 32755
    },
    "t55jch": {
        "geom": "{\"type\":\"Polygon\",\"coordinates\":[[[144.948578714585,-28.9121126702212],[145.975316785526,-28.9238420013412],[145.966226295916,-29.8273248276068],[144.930391332682,-29.8151569486542],[144.948578714585,-28.9121126702212]]]}",
        "epsgcode": 32755
    },
    "t55jcj": {
        "geom": "{\"type\":\"Polygon\",\"coordinates\":[[[144.965933816661,-28.0098393830179],[145.983991137058,-28.0211379467065],[145.975307911806,-28.9247444634774],[144.948560960743,-28.9130146980711],[144.965933816661,-28.0098393830179]]]}",
        "epsgcode": 32755
    },
    "t55jck": {
        "geom": "{\"type\":\"Polygon\",\"coordinates\":[[[144.982494344805,-27.1079795236252],[145.992268217503,-27.1188545172492],[145.983977577962,-28.0225820817099],[144.965906688249,-28.0112828345796],[144.982494344805,-27.1079795236252]]]}",
        "epsgcode": 32755
    },
    "t55jcl": {
        "geom": "{\"type\":\"Polygon\",\"coordinates\":[[[144.99830717495,-26.2054534804564],[146.000171474624,-26.2159112195483],[145.992260128401,-27.1197572212443],[144.982478160253,-27.1088818072214],[144.99830717495,-26.2054534804564]]]}",
        "epsgcode": 32755
    },
    "t55jcm": {
        "geom": "{\"type\":\"Polygon\",\"coordinates\":[[[145.013387437056,-25.3028056951622],[146.007708487422,-25.3128523964533],[146.000163757892,-26.2168140404612],[144.998291735206,-26.2063558873606],[145.013387437056,-25.3028056951622]]]}",
        "epsgcode": 32755
    },
    "t55jcn": {
        "geom": "{\"type\":\"Polygon\",\"coordinates\":[[[145.027750423283,-24.4005809930164],[146.014886914562,-24.4102227765982],[146.007696716668,-25.3142970923744],[145.013363885646,-25.3042497383368],[145.027750423283,-24.4005809930164]]]}",
        "epsgcode": 32755
    },
    "t55jdh": {
        "geom": "{\"type\":\"Polygon\",\"coordinates\":[[[145.973675539779,-28.9238295005193],[147.000820785613,-28.9277411669667],[147.000828068797,-29.8313698018336],[145.964570496145,-29.8273118593371],[145.973675539779,-28.9238295005193]]]}",
        "epsgcode": 32755
    },
    "t55jdj": {
        "geom": "{\"type\":\"Polygon\",\"coordinates\":[[[145.982363779245,-28.0211259050334],[147.000813835873,-28.024893892935],[147.000820792723,-28.9286437734933],[145.973666651852,-28.9247319621925],[145.982363779245,-28.0211259050334]]]}",
        "epsgcode": 32755
    },
    "t55jdk": {
        "geom": "{\"type\":\"Polygon\",\"coordinates\":[[[145.99065411172,-27.1188429270482],[147.000807204455,-27.122469639231],[147.000813846737,-28.0263382551639],[145.982350198441,-28.0225700393084],[145.99065411172,-27.1188429270482]]]}",
        "epsgcode": 32755
    },
    "t55jdl": {
        "geom": "{\"type\":\"Polygon\",\"coordinates\":[[[145.998570022486,-26.2159000740829],[147.000800872567,-26.2193876190625],[147.000807210936,-27.1233724829951],[145.990646009666,-27.1197456305953],[145.998570022486,-26.2159000740829]]]}",
        "epsgcode": 32755
    },
    "t55jdm": {
        "geom": "{\"type\":\"Polygon\",\"coordinates\":[[[146.006119102661,-25.3128416890927],[147.000794834133,-25.31619214226],[147.000800878749,-26.2202905776178],[145.998562293398,-26.2168028945545],[146.006119102661,-25.3128416890927]]]}",
        "epsgcode": 32755
    },
    "t55jdn": {
        "geom": "{\"type\":\"Polygon\",\"coordinates\":[[[146.013309023155,-24.410212500815],[147.000789083013,-24.4134279051674],[147.000794843563,-25.3176370551918],[146.006107313061,-25.314286384318],[146.013309023155,-24.410212500815]]]}",
        "epsgcode": 32755
    },
    "t55jeh": {
        "geom": "{\"type\":\"Polygon\",\"coordinates\":[[[146.999794803597,-28.9277411693121],[148.026939927107,-28.9238248075549],[148.03605042849,-29.827306990887],[146.999792982801,-29.8313698042667],[146.999794803597,-28.9277411693121]]]}",
        "epsgcode": 32755
    },
    "t55jej": {
        "geom": "{\"type\":\"Polygon\",\"coordinates\":[[[146.999796541032,-28.0248938951942],[148.018246479675,-28.0211213844392],[148.026948820362,-28.9247272690543],[146.999794801819,-28.9286437758388],[146.999796541032,-28.0248938951942]]]}",
        "epsgcode": 32755
    },
    "t55jek": {
        "geom": "{\"type\":\"Polygon\",\"coordinates\":[[[146.999798198886,-27.1224696414056],[148.009951177698,-27.1188385759422],[148.01826006862,-28.0225655184407],[146.999796538316,-28.0263382574233],[146.999798198886,-27.1224696414056]]]}",
        "epsgcode": 32755
    },
    "t55jel": {
        "geom": "{\"type\":\"Polygon\",\"coordinates\":[[[146.999799781858,-26.2193876211536],[148.002030521824,-26.2158958899361],[148.009959284609,-27.1197412793211],[146.999798197266,-27.1233724851697],[146.999799781858,-26.2193876211536]]]}",
        "epsgcode": 32755
    },
    "t55jem": {
        "geom": "{\"type\":\"Polygon\",\"coordinates\":[[[146.999801291467,-25.3161921442689],[147.99447691639,-25.3128376694159],[148.002038255545,-26.2167987102422],[146.999799780313,-26.220290579709],[146.999801291467,-25.3161921442689]]]}",
        "epsgcode": 32755
    },
    "t55jen": {
        "geom": "{\"type\":\"Polygon\",\"coordinates\":[[[146.999802729247,-24.4134279070953],[147.987282685895,-24.4102086431577],[147.994488713057,-25.3142823643801],[146.999801289109,-25.3176370572008],[146.999802729247,-24.4134279070953]]]}",
        "epsgcode": 32755
    },
    "t55jfh": {
        "geom": "{\"type\":\"Polygon\",\"coordinates\":[[[148.025914148882,-28.9238326275997],[149.052651486615,-28.9120939194751],[149.070849756257,-29.8151374969189],[148.035015554013,-29.8273151033495],[148.025914148882,-28.9238326275997]]]}",
        "epsgcode": 32755
    },
    "t55jfj": {
        "geom": "{\"type\":\"Polygon\",\"coordinates\":[[[148.017229381396,-28.0211289172578],[149.035285994576,-28.0098213208332],[149.052669251086,-28.9129959466309],[148.025923033257,-28.9247350893888],[148.017229381396,-28.0211289172578]]]}",
        "epsgcode": 32755
    },
    "t55jfk": {
        "geom": "{\"type\":\"Polygon\",\"coordinates\":[[[148.008942361925,-27.1188458263369],[149.018715551738,-27.1079621385052],[149.035313139229,-28.0112647713024],[148.017242956773,-28.022573051715],[148.008942361925,-27.1188458263369]]]}",
        "epsgcode": 32755
    },
    "t55jfl": {
        "geom": "{\"type\":\"Polygon\",\"coordinates\":[[[148.001029614567,-26.2159028621209],[149.002893254163,-26.2054367623134],[149.018731745979,-27.1088644214294],[148.008950460741,-27.119748529996],[148.001029614567,-26.2159028621209]]]}",
        "epsgcode": 32755
    },
    "t55jfm": {
        "geom": "{\"type\":\"Polygon\",\"coordinates\":[[[147.993483551233,-25.3128443675388],[148.987803962889,-25.3027896340656],[149.002908703151,-26.2063391685558],[148.001037340566,-26.216805682703],[147.993483551233,-25.3128443675388]]]}",
        "epsgcode": 32755
    },
    "t55jfn": {
        "geom": "{\"type\":\"Polygon\",\"coordinates\":[[[147.986296504076,-24.4102150713021],[148.973432376647,-24.4005655791897],[148.987827528399,-25.3042336761968],[147.993495336122,-25.3142890629382],[147.986296504076,-24.4102150713021]]]}",
        "epsgcode": 32755
    },
    "t55jgh": {
        "geom": "{\"type\":\"Polygon\",\"coordinates\":[[[149.051011218097,-28.9121189179752],[150.001548671478,-28.8941011699582],[150.001479599245,-29.7972677739546],[149.069194970745,-29.8151634299781],[149.051011218097,-28.9121189179752]]]}",
        "epsgcode": 32755
    },
    "t55jgj": {
        "geom": "{\"type\":\"Polygon\",\"coordinates\":[[[149.033659579342,-28.0098454013432],[150.00177317508,-27.991925793099],[150.001579812958,-28.8951828113605],[149.051028968397,-28.9130209460564],[149.033659579342,-28.0098454013432]]]}",
        "epsgcode": 32755
    },
    "t55jgk": {
        "geom": "{\"type\":\"Polygon\",\"coordinates\":[[[149.017102356105,-27.1079853163522],[150.001534219239,-27.0902159182315],[150.001818169471,-27.9935484696908],[149.03368670234,-28.0112888532688],[149.017102356105,-27.1079853163522]]]}",
        "epsgcode": 32755
    },
    "t55jgl": {
        "geom": "{\"type\":\"Polygon\",\"coordinates\":[[[149.001292681778,-26.2054590509465],[150.001419512163,-26.1878779754827],[150.001563084355,-27.0912978430969],[149.017118537427,-27.1088876001723],[149.001292681778,-26.2054590509465]]]}",
        "epsgcode": 32755
    },
    "t55jgm": {
        "geom": "{\"type\":\"Polygon\",\"coordinates\":[[[148.986215429403,-25.3028110467242],[149.979826803443,-25.2860740452855],[150.002446716061,-26.1889391677024],[149.00130811844,-26.2063614580712],[148.986215429403,-25.3028110467242]]]}",
        "epsgcode": 32755
    },
    "t55jgn": {
        "geom": "{\"type\":\"Polygon\",\"coordinates\":[[[148.971855309853,-24.4005861289078],[149.958304337434,-24.3845235514671],[149.979862094078,-25.2875170016184],[148.986238976112,-25.3042550902465],[148.971855309853,-24.4005861289078]]]}",
        "epsgcode": 32755
    },
    "t55jhm": {
        "geom": "{\"type\":\"Polygon\",\"coordinates\":[[[149.978834854868,-25.2860940943916],[150.497663905434,-25.274515762286],[150.502691119372,-26.1998085056414],[150.001447265069,-26.1889600375925],[149.978834854868,-25.2860940943916]]]}",
        "epsgcode": 32755
    },
    "t55jhn": {
        "geom": "{\"type\":\"Polygon\",\"coordinates\":[[[149.957319527855,-24.3845427927889],[150.494267971029,-24.3729208773857],[150.497115660027,-25.2761523706582],[149.978870133797,-25.2875370520267],[149.957319527855,-24.3845427927889]]]}",
        "epsgcode": 32755
    },
    "t55kba": {
        "geom": "{\"type\":\"Polygon\",\"coordinates\":[[[144.468989473036,-17.168394311027],[145.120523661632,-17.1756958239609],[145.111126127351,-18.0801866869654],[144.471066808867,-18.0728598628043],[144.468989473036,-17.168394311027]]]}",
        "epsgcode": 32755
    },
    "t55kbb": {
        "geom": "{\"type\":\"Polygon\",\"coordinates\":[[[144.466848105184,-16.2654911790965],[145.129353248059,-16.2725649645442],[145.120509089096,-17.1771413442049],[144.468403770513,-17.1700127351309],[144.466848105184,-16.2654911790965]]]}",
        "epsgcode": 32755
    },
    "t55kbp": {
        "geom": "{\"type\":\"Polygon\",\"coordinates\":[[[144.488315853051,-23.4895814679073],[145.042414411541,-23.4977119047872],[145.028722075203,-24.4014964751402],[144.491443412159,-24.3935467547525],[144.488315853051,-23.4895814679073]]]}",
        "epsgcode": 32755
    },
    "t55kbq": {
        "geom": "{\"type\":\"Polygon\",\"coordinates\":[[[144.485176401732,-22.5866175875111],[145.055427198085,-22.5947182289272],[145.042401071675,-23.4986146625578],[144.488295324566,-23.4906643676578],[144.485176401732,-22.5866175875111]]]}",
        "epsgcode": 32755
    },
    "t55kbr": {
        "geom": "{\"type\":\"Polygon\",\"coordinates\":[[[144.482030365177,-21.6841164671634],[145.067786691017,-21.6921580939928],[145.055406902733,-22.5961628172938],[144.484563738392,-22.5882329817698],[144.482030365177,-21.6841164671634]]]}",
        "epsgcode": 32755
    },
    "t55kbs": {
        "geom": "{\"type\":\"Polygon\",\"coordinates\":[[[144.478890629937,-20.7809976789978],[145.0795259429,-20.7889515848592],[145.067774642873,-21.6930610681338],[144.482011534535,-21.6851996046608],[144.478890629937,-20.7809976789978]]]}",
        "epsgcode": 32755
    },
    "t55kbt": {
        "geom": "{\"type\":\"Polygon\",\"coordinates\":[[[144.47631386873,-19.8778135954924],[145.090654392941,-19.885644098493],[145.079514513777,-20.7898546618107],[144.478872635418,-20.7820809295899],[144.47631386873,-19.8778135954924]]]}",
        "epsgcode": 32755
    },
    "t55kbu": {
        "geom": "{\"type\":\"Polygon\",\"coordinates\":[[[144.47370720198,-18.9750999707086],[145.101181837,-18.9827813559419],[145.090637070121,-19.8870891801186],[144.476288124512,-19.8794386356202],[144.47370720198,-18.9750999707086]]]}",
        "epsgcode": 32755
    },
    "t55kbv": {
        "geom": "{\"type\":\"Polygon\",\"coordinates\":[[[144.471082331184,-18.0717762962991],[145.111135794378,-18.0792833242579],[145.101171597206,-18.983684627227],[144.473690862967,-18.9761834361246],[144.471082331184,-18.0717762962991]]]}",
        "epsgcode": 32755
    },
    "t55kca": {
        "geom": "{\"type\":\"Polygon\",\"coordinates\":[[[145.119583822176,-17.1756870670102],[146.060781841354,-17.1822638102192],[146.056083126693,-18.087123174578],[145.110181595421,-18.0801774387182],[145.119583822176,-17.1756870670102]]]}",
        "epsgcode": 32755
    },
    "t55kcb": {
        "geom": "{\"type\":\"Polygon\",\"coordinates\":[[[145.128417817576,-16.272556693544],[146.065196550681,-16.2787684612201],[146.060774555197,-17.1837099165612],[145.119569242364,-17.1771325864728],[145.128417817576,-16.272556693544]]]}",
        "epsgcode": 32755
    },
    "t55kcp": {
        "geom": "{\"type\":\"Polygon\",\"coordinates\":[[[145.04143557289,-23.4976995990096],[146.021726481547,-23.5069417768994],[146.01487990638,-24.4111258226345],[145.027736400842,-24.4014836367987],[145.04143557289,-23.4976995990096]]]}",
        "epsgcode": 32755
    },
    "t55kcq": {
        "geom": "{\"type\":\"Polygon\",\"coordinates\":[[[145.054454856095,-22.5947064481938],[146.028233183844,-22.6035542697469],[146.021719811259,-23.5078449309959],[145.041422226365,-23.4986023562519],[145.054454856095,-22.5947064481938]]]}",
        "epsgcode": 32755
    },
    "t55kcr": {
        "geom": "{\"type\":\"Polygon\",\"coordinates\":[[[145.066820519716,-21.692146831401],[146.034413154104,-21.7006054843366],[146.028223035744,-22.6049994840891],[145.054434550611,-22.5961510357259],[145.066820519716,-21.692146831401]]]}",
        "epsgcode": 32755
    },
    "t55kcs": {
        "geom": "{\"type\":\"Polygon\",\"coordinates\":[[[145.078565632789,-20.7889408345022],[146.040282930117,-20.7970147583371],[146.034407129847,-21.7015088449079],[145.066808465556,-21.6930498050268],[145.078565632789,-20.7889408345022]]]}",
        "epsgcode": 32755
    },
    "t55kct": {
        "geom": "{\"type\":\"Polygon\",\"coordinates\":[[[145.089699639206,-19.8856338545095],[146.045847241528,-19.8933274543892],[146.040277215439,-20.7979182171878],[145.078554197959,-20.7898439109445],[145.089699639206,-19.8856338545095]]]}",
        "epsgcode": 32755
    },
    "t55kcu": {
        "geom": "{\"type\":\"Polygon\",\"coordinates\":[[[145.100232339695,-18.9827716125156],[146.051110995518,-18.9900892595107],[146.045838580025,-19.8947731402271],[145.089682307737,-19.8870789353295],[145.100232339695,-18.9827716125156]]]}",
        "epsgcode": 32755
    },
    "t55kcv": {
        "geom": "{\"type\":\"Polygon\",\"coordinates\":[[[145.110191267275,-18.0792740765038],[146.056087960172,-18.086219442023],[146.051105875614,-18.9909929044148],[145.100222094788,-18.9836748833026],[145.110191267275,-18.0792740765038]]]}",
        "epsgcode": 32755
    },
    "t55kda": {
        "geom": "{\"type\":\"Polygon\",\"coordinates\":[[[146.059277434471,-17.1822568011581],[147.000752314083,-17.1844499981564],[147.000756078435,-18.089432026173],[146.054571196296,-18.0871157722541],[146.059277434471,-17.1822568011581]]]}",
        "epsgcode": 32755
    },
    "t55kdb": {
        "geom": "{\"type\":\"Polygon\",\"coordinates\":[[[146.063699212603,-16.2787618411382],[147.00074877727,-16.2808333218384],[147.00075231992,-17.1858962995931],[146.059270136647,-17.1837029068746],[146.063699212603,-16.2787618411382]]]}",
        "epsgcode": 32755
    },
    "t55kdp": {
        "geom": "{\"type\":\"Polygon\",\"coordinates\":[[[146.02015954104,-23.5069319270278],[147.000783603399,-23.5100140559047],[147.000789088627,-24.4143310849344],[146.013302003752,-24.4111155464225],[146.02015954104,-23.5069319270278]]]}",
        "epsgcode": 32755
    },
    "t55kdq": {
        "geom": "{\"type\":\"Polygon\",\"coordinates\":[[[146.026676661366,-22.6035448401883],[147.000778390486,-22.6064954458952],[147.000783608743,-23.5109173419352],[146.020152860071,-23.5078350807012],[146.026676661366,-22.6035448401883]]]}",
        "epsgcode": 32755
    },
    "t55kdr": {
        "geom": "{\"type\":\"Polygon\",\"coordinates\":[[[146.032866526592,-21.7005964695583],[147.000773439356,-21.7034172837164],[147.000778398616,-22.6079408686178],[146.026666497018,-22.6049900538624],[146.032866526592,-21.7005964695583]]]}",
        "epsgcode": 32755
    },
    "t55kds": {
        "geom": "{\"type\":\"Polygon\",\"coordinates\":[[[146.038745700974,-20.7970061536043],[147.000768736757,-20.7996986581842],[147.000773444182,-21.7043207729247],[146.032860492689,-21.7014998297172],[146.038745700974,-20.7970061536043]]]}",
        "epsgcode": 32755
    },
    "t55kdt": {
        "geom": "{\"type\":\"Polygon\",\"coordinates\":[[[146.044318921721,-19.8933192550038],[147.000764278897,-19.8958849204053],[147.000768741335,-20.8006022441622],[146.038739977146,-20.7979096120473],[146.044318921721,-19.8933192550038]]]}",
        "epsgcode": 32755
    },
    "t55kdu": {
        "geom": "{\"type\":\"Polygon\",\"coordinates\":[[[146.049591103861,-18.9900814608111],[147.000760061843,-18.9925217459673],[147.000764285837,-19.8973308073726],[146.04431024635,-19.8947649401968],[146.049591103861,-18.9900814608111]]]}",
        "epsgcode": 32755
    },
    "t55kdv": {
        "geom": "{\"type\":\"Polygon\",\"coordinates\":[[[146.054576037515,-18.0862120400939],[147.000756074562,-18.0885281705058],[147.000760065945,-18.9934255152402],[146.049585975759,-18.9909851053165],[146.054576037515,-18.0862120400939]]]}",
        "epsgcode": 32755
    },
    "t55kep": {
        "geom": "{\"type\":\"Polygon\",\"coordinates\":[[[146.99980409915,-23.5100140577527],[147.98042806143,-23.5069282292631],[147.987289709506,-24.4111116886043],[146.999802727843,-24.4143310868624],[146.99980409915,-23.5100140577527]]]}",
        "epsgcode": 32755
    },
    "t55keq": {
        "geom": "{\"type\":\"Polygon\",\"coordinates\":[[[146.999805402378,-22.6064954476644],[147.97390703435,-22.6035413002143],[147.980434746404,-23.5078313827778],[146.999804097814,-23.5109173437833],[146.999805402378,-22.6064954476644]]]}",
        "epsgcode": 32755
    },
    "t55ker": {
        "geom": "{\"type\":\"Polygon\",\"coordinates\":[[[146.999806640161,-21.7034172854077],[147.967713458518,-21.700593085298],[147.973917204791,-22.6049865136376],[146.999805400346,-22.607940870387],[146.999806640161,-21.7034172854077]]]}",
        "epsgcode": 32755
    },
    "t55kes": {
        "geom": "{\"type\":\"Polygon\",\"coordinates\":[[[146.999807815811,-20.7996986597986],[147.961830759752,-20.7970029232801],[147.967719496038,-21.7014964453021],[146.999806638954,-21.7043207746161],[146.999807815811,-20.7996986597986]]]}",
        "epsgcode": 32755
    },
    "t55ket": {
        "geom": "{\"type\":\"Polygon\",\"coordinates\":[[[146.999808930276,-19.8958849219437],[147.95625419801,-19.8933161768521],[147.961836487012,-20.7979063815702],[146.999807814666,-20.8006022457766],[146.999808930276,-19.8958849219437]]]}",
        "epsgcode": 32755
    },
    "t55keu": {
        "geom": "{\"type\":\"Polygon\",\"coordinates\":[[[146.999809984539,-18.9925217474305],[147.950978855319,-18.9900785330819],[147.956262878581,-19.894761861803],[146.999808928541,-19.8973308089111],[146.999809984539,-18.9925217474305]]]}",
        "epsgcode": 32755
    },
    "t55kfp": {
        "geom": "{\"type\":\"Polygon\",\"coordinates\":[[[147.979448723913,-23.5069343909731],[148.959739032612,-23.4976848239675],[148.973446407484,-24.401468222329],[147.986303520673,-24.4111181170168],[147.979448723913,-23.5069343909731]]]}",
        "epsgcode": 32755
    },
    "t55kfq": {
        "geom": "{\"type\":\"Polygon\",\"coordinates\":[[[147.972934208092,-22.6035471989923],[148.946711953439,-22.5946923035505],[148.95975238713,-23.4985875805754],[147.979455402211,-23.5078375447524],[147.972934208092,-22.6035471989923]]]}",
        "epsgcode": 32755
    },
    "t55kfr": {
        "geom": "{\"type\":\"Polygon\",\"coordinates\":[[[147.966746816605,-21.7005987246051],[148.934338885016,-21.6921333088689],[148.946732271083,-22.5961368900806],[147.972944368378,-22.6049924128335],[147.966746816605,-21.7005987246051]]]}",
        "epsgcode": 32755
    },
    "t55kfs": {
        "geom": "{\"type\":\"Polygon\",\"coordinates\":[[[147.960869991813,-20.7970083060781],[148.922586738539,-20.7889279269894],[148.934350946394,-21.6930362818762],[147.966752848097,-21.7015020848671],[147.960869991813,-20.7970083060781]]]}",
        "epsgcode": 32755
    },
    "t55kft": {
        "geom": "{\"type\":\"Polygon\",\"coordinates\":[[[147.955298998399,-19.89332130608],[148.911446064491,-19.8856215549785],[148.922598180216,-20.7898310028204],[147.960875713354,-20.7979117646232],[147.955298998399,-19.89332130608]]]}",
        "epsgcode": 32755
    },
    "t55kfu": {
        "geom": "{\"type\":\"Polygon\",\"coordinates\":[[[147.950028923294,-18.9900834116558],[148.900907056305,-18.9827599139831],[148.911463406339,-19.8870666348314],[147.955307670302,-19.8947669914343],[147.950028923294,-18.9900834116558]]]}",
        "epsgcode": 32755
    },
    "t55kgp": {
        "geom": "{\"type\":\"Polygon\",\"coordinates\":[[[148.958172891729,-23.4977045220578],[149.937797155715,-23.4823075376615],[149.958325349831,-24.3854255254677],[148.971869329496,-24.4014887729044],[148.958172891729,-23.4977045220578]]]}",
        "epsgcode": 32755
    },
    "t55kgq": {
        "geom": "{\"type\":\"Polygon\",\"coordinates\":[[[148.945156207186,-22.5947111611929],[149.918287385692,-22.5799710419095],[149.937817155674,-23.4832096340971],[148.958186235591,-23.4986072795115],[148.945156207186,-22.5947111611929]]]}",
        "epsgcode": 32755
    },
    "t55kgr": {
        "geom": "{\"type\":\"Polygon\",\"coordinates\":[[[148.932793011839,-21.6921513371124],[149.899756735057,-21.6780594563981],[149.918317814338,-22.5814145857086],[148.945176508618,-22.5961557490589],[148.932793011839,-21.6921513371124]]]}",
        "epsgcode": 32755
    },
    "t55kgs": {
        "geom": "{\"type\":\"Polygon\",\"coordinates\":[[[148.92105024324,-20.788945135289],[149.882155702465,-20.7754941117092],[149.899774799067,-21.6789617856876],[148.932805063592,-21.6930543109443],[148.92105024324,-20.788945135289]]]}",
        "epsgcode": 32755
    },
    "t55kgt": {
        "geom": "{\"type\":\"Polygon\",\"coordinates\":[[[148.909918459372,-19.8856379527166],[149.865470185015,-19.872820461012],[149.88217283866,-20.7763965513575],[148.921061675787,-20.7898482119351],[148.909918459372,-19.8856379527166]]]}",
        "epsgcode": 32755
    },
    "t55khp": {
        "geom": "{\"type\":\"Polygon\",\"coordinates\":[[[149.93681914889,-23.4823259817636],[150.490587921407,-23.4707194165819],[150.493707209278,-24.3740163043477],[149.957340533282,-24.385444767592],[149.93681914889,-23.4823259817636]]]}",
        "epsgcode": 32755
    },
    "t55khq": {
        "geom": "{\"type\":\"Polygon\",\"coordinates\":[[[149.917315851208,-22.5799886992343],[150.487230688556,-22.5684404805682],[150.490616416618,-23.4718013447292],[149.936839142214,-23.4832280789909],[149.917315851208,-22.5799886992343]]]}",
        "epsgcode": 32755
    },
    "t55khr": {
        "geom": "{\"type\":\"Polygon\",\"coordinates\":[[[149.89879134852,-21.6780763372674],[150.484206213016,-21.6666276400096],[150.487271564184,-22.570063563082],[149.917346269759,-22.5814322442841],[149.89879134852,-21.6780763372674]]]}",
        "epsgcode": 32755
    },
    "t55khs": {
        "geom": "{\"type\":\"Polygon\",\"coordinates\":[[[149.881196155818,-20.7755102249545],[150.481485109828,-20.7642013524488],[150.484232238967,-21.6677098177263],[149.898809406536,-21.678978667329],[149.881196155818,-20.7755102249545]]]}",
        "epsgcode": 32755
    },
    "t55lbc": {
        "geom": "{\"type\":\"Polygon\",\"coordinates\":[[[144.464668553099,-15.361986322021],[145.137647192375,-15.3688106141662],[145.129344686938,-16.2734684981194],[144.466273211367,-16.2665682195326],[144.464668553099,-15.361986322021]]]}",
        "epsgcode": 32755
    },
    "t55lbd": {
        "geom": "{\"type\":\"Polygon\",\"coordinates\":[[[144.462439636661,-14.4584247770995],[145.145411216197,-14.4649789724652],[145.137639166526,-15.3697142270949],[144.464655449777,-15.3630701664182],[144.462439636661,-14.4584247770995]]]}",
        "epsgcode": 32755
    },
    "t55lbe": {
        "geom": "{\"type\":\"Polygon\",\"coordinates\":[[[144.460705915452,-13.5553574556029],[145.152651492889,-13.5616164899709],[145.145399213796,-14.4664248734224],[144.462421172819,-14.4600506687655],[144.460705915452,-13.5553574556029]]]}",
        "epsgcode": 32755
    },
    "t55lcc": {
        "geom": "{\"type\":\"Polygon\",\"coordinates\":[[[145.136715903477,-15.3688028251432],[146.069343413669,-15.3746526035421],[146.065192270217,-16.2796723577962],[145.12840925218,-16.2734602266352],[145.136715903477,-15.3688028251432]]]}",
        "epsgcode": 32755
    },
    "t55lcd": {
        "geom": "{\"type\":\"Polygon\",\"coordinates\":[[[145.14448380434,-14.4649716614389],[146.073225296844,-14.470462441787],[146.069339400865,-15.3755565763787],[145.136707873621,-15.369706437592],[145.14448380434,-14.4649716614389]]]}",
        "epsgcode": 32755
    },
    "t56jkp": {
        "geom": "{\"type\":\"Polygon\",\"coordinates\":[[[149.999039292537,-27.99194354083],[150.966950326888,-28.0098544265783],[150.949586138152,-28.913030315696],[149.999239586655,-28.8952010796242],[149.999039292537,-27.99194354083]]]}",
        "epsgcode": 32756
    },
    "t56jkq": {
        "geom": "{\"type\":\"Polygon\",\"coordinates\":[[[149.999271642504,-27.0902331391883],[150.983502592757,-27.1079940032745],[150.966923212011,-28.0112978790498],[149.99899431028,-27.993566218629],[149.999271642504,-27.0902331391883]]]}",
        "epsgcode": 32756
    },
    "t56jkr": {
        "geom": "{\"type\":\"Polygon\",\"coordinates\":[[[149.999380042085,-26.1878946656157],[150.99930753335,-26.2054674045965],[150.98348641628,-27.1088962874303],[149.999242785109,-27.0913150648522],[149.999380042085,-26.1878946656157]]]}",
        "epsgcode": 32756
    },
    "t56jks": {
        "geom": "{\"type\":\"Polygon\",\"coordinates\":[[[150.495832288096,-25.2947415700726],[151.014380271122,-25.3028190720639],[150.99929210131,-26.2063698120519],[150.49900795117,-26.1985372753783],[150.495832288096,-25.2947415700726]]]}",
        "epsgcode": 32756
    },
    "t56jkt": {
        "geom": "{\"type\":\"Polygon\",\"coordinates\":[[[150.492055949144,-24.3924737737094],[151.028736090647,-24.4005938308224],[151.014356731464,-25.3042631161075],[150.49520344935,-25.2963554251022],[150.492055949144,-24.3924737737094]]]}",
        "epsgcode": 32756
    },
    "t56jln": {
        "geom": "{\"type\":\"Polygon\",\"coordinates\":[[[150.948578714585,-28.9121126702212],[151.975316785526,-28.9238420013412],[151.966226295916,-29.8273248276068],[150.930391332682,-29.8151569486542],[150.948578714585,-28.9121126702212]]]}",
        "epsgcode": 32756
    },
    "t56jlp": {
        "geom": "{\"type\":\"Polygon\",\"coordinates\":[[[150.965933816661,-28.0098393830179],[151.983991137058,-28.0211379467065],[151.975307911806,-28.9247444634774],[150.948560960743,-28.9130146980711],[150.965933816661,-28.0098393830179]]]}",
        "epsgcode": 32756
    },
    "t56jlq": {
        "geom": "{\"type\":\"Polygon\",\"coordinates\":[[[150.982494344805,-27.1079795236252],[151.992268217503,-27.1188545172492],[151.983977577963,-28.0225820817099],[150.965906688249,-28.0112828345796],[150.982494344805,-27.1079795236252]]]}",
        "epsgcode": 32756
    },
    "t56jlr": {
        "geom": "{\"type\":\"Polygon\",\"coordinates\":[[[150.99830717495,-26.2054534804564],[152.000171474624,-26.2159112195483],[151.992260128401,-27.1197572212443],[150.982478160253,-27.1088818072214],[150.99830717495,-26.2054534804564]]]}",
        "epsgcode": 32756
    },
    "t56jls": {
        "geom": "{\"type\":\"Polygon\",\"coordinates\":[[[151.013387437056,-25.3028056951622],[152.007708487422,-25.3128523964533],[152.000163757892,-26.2168140404612],[150.998291735206,-26.2063558873606],[151.013387437056,-25.3028056951622]]]}",
        "epsgcode": 32756
    },
    "t56jlt": {
        "geom": "{\"type\":\"Polygon\",\"coordinates\":[[[151.027750423283,-24.4005809930164],[152.014886914562,-24.4102227765982],[152.007696716668,-25.3142970923744],[151.013363885646,-25.3042497383368],[151.027750423283,-24.4005809930164]]]}",
        "epsgcode": 32756
    },
    "t56jmp": {
        "geom": "{\"type\":\"Polygon\",\"coordinates\":[[[151.982363779245,-28.0211259050334],[153.000813835873,-28.024893892935],[153.000820792723,-28.9286437734933],[151.973666651852,-28.9247319621925],[151.982363779245,-28.0211259050334]]]}",
        "epsgcode": 32756
    },
    "t56jmq": {
        "geom": "{\"type\":\"Polygon\",\"coordinates\":[[[151.99065411172,-27.1188429270482],[153.000807204455,-27.122469639231],[153.000813846737,-28.0263382551639],[151.982350198441,-28.0225700393084],[151.99065411172,-27.1188429270482]]]}",
        "epsgcode": 32756
    },
    "t56jmr": {
        "geom": "{\"type\":\"Polygon\",\"coordinates\":[[[151.998570022486,-26.2159000740829],[153.000800872567,-26.2193876190625],[153.000807210936,-27.1233724829951],[151.990646009666,-27.1197456305953],[151.998570022486,-26.2159000740829]]]}",
        "epsgcode": 32756
    },
    "t56jms": {
        "geom": "{\"type\":\"Polygon\",\"coordinates\":[[[152.006119102661,-25.3128416890927],[153.000794834133,-25.31619214226],[153.000800878749,-26.2202905776178],[151.998562293398,-26.2168028945545],[152.006119102661,-25.3128416890927]]]}",
        "epsgcode": 32756
    },
    "t56jmt": {
        "geom": "{\"type\":\"Polygon\",\"coordinates\":[[[152.013309023155,-24.410212500815],[153.000789083013,-24.4134279051674],[153.000794843563,-25.3176370551918],[152.006107313061,-25.314286384318],[152.013309023155,-24.410212500815]]]}",
        "epsgcode": 32756
    },
    "t56jnp": {
        "geom": "{\"type\":\"Polygon\",\"coordinates\":[[[152.999796541032,-28.0248938951942],[154.018246479675,-28.0211213844392],[154.026948820362,-28.9247272690543],[152.999794801819,-28.9286437758388],[152.999796541032,-28.0248938951942]]]}",
        "epsgcode": 32756
    },
    "t56jnq": {
        "geom": "{\"type\":\"Polygon\",\"coordinates\":[[[152.999798198886,-27.1224696414056],[154.009951177698,-27.1188385759422],[154.01826006862,-28.0225655184407],[152.999796538316,-28.0263382574233],[152.999798198886,-27.1224696414056]]]}",
        "epsgcode": 32756
    },
    "t56jnr": {
        "geom": "{\"type\":\"Polygon\",\"coordinates\":[[[152.999799781858,-26.2193876211536],[154.002030521824,-26.2158958899361],[154.009959284609,-27.1197412793211],[152.999798197266,-27.1233724851697],[152.999799781858,-26.2193876211536]]]}",
        "epsgcode": 32756
    },
    "t56jns": {
        "geom": "{\"type\":\"Polygon\",\"coordinates\":[[[152.999801291467,-25.3161921442689],[153.99447691639,-25.3128376694159],[154.002038255545,-26.2167987102422],[152.999799780313,-26.220290579709],[152.999801291467,-25.3161921442689]]]}",
        "epsgcode": 32756
    },
    "t56jnt": {
        "geom": "{\"type\":\"Polygon\",\"coordinates\":[[[152.999802729247,-24.4134279070953],[153.987282685896,-24.4102086431577],[153.994488713057,-25.3142823643801],[152.999801289109,-25.3176370572008],[152.999802729247,-24.4134279070953]]]}",
        "epsgcode": 32756
    },
    "t56kka": {
        "geom": "{\"type\":\"Polygon\",\"coordinates\":[[[150.482030365177,-21.6841164671634],[151.067786691017,-21.6921580939928],[151.055406902733,-22.5961628172938],[150.484563738392,-22.5882329817698],[150.482030365177,-21.6841164671634]]]}",
        "epsgcode": 32756
    },
    "t56kkb": {
        "geom": "{\"type\":\"Polygon\",\"coordinates\":[[[150.478890629937,-20.7809976789978],[151.0795259429,-20.7889515848592],[151.067774642873,-21.6930610681338],[150.482011534535,-21.6851996046608],[150.478890629937,-20.7809976789978]]]}",
        "epsgcode": 32756
    },
    "t56kku": {
        "geom": "{\"type\":\"Polygon\",\"coordinates\":[[[150.488315853051,-23.4895814679073],[151.042414411541,-23.4977119047872],[151.028722075203,-24.4014964751402],[150.49144341216,-24.3935467547525],[150.488315853051,-23.4895814679073]]]}",
        "epsgcode": 32756
    },
    "t56kkv": {
        "geom": "{\"type\":\"Polygon\",\"coordinates\":[[[150.485176401732,-22.5866175875111],[151.055427198085,-22.5947182289272],[151.042401071675,-23.4986146625578],[150.488295324566,-23.4906643676578],[150.485176401732,-22.5866175875111]]]}",
        "epsgcode": 32756
    },
    "t56klu": {
        "geom": "{\"type\":\"Polygon\",\"coordinates\":[[[151.04143557289,-23.4976995990096],[152.021726481547,-23.5069417768994],[152.01487990638,-24.4111258226345],[151.027736400842,-24.4014836367987],[151.04143557289,-23.4976995990096]]]}",
        "epsgcode": 32756
    },
    "t56klv": {
        "geom": "{\"type\":\"Polygon\",\"coordinates\":[[[151.054454856096,-22.5947064481938],[152.028233183844,-22.6035542697469],[152.021719811259,-23.5078449309959],[151.041422226365,-23.4986023562519],[151.054454856096,-22.5947064481938]]]}",
        "epsgcode": 32756
    },
    "t56kmu": {
        "geom": "{\"type\":\"Polygon\",\"coordinates\":[[[152.02015954104,-23.5069319270278],[153.000783603399,-23.5100140559047],[153.000789088628,-24.4143310849344],[152.013302003752,-24.4111155464225],[152.02015954104,-23.5069319270278]]]}",
        "epsgcode": 32756
    },
    "t56kmv": {
        "geom": "{\"type\":\"Polygon\",\"coordinates\":[[[152.026676661366,-22.6035448401883],[153.000778390486,-22.6064954458952],[153.000783608743,-23.5109173419352],[152.020152860072,-23.5078350807012],[152.026676661366,-22.6035448401883]]]}",
        "epsgcode": 32756
    }
}