{
  "B06": {
    "pGeo": 0.10832115907175854, 
    "pVol": 0.6793479812570369
  }, 
  "B03": {
    "pGeo": 0.13629402756508424, 
    "pVol": 0.44410413476263405
  }, 
  "B02": {
    "pGeo": 0.10206718346253231, 
    "pVol": 0.48062015503875966
  }, 
  "B05": {
    "pGeo": 0.14554566076055317, 
    "pVol": 0.54111011304024
  }, 
  "B04": {
    "pGeo": 0.13431952662721894, 
    "pVol": 0.33964497041420116
  }, 
  "B07": {
    "pGeo": 0.10779430922714256, 
    "pVol": 0.6705484174481124
  }, 
  "B11": {
    "pGeo": 0.13206997084548103, 
    "pVol": 0.33644314868804664
  }, 
  "B8A": {
    "pGeo": 0.10935640578596126, 
    "pVol": 0.6250778866596818
  }, 
  "B12": {
    "pGeo": 0.1455981941309255, 
    "pVol": 0.24040632054176073
  }, 
  "B08": {
    "pGeo": 0.1066925315227934, 
    "pVol": 0.4962819269317814
  }
}