{
  "development": {
    "driver": "sqlite3",
    "filename": "./app-development.db"
  },
  "production": {
    "driver": "sqlite3",
    "filename": "./app-production.db"
  },
  "test": {
    "driver": "sqlite3",
    "filename": "./app-test.db"
  }
}