{
  "Major": 0,
  "Minor": 1,
  "Patch": 0,
  "PreReleaseTag": "alpha.17",
  "PreReleaseTagWithDash": "-alpha.17",
  "PreReleaseLabel": "alpha",
  "PreReleaseLabelWithDash": "-alpha",
  "PreReleaseNumber": 17,
  "WeightedPreReleaseNumber": 17,
  "BuildMetaData": null,
  "BuildMetaDataPadded": "",
  "FullBuildMetaData": "Branch.develop.Sha.83268039eec18444b09f7124e4055e580aa51d40",
  "MajorMinorPatch": "0.1.0",
  "SemVer": "0.1.0-alpha.17",
  "LegacySemVer": "0.1.0-alpha17",
  "LegacySemVerPadded": "0.1.0-alpha0017",
  "AssemblySemVer": "0.1.0.0",
  "AssemblySemFileVer": "0.1.0.0",
  "FullSemVer": "0.1.0-alpha.17",
  "InformationalVersion": "0.1.0-alpha.17+Branch.develop.Sha.83268039eec18444b09f7124e4055e580aa51d40",
  "BranchName": "develop",
  "EscapedBranchName": "develop",
  "Sha": "83268039eec18444b09f7124e4055e580aa51d40",
  "ShortSha": "8326803",
  "NuGetVersionV2": "0.1.0-alpha0017",
  "NuGetVersion": "0.1.0-alpha0017",
  "NuGetPreReleaseTagV2": "alpha0017",
  "NuGetPreReleaseTag": "alpha0017",
  "VersionSourceSha": "16a2439290e4c3425f515ea2e84692fac0ad43c1",
  "CommitsSinceVersionSource": 17,
  "CommitsSinceVersionSourcePadded": "0017",
  "UncommittedChanges": 2,
  "CommitDate": "2022-09-30"
}
