......
----------------------------------------------------------------------
Ran 6 tests in 0.002s

OK
Name               Stmts   Miss Branch BrPart  Cover   Missing
--------------------------------------------------------------
Diplomacy.py         109      4     58      4    95%   19->27, 80->72, 96->107, 107, 113->114, 114-116
TestDiplomacy.py      36      0      0      0   100%
--------------------------------------------------------------
TOTAL                145      4     58      4    96%