1 10 20
100 200 125
201 210 89
900 1000 174
1 2 2
1 3 8
1 4 8
1 5 8
1 6 9
10 20 21
10 30 112
10 50 112
10 90 116
100 250 128
150 150 16
250 250 110
300 400 144
500 1000 179
10 1 20
200 100 125
210 201 89
1000 900 174
2 1 2
3 1 8
4 1 8
5 1 8
6 1 9
20 10 21
30 10 112
50 10 112
90 10 116
250 100 128
150 150 16
250 250 110
400 300 144
1000 500 179
2000 3000 217
25000 25100 233
6535 8262 257
26191 73628 340
650 550 145
628 740 171
700 900 179
16000 20000 279
10500 25000 282
25000 10500 282
52676 52671 203
221 221 115
222 222 71
555 555 31
777 777 34
1739 2184 180
5187 7309 262
6189 93762 351
9393 2525 262
8302 5739 262
9372 4830 262
7392 5830 262
1840 4269 238
2415 5840 238
8888 9999 260
11111 22222 279
33333 44444 324
4444 1111 238
1111 4444 238
99999 1 351
70000 70000 82
62729 74937 330
85948 63282 351
123 456 144
234 567 144
345 678 145
456 788 171
1 2000 182
84628 47398 351
53723 38729 340
74739 28292 340
100 4000 238
50000 50000 128
72620 84932 351
6467 4382 262
9999 1 262
3629 4920 238
6390 8888 257
1 1000 179
1 5700 238
1 1000 179
1 5000 238
1 7000 262
1 8000 262
1 9000 262
9000 1 262
7500 1 262
9999 1 262
1 9999 262
650 6500 262
65 6500 262
6 65000 340
6500 65 262
65000 650 340
600 6500 262
65000 65000 69
60 65000 340
