1 10 20
100 200 125
201 210 89
900 1000 174
-1 10 20
-10 -50 1
-50 -10 1
0 0 1
100 0 119
0 100 119
0 -1 1
0 -1000 1
1 999999 525
1 5 8
0 5 8
3097 3099 186
23 153 122
99 27 119
34 251 128
70 31 113
323 222 131
160 273 128
119 220 125
337 298 144
205 333 144
109 62 119
28 201 125
16 140 122
119 104 114
41 8 112
73 283 128
209 271 128
212 176 120
85 308 128
133 240 128
329 210 144
35 197 125
158 101 122
328 280 144
82 272 128
253 292 123
154 120 122
312 297 118
299 340 144
156 62 122
135 9 122
99 256 128
288 153 128
6 291 128
76 269 128
261 229 128
194 308 128
126 141 122
241 191 128
68 99 119
306 180 128
45 25 112
336 237 144
97 59 116
146 197 125
255 290 123
177 269 128
289 253 123
206 253 128
243 249 110
47 279 128
69 330 144
316 338 144
163 293 128
193 148 125
293 257 123
13 62 113
262 21 128
11 27 24
219 119 125
253 298 123
178 255 128
90 70 116
350 27 144
95 301 128
311 216 128
242 106 128
154 49 122
112 143 122
146 328 144
4 73 113
280 211 128
48 269 128
140 61 122
235 78 128
322 268 131
319 202 131
25 259 128
175 319 131
304 54 128
328 172 144
151 291 128
276 164 128
162 163 24
33 120 119
130 118 122
271 18 128
77 159 122
251 121 128
24 5 21
114 155 122
93 74 111
191 264 128
147 298 128
256 153 128
109 219 125
225 17 125
273 189 128
244 61 128
255 1 128
117 188 125
145 142 104
274 278 92
199 41 125
156 158 37
310 51 128
340 262 144
261 111 128
309 143 128
205 122 125
125 171 122
250 227 128
200 36 125
203 301 128
288 287 43
261 218 128
82 195 125
328 161 144
153 104 122
189 45 125
