...............
----------------------------------------------------------------------
Ran 15 tests in 0.270s

OK
Name             Stmts   Miss Branch BrPart  Cover   Missing
------------------------------------------------------------
Collatz.py          41      3     22      5    87%   73->77, 74->75, 75, 77->82, 78->79, 79, 111->112, 112
TestCollatz.py      71      0      0      0   100%
------------------------------------------------------------
TOTAL              112      3     22      5    94%