.................
----------------------------------------------------------------------
Ran 17 tests in 0.017s

OK
Name             Stmts   Miss Branch BrPart  Cover   Missing
------------------------------------------------------------
Collatz.py          38      1     14      0    98%   72
TestCollatz.py      73      0      0      0   100%
------------------------------------------------------------
TOTAL              111      1     14      0    99%