{
	"parent": "builtin/entity",
	"display": {
		"gui": {
			"rotation": [ 180, 0, 45 ],
			"translation": [ -7.25, -6.5, 0],
			"scale":[ 0.6, 0.6, 0.6 ]
		},
		"ground": {
			"rotation": [ 90, 0, 0 ],
			"translation": [ -1.7, 0, 14],
			"scale":[ 1, 1, 1 ]
		},
		"head": {
			"rotation": [ 0, 0, 0 ],
			"translation": [ 0, 0, 0],
			"scale":[ 1, 1, 1 ]
		},
		"fixed": {
			"rotation": [ 0, 0, 180 ],
			"translation": [ 0, -3, -1],
			"scale":[ 0.7, 0.7, 0.7 ]
		},
		"thirdperson_righthand": {
			"rotation": [ 180, 90, 0 ],
			"translation": [ -0.5, -8, 0],
			"scale":[ 0.7, 0.7, 0.7 ]
		},
		"thirdperson_lefthand": {
			"rotation": [ 180, -90, 0 ],
			"translation": [ 0.5, -8, 0],
			"scale":[ 0.7, 0.7, 0.7 ]
		},
		"firstperson_righthand": {
			"rotation": [ 180, -100, 0 ],
			"translation": [ 0, 0, 0],
			"scale":[ 0.5, 0.5, 0.5 ]
		},
		"firstperson_lefthand": {
			"rotation": [ 180, 86, 0 ],
			"translation": [ -1.5, 0, 0],
			"scale":[ 0.5, 0.5, 0.5 ]
		}
	}
}
