{
	"parent": "builtin/entity",
    "display": {
        "gui": {
            "rotation": [ 30, 45, 0 ],
            "translation": [ 3, 1.5, 0],
            "scale":[ 0.8, 0.8, 0.8 ]
        },
        "ground": {
            "rotation": [ 0, 0, 0 ],
            "translation": [ 4, 0.5, 2.5],
            "scale":[ 1, 1, 1 ]
        },
        "head": {
            "rotation": [ 0, 0, 0 ],
            "translation": [ 0, 0, 0],
            "scale":[ 1, 1, 1 ]
        },
        "fixed": {
            "rotation": [ 0, 0, 0 ],
            "translation": [ 4, 1.5, 0],
            "scale":[ 1, 1, 1 ]
        },
        "thirdperson_righthand": {
            "rotation": [ 0, -90, 0 ],
            "translation": [ -0.5, -0.5, 4],
            "scale":[ 1, 1, 1 ]
        },
		"thirdperson_lefthand": {
            "rotation": [ 0, 90, 0 ],
            "translation": [ 1, -0.5, 4],
            "scale":[ 1, 1, 1 ]
        },
        "firstperson_righthand": {
            "rotation": [ 0, -90, 0 ],
            "translation": [ 0, 5, 0],
            "scale":[ 1, 1, 1 ]
        },
        "firstperson_lefthand": {
            "rotation": [ 0, 90, 0 ],
            "translation": [ 1.5, 5, 0],
            "scale":[ 1, 1, 1 ]
        }
    }
}
