{
  "output": {
    "item": "heroesexpansion:spider_man_homemade_legs"
  },
  "requirements": [
    {
      "item": "lucraftcore:tri_polymer_red",
      "amount": 7
    },
    {
      "item": "lucraftcore:tri_polymer_blue",
      "amount": 4
    }
  ]
}