{
  "Jeux": [
    {
      "id": 1,
      "question": "A quel jeu de société un champion du monde a t-il été battu par une IA ?",
      "choice1": "Echecs",
      "choice2": "Backgammon",
      "choice3": "Cluedo",
      "choice4": "Monopoly",
      "answer": 1
    },
    {
      "id": 2,
      "question": "Quel jeu contient l'agent Jaeger ?",
      "choice1": "League of Legends",
      "choice2": "FIFA 21",
      "choice3": "Rainbow Six Siege",
      "choice4": "PNL",
      "answer": 3
    },
    {
      "id": 3,
      "question": "Combien de joueurs disputent une partie de League of Legends ?",
      "choice1": "10",
      "choice2": "12",
      "choice3": "7",
      "choice4": "9",
      "answer": 1
    },
    {
      "id": 4,
      "question": "A quel jeu le joueur professionnel Faker joue t-il ?",
      "choice1": "Osu",
      "choice2": "League of Legends",
      "choice3": "Call of duty",
      "choice4": "Hearthstone",
      "answer": 2
    },
    {
      "id": 5,
      "question": "A quel jeu le joueur professionnel Penguu joue t-il ?",
      "choice1": "Osu",
      "choice2": "League of Legends",
      "choice3": "Call of duty",
      "choice4": "Rainbow Six Siege",
      "answer": 4
    }
  ],
  "Foot": [
    {
      "id": 1,
      "question": "Quand la LDC a t-elle été creer ?",
      "choice1": "2001",
      "choice2": "1955",
      "choice3": "1990",
      "choice4": "1489",
      "answer": 2
    },
    {
      "id": 2,
      "question": "Comment s'appelle le joueur nommé Zizou ?",
      "choice1": "Abel Bertrand",
      "choice2": "Mokthar delahaye",
      "choice3": "Zinedine Zidane",
      "choice4": "Jean Payet",
      "answer": 3
    },
    {
      "id": 3,
      "question": "Comment s'appelle le club de Paris ?",
      "choice1": "Paris Saint Germain",
      "choice2": "L'Olympique de Marseille",
      "choice3": "FC Rennes",
      "choice4": "Cara St-Germain",
      "answer": 1
    },
    {
      "id": 4,
      "question": "Quel est le pire Club Français ? ",
      "choice1": "FC Beauvoir",
      "choice2": "L'OM",
      "choice3": "L'eauM",
      "choice4": "Marseille",
      "answer": 2
    },
    {
      "id": 5,
      "question": "Combien de fois l'Italie a t-elle remportée la coupe du monde ? ",
      "choice1": "0",
      "choice2": "2",
      "choice3": "5",
      "choice4": "4",
      "answer": 4
    }
  ],
  "Culture": [
    {
      "id": 1,
      "question": "En quelle année a demarré la première guerre mondiale ?",
      "choice1": "1914",
      "choice2": "2008",
      "choice3": "1939",
      "choice4": "1918",
      "answer": 1
    },
    {
      "id": 2,
      "question": "Qui est le meilleur sprinter de l'entre-deux guerres ?",
      "choice1": "Kobe Bryant",
      "choice2": "Jesse Owens",
      "choice3": "Zinedine Zidane",
      "choice4": "Usain Bolt",
      "answer": 2
    },
    {
      "id": 3,
      "question": "En quelle année est née la reine Elizabeth 2 ?",
      "choice1": "1899",
      "choice2": "1930",
      "choice3": "1926",
      "choice4": "1940",
      "answer": 3
    },
    {
      "id": 4,
      "question": "De quelle nationalité était le char moyen T34 ?",
      "choice1": "Russe",
      "choice2": "Allemand",
      "choice3": "Americain",
      "choice4": "Hongrois",
      "answer": 1
    },
    {
      "id": 5,
      "question": "Comment était appellé le régime russe entre 1925 et 1990 ?",
      "choice1": "Communisme",
      "choice2": "Soviétisme",
      "choice3": "Democratie",
      "choice4": "La réponse D",
      "answer": 1
    }
  ],
  "Programmation": [
    {
      "id": 1,
      "question": "En quelle année a été creer le langage C ?",
      "choice1": "Début des années 70",
      "choice2": "Début des années 90",
      "choice3": "Début des années 80",
      "choice4": "Début des années 50",
      "answer": 1
    },
    {
      "id": 2,
      "question": "Quel outil permet de designer en forme une page web ?",
      "choice1": "Java",
      "choice2": "C++",
      "choice3": "Html",
      "choice4": "Css",
      "answer": 4
    },
    {
      "id": 3,
      "question": "Quel balise HTML permet de mettre des caractères en titre ?",
      "choice1": "La balise h1 ",
      "choice2": "La balise a",
      "choice3": "La balise img",
      "choice4": "La balise p",
      "answer": 1
    },
    {
      "id": 4,
      "question": "Quel langage de programmation a vu le jour en 1991 ?",
      "choice1": "C#",
      "choice2": "Python",
      "choice3": "Kobold",
      "choice4": ".NET",
      "answer": 2
    },
    {
      "id": 5,
      "question": "Quelle est la version actuelle de C++ ?",
      "choice1": "C++20",
      "choice2": "C++18",
      "choice3": "C++17",
      "choice4": "C++8",
      "answer": 1
    }
  ]
}