<?xml version="1.0" encoding="UTF-8"?>
<!-- Generator: Adobe Illustrator 25.2.0, SVG Export Plug-In . SVG Version: 6.00 Build 0) -->
<svg version="1.1" id="Layer_1" xmlns="http://www.w3.org/2000/svg" xmlns:xlink="http://www.w3.org/1999/xlink" x="0px" y="0px" viewBox="0 0 16 16" style="enable-background:new 0 0 16 16;" xml:space="preserve">
	<style type="text/css">
		.st0{fill:none;stroke:#0B3954;stroke-linecap:round;stroke-linejoin:round;stroke-miterlimit:2.6667;}
	</style>
	<path class="st0" d="M2,6l6-4.7L14,6v7.3c0,0.7-0.6,1.3-1.3,1.3H3.3c-0.7,0-1.3-0.6-1.3-1.3V6z" />
	<polyline class="st0" points="6,14.7 6,8 10,8 10,14.7 " />
</svg>
