<?xml version="1.0" encoding="UTF-8"?>
<!-- Generator: Adobe Illustrator 25.2.0, SVG Export Plug-In . SVG Version: 6.00 Build 0) -->
<svg version="1.1" id="Layer_1" xmlns="http://www.w3.org/2000/svg" xmlns:xlink="http://www.w3.org/1999/xlink" x="0px" y="0px" viewBox="0 0 24 24" style="enable-background:new 0 0 24 24;" xml:space="preserve">
	<style type="text/css">
		.st0{fill:none;stroke:#0B3954;stroke-width:0.5;stroke-linecap:round;stroke-linejoin:round;}
	</style>
	<circle class="st0" cx="12" cy="12" r="10" />
	<path class="st0" d="M8,14c0,0,1.5,2,4,2s4-2,4-2" />
	<line class="st0" x1="9" y1="9" x2="9" y2="9" />
	<line class="st0" x1="15" y1="9" x2="15" y2="9" />
</svg>
