%YAML 1.1
%TAG !u! tag:unity3d.com,2011:
--- !u!114 &11400000
MonoBehaviour:
  m_ObjectHideFlags: 0
  m_CorrespondingSourceObject: {fileID: 0}
  m_PrefabInstance: {fileID: 0}
  m_PrefabAsset: {fileID: 0}
  m_GameObject: {fileID: 0}
  m_Enabled: 1
  m_EditorHideFlags: 0
  m_Script: {fileID: 11500000, guid: ac273a321ed8e0e418955210fc6c2b3a, type: 3}
  m_Name: Fountain
  m_EditorClassIdentifier: Assembly-CSharp::BuildingStats
  Health: 0
  Armor: 0
  Damage: 0
  BAT: 0
  AttackRange: 0
  ProjectileSpeed: 0
  TeamGoldBounty: 0
  LastHitGBounty: 0
  TPAB: 0
  HPRegen: 0
  MagicRes: 0
