%YAML 1.1
%TAG !u! tag:unity3d.com,2011:
--- !u!1001 &2974409442904632771
PrefabInstance:
  m_ObjectHideFlags: 0
  serializedVersion: 2
  m_Modification:
    m_TransformParent: {fileID: 0}
    m_Modifications:
    - target: {fileID: 5757086868892952673, guid: 37ae046f220c55c4bbe8bf4a472d4ea0,
        type: 3}
      propertyPath: m_Name
      value: SuperMeleeCreep Variant
      objectReference: {fileID: 0}
    - target: {fileID: 5755615267795527695, guid: 37ae046f220c55c4bbe8bf4a472d4ea0,
        type: 3}
      propertyPath: Traits
      value: 
      objectReference: {fileID: 11400000, guid: 4a44cc0d25a56674b82c38ac3cb14ff0,
        type: 2}
    - target: {fileID: 5759727278139251319, guid: 37ae046f220c55c4bbe8bf4a472d4ea0,
        type: 3}
      propertyPath: m_LocalPosition.x
      value: 45.636177
      objectReference: {fileID: 0}
    - target: {fileID: 5759727278139251319, guid: 37ae046f220c55c4bbe8bf4a472d4ea0,
        type: 3}
      propertyPath: m_LocalPosition.y
      value: 7.507782
      objectReference: {fileID: 0}
    - target: {fileID: 5759727278139251319, guid: 37ae046f220c55c4bbe8bf4a472d4ea0,
        type: 3}
      propertyPath: m_LocalPosition.z
      value: 161.5721
      objectReference: {fileID: 0}
    - target: {fileID: 5759727278139251319, guid: 37ae046f220c55c4bbe8bf4a472d4ea0,
        type: 3}
      propertyPath: m_LocalRotation.x
      value: 0
      objectReference: {fileID: 0}
    - target: {fileID: 5759727278139251319, guid: 37ae046f220c55c4bbe8bf4a472d4ea0,
        type: 3}
      propertyPath: m_LocalRotation.y
      value: 0
      objectReference: {fileID: 0}
    - target: {fileID: 5759727278139251319, guid: 37ae046f220c55c4bbe8bf4a472d4ea0,
        type: 3}
      propertyPath: m_LocalRotation.z
      value: 0
      objectReference: {fileID: 0}
    - target: {fileID: 5759727278139251319, guid: 37ae046f220c55c4bbe8bf4a472d4ea0,
        type: 3}
      propertyPath: m_LocalRotation.w
      value: 1
      objectReference: {fileID: 0}
    - target: {fileID: 5759727278139251319, guid: 37ae046f220c55c4bbe8bf4a472d4ea0,
        type: 3}
      propertyPath: m_RootOrder
      value: 0
      objectReference: {fileID: 0}
    - target: {fileID: 5759727278139251319, guid: 37ae046f220c55c4bbe8bf4a472d4ea0,
        type: 3}
      propertyPath: m_LocalEulerAnglesHint.x
      value: 0
      objectReference: {fileID: 0}
    - target: {fileID: 5759727278139251319, guid: 37ae046f220c55c4bbe8bf4a472d4ea0,
        type: 3}
      propertyPath: m_LocalEulerAnglesHint.y
      value: 0
      objectReference: {fileID: 0}
    - target: {fileID: 5759727278139251319, guid: 37ae046f220c55c4bbe8bf4a472d4ea0,
        type: 3}
      propertyPath: m_LocalEulerAnglesHint.z
      value: 0
      objectReference: {fileID: 0}
    - target: {fileID: 5757031090036222559, guid: 37ae046f220c55c4bbe8bf4a472d4ea0,
        type: 3}
      propertyPath: m_IsActive
      value: 1
      objectReference: {fileID: 0}
    - target: {fileID: 5757402215357477087, guid: 37ae046f220c55c4bbe8bf4a472d4ea0,
        type: 3}
      propertyPath: m_IsActive
      value: 0
      objectReference: {fileID: 0}
    - target: {fileID: 5756992596664422357, guid: 37ae046f220c55c4bbe8bf4a472d4ea0,
        type: 3}
      propertyPath: m_IsActive
      value: 0
      objectReference: {fileID: 0}
    - target: {fileID: 5622809911671478079, guid: 37ae046f220c55c4bbe8bf4a472d4ea0,
        type: 3}
      propertyPath: m_Materials.Array.data[0]
      value: 
      objectReference: {fileID: 2100000, guid: f685a57b9da560a448bb95374a652f90, type: 2}
    m_RemovedComponents: []
  m_SourcePrefab: {fileID: 100100000, guid: 37ae046f220c55c4bbe8bf4a472d4ea0, type: 3}
