%YAML 1.1
%TAG !u! tag:unity3d.com,2011:
--- !u!1001 &1994547863219790326
PrefabInstance:
  m_ObjectHideFlags: 0
  serializedVersion: 2
  m_Modification:
    m_TransformParent: {fileID: 0}
    m_Modifications:
    - target: {fileID: 3203563155664244660, guid: c4ad4000f1d7c72408c7da2272e2134c,
        type: 3}
      propertyPath: m_Name
      value: Melee barracks Dire
      objectReference: {fileID: 0}
    - target: {fileID: 3203563155664037726, guid: c4ad4000f1d7c72408c7da2272e2134c,
        type: 3}
      propertyPath: m_LocalPosition.x
      value: 31.630005
      objectReference: {fileID: 0}
    - target: {fileID: 3203563155664037726, guid: c4ad4000f1d7c72408c7da2272e2134c,
        type: 3}
      propertyPath: m_LocalPosition.y
      value: 7.647072
      objectReference: {fileID: 0}
    - target: {fileID: 3203563155664037726, guid: c4ad4000f1d7c72408c7da2272e2134c,
        type: 3}
      propertyPath: m_LocalPosition.z
      value: 152.2
      objectReference: {fileID: 0}
    - target: {fileID: 3203563155664037726, guid: c4ad4000f1d7c72408c7da2272e2134c,
        type: 3}
      propertyPath: m_LocalRotation.x
      value: -0
      objectReference: {fileID: 0}
    - target: {fileID: 3203563155664037726, guid: c4ad4000f1d7c72408c7da2272e2134c,
        type: 3}
      propertyPath: m_LocalRotation.y
      value: -0
      objectReference: {fileID: 0}
    - target: {fileID: 3203563155664037726, guid: c4ad4000f1d7c72408c7da2272e2134c,
        type: 3}
      propertyPath: m_LocalRotation.z
      value: -0
      objectReference: {fileID: 0}
    - target: {fileID: 3203563155664037726, guid: c4ad4000f1d7c72408c7da2272e2134c,
        type: 3}
      propertyPath: m_LocalRotation.w
      value: 1
      objectReference: {fileID: 0}
    - target: {fileID: 3203563155664037726, guid: c4ad4000f1d7c72408c7da2272e2134c,
        type: 3}
      propertyPath: m_RootOrder
      value: 0
      objectReference: {fileID: 0}
    - target: {fileID: 3203563155664037726, guid: c4ad4000f1d7c72408c7da2272e2134c,
        type: 3}
      propertyPath: m_LocalEulerAnglesHint.x
      value: 0
      objectReference: {fileID: 0}
    - target: {fileID: 3203563155664037726, guid: c4ad4000f1d7c72408c7da2272e2134c,
        type: 3}
      propertyPath: m_LocalEulerAnglesHint.y
      value: 0
      objectReference: {fileID: 0}
    - target: {fileID: 3203563155664037726, guid: c4ad4000f1d7c72408c7da2272e2134c,
        type: 3}
      propertyPath: m_LocalEulerAnglesHint.z
      value: 0
      objectReference: {fileID: 0}
    - target: {fileID: 3203563156417978974, guid: c4ad4000f1d7c72408c7da2272e2134c,
        type: 3}
      propertyPath: Creeps.Array.data[0]
      value: 
      objectReference: {fileID: 3111370688285504609, guid: 62834dc2ebf30e34996e4238faedec88,
        type: 3}
    - target: {fileID: 3203563156417978974, guid: c4ad4000f1d7c72408c7da2272e2134c,
        type: 3}
      propertyPath: Creeps.Array.data[1]
      value: 
      objectReference: {fileID: 2723672441322174184, guid: 563e1e73c5f0eb547a8dd7ceef1b2c8a,
        type: 3}
    - target: {fileID: 3203563156353064769, guid: c4ad4000f1d7c72408c7da2272e2134c,
        type: 3}
      propertyPath: m_LocalPosition.x
      value: -0.41
      objectReference: {fileID: 0}
    - target: {fileID: 3203563156353064769, guid: c4ad4000f1d7c72408c7da2272e2134c,
        type: 3}
      propertyPath: m_LocalPosition.z
      value: 3.61
      objectReference: {fileID: 0}
    - target: {fileID: 3203563155662284102, guid: c4ad4000f1d7c72408c7da2272e2134c,
        type: 3}
      propertyPath: m_Materials.Array.data[0]
      value: 
      objectReference: {fileID: 2100000, guid: a3cd22eceea5e8548b10cdb5d9b49a25, type: 2}
    m_RemovedComponents: []
  m_SourcePrefab: {fileID: 100100000, guid: c4ad4000f1d7c72408c7da2272e2134c, type: 3}
