%YAML 1.1
%TAG !u! tag:unity3d.com,2011:
--- !u!1001 &2357121239841399717
PrefabInstance:
  m_ObjectHideFlags: 0
  serializedVersion: 2
  m_Modification:
    m_TransformParent: {fileID: 0}
    m_Modifications:
    - target: {fileID: 4952463526947870514, guid: 3901ba33313b1c746ae2b3edb3003243,
        type: 3}
      propertyPath: m_Name
      value: SuperSiegeCreep Dire
      objectReference: {fileID: 0}
    - target: {fileID: 4952463526947617380, guid: 3901ba33313b1c746ae2b3edb3003243,
        type: 3}
      propertyPath: m_LocalPosition.x
      value: 135.03218
      objectReference: {fileID: 0}
    - target: {fileID: 4952463526947617380, guid: 3901ba33313b1c746ae2b3edb3003243,
        type: 3}
      propertyPath: m_LocalPosition.y
      value: 7.516661
      objectReference: {fileID: 0}
    - target: {fileID: 4952463526947617380, guid: 3901ba33313b1c746ae2b3edb3003243,
        type: 3}
      propertyPath: m_LocalPosition.z
      value: 66.310646
      objectReference: {fileID: 0}
    - target: {fileID: 4952463526947617380, guid: 3901ba33313b1c746ae2b3edb3003243,
        type: 3}
      propertyPath: m_LocalRotation.x
      value: 0
      objectReference: {fileID: 0}
    - target: {fileID: 4952463526947617380, guid: 3901ba33313b1c746ae2b3edb3003243,
        type: 3}
      propertyPath: m_LocalRotation.y
      value: 0
      objectReference: {fileID: 0}
    - target: {fileID: 4952463526947617380, guid: 3901ba33313b1c746ae2b3edb3003243,
        type: 3}
      propertyPath: m_LocalRotation.z
      value: 0
      objectReference: {fileID: 0}
    - target: {fileID: 4952463526947617380, guid: 3901ba33313b1c746ae2b3edb3003243,
        type: 3}
      propertyPath: m_LocalRotation.w
      value: 1
      objectReference: {fileID: 0}
    - target: {fileID: 4952463526947617380, guid: 3901ba33313b1c746ae2b3edb3003243,
        type: 3}
      propertyPath: m_RootOrder
      value: 0
      objectReference: {fileID: 0}
    - target: {fileID: 4952463526947617380, guid: 3901ba33313b1c746ae2b3edb3003243,
        type: 3}
      propertyPath: m_LocalEulerAnglesHint.x
      value: 0
      objectReference: {fileID: 0}
    - target: {fileID: 4952463526947617380, guid: 3901ba33313b1c746ae2b3edb3003243,
        type: 3}
      propertyPath: m_LocalEulerAnglesHint.y
      value: 0
      objectReference: {fileID: 0}
    - target: {fileID: 4952463526947617380, guid: 3901ba33313b1c746ae2b3edb3003243,
        type: 3}
      propertyPath: m_LocalEulerAnglesHint.z
      value: 0
      objectReference: {fileID: 0}
    - target: {fileID: 4952463526950025568, guid: 3901ba33313b1c746ae2b3edb3003243,
        type: 3}
      propertyPath: m_Materials.Array.data[0]
      value: 
      objectReference: {fileID: 2100000, guid: c70e075a2144ba04784d74b7b2889fd3, type: 2}
    - target: {fileID: 6969019934818459400, guid: 3901ba33313b1c746ae2b3edb3003243,
        type: 3}
      propertyPath: Traits
      value: 
      objectReference: {fileID: 11400000, guid: f67a4382347fbf447af7b59e3b44ffd6,
        type: 2}
    m_RemovedComponents: []
  m_SourcePrefab: {fileID: 100100000, guid: 3901ba33313b1c746ae2b3edb3003243, type: 3}
