%YAML 1.1
%TAG !u! tag:unity3d.com,2011:
--- !u!114 &11400000
MonoBehaviour:
  m_ObjectHideFlags: 0
  m_CorrespondingSourceObject: {fileID: 0}
  m_PrefabInstance: {fileID: 0}
  m_PrefabAsset: {fileID: 0}
  m_GameObject: {fileID: 0}
  m_Enabled: 1
  m_EditorHideFlags: 0
  m_Script: {fileID: 11500000, guid: 73f771796b3e0e0458a4996c3e13739e, type: 3}
  m_Name: SuperMeleeCreep
  m_EditorClassIdentifier: 
  HealthPoints: 700
  GoldBounty: 22
  ExpBounty: 25
  AttackDamage: 40
  AttackRange: 1
  MovementSpeed: 3.25
  SightRange: 7.5
