{
    "Author": "Haplo064, joshua.software.dev",
    "Changelog": "Update to 7.0 / Dalamud API 10",
    "Description": "An updated port of the older version of Pixel Perfect. Show a representation of your real character hitbox on screen.",
    "IconUrl": "https://raw.githubusercontent.com/Haplo064/PixelPerfect/master/images/icon.png",
    "ImageUrls": [
        "https://raw.githubusercontent.com/Haplo064/PixelPerfect/master/images/image1.png",
        "https://raw.githubusercontent.com/Haplo064/PixelPerfect/master/images/image2.png",
        "https://raw.githubusercontent.com/Haplo064/PixelPerfect/master/images/image3.png"
    ],
    "InternalName": "PixelPerfectLegacy",
    "Name": "Pixel Perfect Legacy",
    "Punchline": "Adds an indicator of your hitbox.",
    "RepoUrl": "https://gitlab.com/joshua.software.dev/PixelerPerfect"
}
