{
    // Last version this config was auto generated with
    "config_version": 1,
    // Should this plugin be loaded and run
    "enable_plugin": true,

    // ##################
    // ### UI Details ###
    // ##################

    // Should the header line above all usernames be drawn
    "show_header_line": true,
    /*
     * How many pixels should the overlay be offset from the edges of the screen
     * Must be a value equal to or greater than 0
     */
    "screen_margin": 20,
    // Valid values are:
    // "TOP_LEFT", "TOP_RIGHT", "BOTTOM_LEFT", and "BOTTOM_RIGHT"
    "window_position": "TOP_RIGHT",
    // Must be a value between 0.0 and 1.0 (representing 0% - 100% opacity)
    "window_background_opacity": 0.0,
    /*
     * Max UI height in pixels. -1 for no limit, 0 for automatic sizing to
     * content.
     * Extremely small values (~<30) will be ignored.
     * Must be a value between -1 and 2147483647
     */
    "ui_max_height": -1,
    // Sets if user avatar images should be shown nearby usernames
    "show_user_avatars": true,
    // Sets if user avatar images should be rounded into circles
    "round_avatar_images": true,
    /*
     * Value in pixels that defines the diameter/diagonal size of avatar images.
     * If this is not the same as username_row_height, the username text is not
     * guaranteed to be aligned with the avatar image.
     */
    "avatar_max_size": 30,
    /*
     * Value in pixels that defines the maximum size of each username row.
     * If this is not the same as avatar_max_size, the username text is not
     * guaranteed to be aligned with the avatar image.
     */
    "username_row_height": 30,
    /*
     * Set how opaque the background shadow behind username text is.
     * Must be a value between 0.0 and 1.0 (representing 0% - 100% opacity)
     */
    "username_opacity": 0.7,
    /*
     * Default Username Color
     * Valid values are 6-digit CSS Hex Codes (with # symbol allowed optionally)
     */
    "username_default_color": "#FFFFFF",
    /*
     * Speaking Username Color
     * Valid values are 6-digit CSS Hex Codes (with # symbol allowed optionally)
     */
    "username_speaking_color": "#00FF00",
    /*
     * Muted Username Color
     * Valid values are 6-digit CSS Hex Codes (with # symbol allowed optionally)
     */
    "username_muted_color": "#FF0000",
    /*
     * Deafened Username Color
     * Valid values are 6-digit CSS Hex Codes (with # symbol allowed optionally)
     */
    "username_deafened_color": "#005EFF",
    /*
     * Muted & Deafened Username Color
     * Valid values are 6-digit CSS Hex Codes (with # symbol allowed optionally)
     */
    "username_deafened_muted_color": "#802F80",

    /*
     * ################
     * ### Advanced ###
     * ################
     */

    /*
     * Run messaging necessary to communicate with discord in a background
     * thread, instead of delaying rendering of frames each time communication
     * needs to occur.
     */
    "use_background_network_thread": true,
    /*
     * If this is a valid path, all messages received from discord will be
     * logged to disk.
     */
    "logging_path": null
}
