{
  "file_format_version" : "1.0.0",
  "layer" : {
    "name": "ATHENA_OVERLAY_VULKAN_x86_64",
    "type": "GLOBAL",
    "library_path": "..\\..\\athena_overlay\\lib\\64\\libathena_overlay_vulkan.dll",
    "api_version": "1.3.0",
    "implementation_version": "1",
    "description": "A plugin based OpenGL/Vulkan ImGui overlay written in Zig! - https://github.com/joshua-software-dev/AthenaOverlay",
    "functions": {
      "vkGetInstanceProcAddr": "AthenaOverlayVulkan_GetInstanceProcAddr",
      "vkGetDeviceProcAddr": "AthenaOverlayVulkan_GetDeviceProcAddr"
    },
    "enable_environment": {
      "ENABLE_ATHENA_OVERLAY": "1"
    },
    "disable_environment": {
      "DISABLE_ATHENA_OVERLAY": "1"
    }
  }
}
