Predicted,Actual
0.02419425,0.024510145
0.024903677,0.02812065
0.028877646,0.03106273
0.031707212,0.04191374
0.043383867,0.049209073
0.050712235,0.03861474
0.03920751,0.040855363
0.04004624,0.06977886
0.06683573,0.071300134
0.06835873,0.09219473
0.07749693,0.08420459
0.07409876,-0.008708795
-0.016270166,-0.039630454
-0.04857011,-0.06230782
-0.062433086,-0.065818086
-0.06322936,0.011449705
0.017857272,0.038642038
0.04637244,0.04381786
0.045554172,0.048840452
0.04797235,0.026754668
0.026046379,0.018431008
0.019564373,0.022545699
0.025571987,0.02018511
0.021754973,0.009202659
0.00902871,0.0056786314
0.004336937,0.0017591463
-0.00021210779,0.0017428601
0.0020843623,0.015492369
0.016925668,0.020778984
0.021375194,0.021337533
0.021838017,0.022588365
0.022237508,0.021382034
0.021037292,0.020664291
0.021687467,0.021533657
0.022911806,0.02082899
0.022290085,0.016190615
0.01683574,0.013849062
0.014333676,0.013950449
0.015169542,0.0129498765
0.013929075,0.01048354
0.011461266,0.009910079
0.01050968,0.007907327
0.00772548,0.008043811
0.0079394635,0.014917304
0.015604339,0.017265737
0.018099368,0.017087735
0.017229712,0.017039565
0.016074995,0.015034748
0.013152471,0.013289365
0.011849468,0.013562332
0.012605232,0.011613255
0.011535572,0.0059288894
0.0055840206,0.003305195
0.001852125,-0.0032648232
-0.0039977212,-0.0056428476
-0.005202247,0.003882784
0.005726488,0.0032912025
0.005911341,0.004714301
0.0056419456,0.0005076269
-0.00068512553,-0.02692877
-0.02932259,-0.039894473
-0.04112836,-0.036839537
-0.035084408,-0.040221807
-0.036144886,-0.053018454
-0.04910803,-0.0526207
-0.050048452,-0.060413335
-0.058003504,-0.0538986
-0.05010075,-0.0027643072
0.0041683665,0.019984627
0.028373294,0.02567014
0.030592646,0.033691242
0.03497282,0.033698354
0.03461817,0.03329418
0.0355294,0.041476537
0.04322037,0.039525166
0.040450353,0.015565313
0.013442818,0.006631493
0.0015403972,-0.0046147485
-0.008246943,-0.008188093
-0.009228377,0.011783
0.013462661,0.012435827
0.014587681,0.023801807
0.025533892,0.018648006
0.019599633,-0.037355192
-0.0397159,-0.054604184
-0.05635839,-0.07153755
-0.06883767,-0.07189286
-0.06730661,-0.010735403
-0.003251095,0.010566576
0.018845148,0.019673124
0.024224149,0.023596738
0.026113331,-0.0058541102
-0.005973704,-0.01507489
-0.015330119,-0.016464729
-0.015464175,-0.017273996
-0.016204542,-0.0065190946
-0.00332007,-0.0030792514
0.0007287934,-9.1983005e-05
0.002635362,0.0006984744
0.0030435799,-0.0069455197
-0.0069272416,-0.007837135
-0.008743407,-0.011650416
-0.0104372855,-0.010857435
-0.0073130936,0.007897693
0.013312327,0.014114689
0.019072404,0.010724851
0.012605302,0.007597888
0.0071698665,0.008282599
0.008100792,0.003955499
0.0052462993,-0.019935997
-0.019079385,-0.028521612
-0.028032642,-0.030819124
-0.029535847,-0.031181091
-0.029311955,-0.01574538
-0.012868852,-0.009629084
-0.0060726353,-0.0096419295
-0.006925137,-0.0069262516
-0.00539646,-0.00856153
-0.006247805,-0.0071579292
-0.003948797,0.0040706494
0.007880717,0.004643421
0.00929229,0.009541459
0.013326913,0.0057914886
0.00799367,-0.028592033
-0.029036012,-0.043983705
-0.044439238,-0.041470114
-0.039743308,-0.045304496
-0.04112047,-0.056201845
-0.051539354,-0.055285916
-0.05155709,-0.062443614
-0.05860331,-0.05581212
-0.05046453,-0.006221125
0.0014985598,0.016609928
0.025895609,0.020794582
0.02612507,0.029281791
0.030684313,0.035561867
0.036359925,0.036944594
0.03854307,0.04653124
0.048546337,0.044862244
0.04719886,0.012844819
0.011803214,0.00021539163
-0.0027585193,-0.0029824513
-0.0033818611,-0.006402109
-0.005364995,-0.00055166864
0.0008006928,0.0017426306
0.0023972148,-0.0010329164
-0.0012706119,-0.0001309783
0.000291141,0.0090358965
0.010527494,0.012928544
0.014877856,0.011483653
0.012924911,0.011969718
0.012050106,0.014871427
0.01500056,0.013837593
0.014652228,0.015545357
0.015550196,0.012597313
0.012558789,-0.0041841944
-0.0049291584,-0.012078446
-0.013042442,-0.0155575145
-0.01466114,-0.019076495
-0.01744708,-0.018599605
-0.016591853,-0.019558202
-0.017663281,-0.021824745
-0.02009937,-0.022841146
-0.020514704,-0.022157123
-0.019890575,-0.022160564
-0.019778972,-0.022163088
-0.019577669,-0.022137854
-0.0195798,-0.022429861
-0.019523555,-0.021984626
-0.018726442,-0.022569785
-0.019370172,-0.021610042
-0.018839017,-0.017873835
-0.015429162,-0.01653515
-0.013781751,-0.011326525
-0.00862881,-0.0102585135
-0.007617557,-0.01920885
-0.017298043,-0.019036353
-0.01784259,-0.025190497
-0.023916436,-0.022207359
-0.02099211,0.008247504
0.0111949025,0.01805436
0.020969009,0.026714066
0.028377002,0.027371023
0.028321968,-0.0022023162
-0.0032420927,-0.012361965
-0.012467418,-0.016041515
-0.014244499,-0.017747903
-0.015744451,-0.0047856392
-0.002013746,-0.0006287417
0.0015865365,0.0008078906
0.0024294532,0.0016063765
0.0037107556,-0.0038761317
-0.002317049,-0.0049157003
-0.003955683,-0.005618992
-0.0046637724,-0.0048234877
-0.0043062842,0.0020105513
0.0025819128,0.0048030727
0.005438077,0.006567495
0.0063832435,0.0075724265
0.006888216,0.0047666007
0.0043393774,0.004346369
0.0049398523,0.0043782536
0.0061243377,0.004622777
0.0069503156,0.007958709
0.010223467,0.009439842
0.011192204,0.006910883
0.007850499,0.006607178
0.00720201,0.0110808555
0.012566411,0.01040532
0.011938559,0.011833923
0.012621377,0.008984055
0.009001691,-0.008271589
-0.009762681,-0.016386738
-0.018236272,-0.017825663
-0.018209366,-0.020857662
-0.019864583,-0.023636192
-0.022598581,-0.024136478
-0.023354946,-0.027459335
-0.02583081,-0.026536064
-0.023830106,-0.013794928
-0.009953418,-0.008344992
-0.0042051286,-0.006966623
-0.004232287,-0.004977175
-0.0035528215,-0.0054547526
-0.0036553242,-0.0054439716
-0.0029494313,-0.0028315168
-0.0005343377,-0.002712237
-0.001178354,-0.0075962823
-0.0070336983,-0.0085516665
-0.008339494,-0.011541
-0.010886035,-0.01107535
-0.009359189,-0.001640096
0.0010225092,0.00032274335
0.0029936072,0.007358411
0.0099779805,0.007341666
0.009382255,-0.014299572
-0.014492402,-0.01923431
-0.01999027,-0.023648119
-0.023278568,-0.021325376
-0.019926654,0.007818555
0.011316704,0.020297049
0.023680883,0.022167215
0.023088036,0.026091289
0.025516097,0.027237292
0.02661419,0.027042085
0.02705347,0.030503033
0.030763406,0.028953314
0.02912306,0.014763846
0.013896629,0.008282141
0.007270425,0.005488243
0.005424762,0.0028138543
0.0031461054,0.0020428943
0.0024047696,9.863515e-06
-0.00015590395,0.003841724
0.0040135677,0.0032196345
0.004184194,-0.00958206
-0.009590058,-0.010687003
-0.011128409,-0.015136136
-0.014738347,-0.0113756135
-0.0104986485,0.021430893
0.024826165,0.035861675
0.040381882,0.036074772
0.037744656,0.040126152
0.03975285,0.045065477
0.044642594,0.044059172
0.044019964,0.049758445
0.049447592,0.045491215
0.04475186,0.013566002
0.010547418,-0.0005179492
-0.004634104,-0.006648238
-0.008659806,-0.0122924615
-0.01273248,-0.008229841
-0.007973056,-0.008642274
-0.008637373,-0.011910308
-0.011666063,-0.013199217
-0.012096375,-0.014159419
-0.012681322,-0.015151275
-0.013172998,-0.0119355405
-0.009799504,-0.011469432
-0.009934157,-0.018312417
-0.017223254,-0.01765202
-0.016227014,-0.019538246
-0.018034788,-0.015551321
-0.013829516,0.007915584
0.0114084445,0.018980384
0.022979524,0.022410134
0.02432084,0.026922347
0.027336538,0.028676676
0.028587699,0.029831167
0.029343387,0.033061583
0.0332676,0.0332155
0.034207843,0.02521229
0.025410606,0.021471953
0.021120328,0.02286592
0.023032434,0.02145429
0.02160197,0.0154006155
0.014939134,0.013914207
0.013256936,0.0108556
0.010435738,0.010817522
0.010656455,0.023991277
0.024749672,0.029256789
0.029990025,0.02195733
0.02104125,0.021090258
0.01928045,0.0325863
0.032097183,0.030148175
0.030518457,0.034104362
0.03350588,0.02584493
0.024178239,-0.023158155
-0.02780679,-0.046284426
-0.050912794,-0.05032411
-0.05046452,-0.059014782
-0.055462617,-0.06726366
-0.06282822,-0.06871819
-0.06453294,-0.078546375
-0.07181074,-0.07580042
-0.0688102,-0.037953198
-0.030275574,-0.021760289
-0.012480507,-0.016893677
-0.01059953,-0.011032456
-0.0073111984,-0.0135371
-0.010392457,-0.013285695
-0.009643972,-0.008827386
-0.0054472154,-0.008134417
-0.0056797373,-0.014657412
-0.013416947,-0.016816374
-0.016285686,-0.017500626
-0.016232096,-0.01790916
-0.015388369,-0.01544351
-0.012886961,-0.01494116
-0.013237682,-0.014351643
-0.012098913,-0.014593184
-0.011995507,-0.017683676
-0.015335765,-0.018600294
-0.01621057,-0.020152535
-0.017361678,-0.020282367
-0.01762409,-0.015965588
-0.0131125655,-0.015004699
-0.011528844,-0.013577701
-0.011071313,-0.013630918
-0.012248307,-0.020755587
-0.019607645,-0.023371711
-0.02208587,-0.020375727
-0.01824286,-0.01974859
-0.016913386,-0.022945287
-0.02062816,-0.020939322
-0.019221503,-0.02228466
-0.020024644,-0.017871311
-0.014906488,0.0037768085
0.007969527,0.014105514
0.01830447,0.01974882
0.022310488,0.024583088
0.026007626,0.02232205
0.02353756,0.023543062
0.025307506,0.026132349
0.028498325,0.027920168
0.02993498,0.031451076
0.033045407,0.033506587
0.035190646,0.03172519
0.032591693,0.031791482
0.032144953,0.036419764
0.037076324,0.03573299
0.035452202,0.036642954
0.035504337,0.03331253
0.0321627,0.016164007
0.013944748,0.007366898
0.004736722,0.0047964207
0.0036280642,0.00039018228
-3.993582e-05,-0.0047714175
-0.0051166136,-0.007618762
-0.0074161356,-0.0118841585
-0.011071108,-0.013214127
-0.011744053,-0.006270213
-0.0038582385,-0.004161715
-0.001441177,-0.0047968794
-0.0023805408,-0.004812248
-0.00254212,-0.005935542
-0.003289595,-0.0068078893
-0.003842632,-0.006647779
-0.0043674987,-0.0073095523
-0.005926337,-0.010480098
-0.00954974,-0.012036699
-0.010946179,-0.0114217205
-0.009938515,-0.011745151
-0.00992384,-0.013759832
-0.012357625,-0.013612337
-0.012734871,-0.014532856
-0.012689567,-0.013365291
-0.010464555,-0.0055848137
-0.0022297741,-0.001953205
0.0013806714,-0.0009877278
0.001214706,0.0004803302
0.0016508303,0.0012210113
0.002610155,0.0015834381
0.0031972248,0.0030175473
0.003997777,0.0030475964
0.003301984,-0.0005762127
-0.0008524418,-0.0019442593
-0.0024656022,-0.002091065
-0.0018972509,-0.002389035
-0.0012871661,-0.0019291198
-0.00093594205,-0.13381349
-0.10174712,-0.00074389245
-0.0003916695,-0.0026844814
0.009381272,-0.010012155
-0.006369508,-0.012822109
-0.011311039,-0.0201062
-0.022099782,-0.021615317
-0.019744204,-0.009324691
-0.0059188926,-0.009260693
-0.005217253,0.00084528024
0.004091576,-0.0024000453
-0.0018237637,-0.044168357
-0.04627064,-0.055767164
-0.055052403,-0.07084687
-0.06595032,-0.07001604
-0.06594439,-0.013397864
-0.0057998453,0.0055575166
0.01488199,0.015066174
0.019165184,0.017409103
0.019602299,-0.018136708
-0.018823769,-0.030888626
-0.03216014,-0.031928424
-0.03141262,-0.034811094
-0.030794429,-0.028532624
-0.024338134,-0.025701795
-0.0234462,-0.032242224
-0.03177021,-0.031312298
-0.029946567,-0.017021444
-0.014447329,-0.0151462285
-0.011822775,-0.0018219976
0.0017711212,-0.0030099775
0.00057942467,-0.046826918
-0.045989174,-0.057672884
-0.055337176,-0.06854982
-0.06479635,-0.0651937
-0.0597076,-0.006739074
0.0010984145,0.01691455
0.025615985,0.021745607
0.026095599,0.027592838
0.028638905,0.022190385
0.022243625,0.019612337
0.021095473,0.015750198
0.016456578,0.011815802
0.012697668,0.0042965924
0.0048416243,-0.007956185
-0.008447846,0.007037273
0.008405708,-0.0026225478
-0.00084273453,-0.07786992
-0.07919218,-0.10045255
-0.0922368,-0.12207727
-0.09847151,-0.12020665
-0.096349835,-0.02986328
-0.018023629,0.0069115707
0.020962508,0.014744119
0.021868795,0.026338106
0.028943729,0.01996467
0.021504378,0.018978778
0.022039264,0.028442016
0.030632377,0.028719112
0.03008268,0.008172265
0.007248444,0.00036907895
-0.00057078566,0.0031226052
0.00395874,0.0023823828
0.004206195,-0.00069090474
9.982747e-05,0.0015568295
0.00050873606,-0.0013006076
-0.0018820703,0.0033618526
0.0059866677,0.030554185
0.035006177,0.043110438
0.047924623,0.04687486
0.048327073,0.05167564
0.050077565,0.052360352
0.051200535,0.052727364
0.052103672,0.056924406
0.05619561,0.056249555
0.054967046,0.044924177
0.0417321,0.040441554
0.035932317,0.03593622
0.032657743,0.033709593
0.03153466,0.040511288
0.040076237,0.040174782
0.039045673,0.040765215
0.039552562,0.03779997
0.03629316,0.020799628
0.016571369,0.013006305
0.009193018,0.012081428
0.010016029,0.009192565
0.008150844,0.008055738
0.008680561,0.009207934
0.010665644,-0.0005028098
0.0003268811,0.00038788843
0.00010062534,0.027940353
0.030124165,0.034126155
0.036259588,0.042862702
0.04289505,0.040110324
0.039442167,-0.0020341778
-0.005244864,-0.017589398
-0.020754093,-0.025919022
-0.02776563,-0.02970684
-0.029435074,-0.00830462
-0.0066732573,-0.0018745265
-0.0014794298,-0.0025780473
-0.003672702,-0.0025048738
-0.002841908,-0.0086328685
-0.008252789,-0.0115946755
-0.00895858,-0.011938063
-0.008626762,-0.013454521
-0.011681158,-0.016864546
-0.015286343,-0.01892166
-0.016444806,-0.018871196
-0.016149761,-0.019698584
-0.016963586,-0.022307599
-0.020367214,-0.022578273
-0.021567391,-0.02392682
-0.023151316,-0.023004008
-0.02280487,-0.015152881
-0.013589348,-0.011618531
-0.009137479,-0.010316089
-0.009573701,-0.008856518
-0.007813281,-0.009053788
-0.008409689,-0.008686774
-0.0076881316,-0.007755016
-0.005017001,-0.0073336377
-0.0045488514,-0.007926136
-0.0052753445,-0.008124095
-0.00598055,-0.0073175807
-0.005927408,-0.007325609
-0.0060707894,-0.008645255
-0.007025083,-0.0086762225
-0.0074469782,-0.010350267
-0.009348364,-0.010139693
-0.009709715,-0.004762013
-0.0035428016,-0.0035912367
-0.0012721716,-0.0015848144
-0.00043472974,-0.0020860184
-0.0021230911,-0.011185684
-0.012174616,-0.014424587
-0.015722426,-0.015790798
-0.0145325605,-0.016232362
-0.012178399,-0.011695605
-0.006752922,-0.0099311825
-0.0053682057,-0.009014794
-0.0063136113,-0.008109873
-0.006970544,-0.009020528
-0.0073215337,-0.008472988
-0.0061407476,-0.0075116395
-0.0053020036,-0.006405091
-0.00426717,-0.0027961915
-0.0008628633,-0.00014152996
0.0015236986,-0.0026314938
-0.0010596024,-0.002669801
-0.00068786606,0.010063537
0.012743467,0.01388347
0.016791161,-0.0014258513
-0.00019622274,-0.004972817
-0.0048601306,0.005346254
0.007192482,0.008259661
0.012146545,0.0066659003
0.009955432,0.0067512314
0.008609583,0.0067877034
0.007768418,0.0067007667
0.0066619003,0.0069363443
0.006727287,0.006742056
0.0073322407,0.0058141975
0.0069315555,0.0055315965
0.00593385,0.004188094
0.00496553,0.0038915004
0.0052685286,0.006620941
0.007908466,0.006801008
0.0086608,0.007156094
0.008936893,0.0063725184
0.007007388,0.00022433761
0.0005734178,-0.0028260115
-0.001888705,-0.000981305
0.00089799846,-0.0017105169
0.0011655203,-0.007373321
-0.005535895,-0.007640553
-0.0068988907,-0.010298885
-0.009267297,-0.008378023
-0.007063316,0.009334325
0.0124202715,0.017049657
0.020895928,0.016473904
0.018481893,0.01833375
0.018941829,0.021705236
0.022087278,0.020842751
0.021882791,0.023602473
0.024858937,0.020484913
0.021530917,0.0001683679
-0.00037995176,-0.009399929
-0.010856032,-0.01241954
-0.012577119,-0.016539048
-0.015544058,-0.018373434
-0.017196704,-0.019825663
-0.01900854,-0.023262525
-0.022074971,-0.024120191
-0.022486882,-0.017850438
-0.015307511,-0.015478377
-0.012246393,-0.017805478
-0.015520633,-0.017740333
-0.016300978,-0.013762584
-0.0119807,-0.013963754
-0.011948199,-0.012353249
-0.01036861,-0.014050232
-0.01202617,-0.028458074
-0.027278356,-0.035094384
-0.033906687,-0.0322436
-0.029882519,-0.033558197
-0.030626668,-0.04162747
-0.0391971,-0.04107534
-0.039053343,-0.045456577
-0.042152412,-0.041089796
-0.037273698,-0.008781739
-0.0031875933,0.005699047
0.011631273,0.008761553
0.012430983,0.013606832
0.015718164,0.015081313
0.016542656,0.014941389
0.016802033,0.01818419
0.01963601,0.016212177
0.016504973,0.00031012725
-0.0006826582,-0.0080328
-0.009435578,-0.008926939
-0.009141608,-0.013301752
-0.012405686,-0.022848258
-0.022497559,-0.027154714
-0.027721353,-0.031981412
-0.03156149,-0.033323538
-0.031604156,-0.024257364
-0.021578252,-0.021405432
-0.01835506,-0.019691704
-0.01719665,-0.018926019
-0.01708179,-0.024056423
-0.022205789,-0.024636535
-0.021813413,-0.025084753
-0.022133052,-0.023711888
-0.02113739,-0.01490377
-0.011704033,-0.010667735
-0.007278423,-0.009788047
-0.0069980915,-0.008043352
-0.0054459455,-0.006139923
-0.0039263195,-0.005405206
-0.003918881,-0.003957563
-0.0025343853,-0.003910769
-0.0022978466,-0.00884092
-0.007704741,-0.011218945
-0.010163597,-0.008811789
-0.0070735523,-0.009261381
-0.007334596,-0.01564491
-0.014356245,-0.016267687
-0.014994422,-0.018445231
-0.016594041,-0.016912945
-0.014685195,-0.00012180293
0.0034406898,0.007588254
0.0115855085,0.0028062845
0.0049516307,0.0040575746
0.0049678585,0.016105054
0.017962903,0.015595133
0.017742662,0.021051263
0.022085598,0.015263674
0.015197393,-0.028292917
-0.03168245,-0.048095413
-0.051105093,-0.048962027
-0.048077375,-0.055188656
-0.05065182,-0.06370523
-0.05881139,-0.063524246
-0.059363447,-0.07175477
-0.06710295,-0.06680421
-0.06018355,-0.023353131
-0.014910002,-0.0037722208
0.0059109367,0.0014487896
0.0074744998,0.008965935
0.011859803,0.010588138
0.013123341,0.011884388
0.015158612,0.018686313
0.021408116,0.018950563
0.02013479,0.0030154828
0.0024296727,-0.0030097482
-0.004679976,-0.0033253806
-0.0036311294,-0.0046427334
-0.0033341856,-0.0033127645
-0.0021823305,-0.0022777836
-0.0021094896,-0.0037930948
-0.0027606182,-0.0027523793
-0.00077447767,0.004476659
0.007062666,0.0075582047
0.01033271,0.009044384
0.010889887,0.010119965
0.011165165,0.008233053
0.00927294,0.007838512
0.009084416,0.00826356
0.008735125,0.008148639
0.007539468,0.008692049
0.0081566805,0.008964329
0.008812262,0.006076613
0.0062076165,0.0053746975
0.005993169,0.010088999
0.010984158,0.009508198
0.010270729,0.010663835
0.011410698,0.007874754
0.0087293275,-0.00834568
-0.008735881,-0.01593898
-0.016821822,-0.017924987
-0.01747958,-0.02043009
-0.019076036,-0.022802152
-0.02112019,-0.023940125
-0.022327047,-0.019761436
-0.017739806,-0.015706385
-0.013303996,-0.025038186
-0.023167253,-0.024625525
-0.022648094,0.009293954
0.0133720385,0.020142902
0.02483027,0.0005319416
0.0018326453,-0.004186259
-0.005283347,0.002619107
0.0026198581,0.0031021899
0.004610276,-0.002455327
-0.0016416963,-0.003617157
-0.0037243266,-0.0066376864
-0.0066245846,-0.0061231777
-0.006125703,0.0027799052
0.00405941,0.004149099
0.0064176954,0.014049544
0.016168306,0.0137288645
0.0152278,-0.013340976
-0.01373449,-0.01790159
-0.018490255,-0.03188163
-0.03127873,-0.028564736
-0.026636656,0.030018114
0.036324114,0.048431
0.054252055,0.060809713
0.061116476,0.06121962
0.05895036,0.011021904
0.006000748,-0.008011926
-0.013404302,-0.01163046
-0.013162716,-0.016552811
-0.015933583,-0.008773711
-0.007831674,-0.0062922337
-0.006361136,-0.00949994
-0.009762506,-0.008668424
-0.007614258,-0.00089780916
0.0014923556,0.0025092321
0.00517544,0.0037274908
0.005620794,0.005075581
0.0060584703,0.004475283
0.0057881125,0.004582405
0.0065512853,0.0059229257
0.0068822918,0.006111938
0.0057530818,0.0049124886
0.0045000454,0.005001031
0.0049539492,0.0022520926
0.002527816,0.0013407498
0.002130508,0.01044615
0.011157817,0.012643419
0.012898288,0.0018414952
0.0012837795,-0.0011966965
-0.0014313072,0.0039018227
0.0056728744,0.004586534
0.0071052946,0.0039550397
0.0056400225,0.0033519892
0.0036786036,0.00010666358
-6.765401e-05,-0.0007778413
-0.0003274938,-0.0017662572
-0.0010752826,-0.0017485946
-0.0005859463,0.00354903
0.005454489,0.0060286717
0.007420742,0.0023716018
0.0031843148,0.0025358407
0.0033633814,0.009999539
0.01126809,0.009698357
0.011524973,0.014828303
0.016218156,0.0117678605
0.012157896,-0.01615529
-0.017680855,-0.026467709
-0.02824279,-0.032218594
-0.03226041,-0.034200016
-0.03301705,-0.017956642
-0.015827505,-0.011985317
-0.010424084,-0.011560039
-0.010628199,-0.009874984
-0.008447609,-0.010099321
-0.008005953,-0.009334784
-0.006187865,-0.009445576
-0.0063183852,-0.008826698
-0.007020215,-0.005522421
-0.0037616105,-0.0048425267
-0.0026942713,-0.0038316313
-0.0019129561,-0.0044206893
-0.0023814305,-0.010743661
-0.009892544,-0.013721066
-0.013788437,-0.013635047
-0.012691598,-0.014802382
-0.013136804,-0.017203115
-0.015544083,-0.01773001
-0.01594762,-0.020059636
-0.01834103,-0.020464038
-0.01846282,-0.011382954
-0.00834673,-0.007849064
-0.004244506,-0.016690671
-0.0141918585,-0.01783851
-0.016268956,-0.006221354
-0.0035022842,-0.0050331447
-0.001912408,-0.0025333175
-0.00038549217,-0.005251289
-0.0035598672,-0.02969629
-0.029624494,-0.040635843
-0.04055522,-0.037588477
-0.0359345,-0.039450847
-0.036405332,-0.04990663
-0.0463263,-0.049457267
-0.04621518,-0.0481078
-0.043986436,-0.041600402
-0.036579456,-0.008921204
-0.0026207827,0.013115492
0.019569816,-0.0018297966
0.0010461201,0.006703749
0.0072886785,0.08268538
0.0758368,0.10279846
0.0846159,0.09175546
0.07876593,0.076180965
0.067402944,0.023639632
0.014393446,-0.026502574
-0.034177184,-0.033059977
-0.034920778,-0.05949993
-0.05693002,-0.27373958
-0.13748133,-0.34501287
-0.14655311,-0.16227613
-0.10656355,-0.084311254
-0.050126154,-0.21080968
-0.1012013,-0.1928645
-0.095988445,0.11157125
0.079167396,0.15539302
0.07665419,0.3256366
0.07689424,-0.17061219
-0.09493177,0.16532488
0.09023007,0.14740655
0.096899755,0.007817867
0.002395582,-0.06360521
-0.06743541,-0.07206192
-0.08486326,-0.069986224
-0.07848427,0.061046436
0.06848151,0.10892325
0.084448926,0.12454797
0.079181276,0.13431422
0.082594074,0.090339236
0.07440429,0.07510172
0.069578215,0.07572816
0.07398535,0.07075214
0.0670433,0.06769307
0.060600575,0.062682174
0.057041235,0.059258386
0.04877097,0.053807765
0.050853502,0.04134556
0.040086057,0.033800885
0.028167535,0.02972565
0.019849764,0.025203573
0.024572412,0.021377217
0.024707705,0.018642271
0.021793451,0.014687002
0.009507667,0.013003323
0.009993996,0.016881749
0.01552487,0.017583665
0.019150067,0.017274912
0.016368905,0.016955381
0.01604924,0.014440873
0.014191235,0.013530677
0.01775731,0.013742628
0.014292334,0.013744692
0.014473883,0.014516799
0.017234124,0.0155412285
0.01865957,0.013900674
0.017150588,0.015100122
0.016487198,0.020930607
0.020724317,0.022126386
0.023648573,0.031146225
0.028205693,0.03163963
0.029561402,0.011541917
0.01002898,0.009653857
0.0053480635,-0.0032331683
-0.0064002723,0.0005752952
-0.0012394262,0.055817857
0.05656066,0.07260326
0.07205972,0.08482691
0.07497784,0.08421652
0.072096,0.032393385
0.02857709,0.012390868
0.010932095,0.0070971427
0.005450621,0.0013017545
0.00077940634,0.010347285
0.011551925,0.01225966
0.012767712,0.00897488
0.0034962469,0.008616353
0.006276862,0.010790914
0.0063804854,0.011436171
0.010204243,0.0126037365
0.012251438,0.01297465
0.011186545,0.010493632
0.008390691,0.010539738
0.01204934,0.010055968
0.00944219,0.011155864
0.015740419,0.017822912
0.020934163,0.020892987
0.023109902,0.021776576
0.026727598,0.022928312
0.02542213,0.023196463
0.023428539,0.0233279
0.021474373,0.024070645
0.02370161,0.023930492
0.023847623,0.021382034
0.019227048,0.020056425
0.01733568,0.020507393
0.019949315,0.019727487
0.019406805,0.01766303
0.01818345,0.017308403
0.019680746,0.01306778
0.014187715,0.011527237
0.015611768,0.024183502
0.027074775,0.027429974
0.03161264,0.0118002035
0.0131317815,0.0076763374
0.005307813,0.017725423
0.016914917,0.018467022
0.017668582,0.01876522
0.018085336,0.015869936
0.015519234,0.0019708679
0.0053834612,-0.0032294982
-0.004810587,-0.013446493
-0.015239713,-0.018645482
-0.016478421,0.007097372
0.0127929505,0.013287759
0.022512058,-0.02179286
-0.020286283,-0.030441329
-0.0305546,-0.006964329
-0.0029132979,-0.0009404746
0.008487231,-0.0017680923
0.0041786633,-0.0013824977
0.00024828842,-0.008719806
-0.010298419,-0.009590777
-0.0075063077,-0.009456587
-0.008944131,-0.0077433176
-0.008284953,0.0060536745
0.0064503183,0.014318381
0.017029488,0.003923614
0.0069723027,0.004540657
0.006047485,0.03867071
0.043344915,0.044640202
0.05193238,0.03229842
0.036375888,0.022222267
0.02216582,-0.013522878
-0.0159339,-0.026398204
-0.024549102,-0.04107672
-0.04029874,-0.043287065
-0.041936852,-0.00041174438
0.008176884,0.015304733
0.024178447,0.011582518
0.017055454,0.013930264
0.014634393,0.014380086
0.014646067,0.0093983235
0.011679957,0.02216194
0.026300175,0.01663952
0.01785658,-0.037242565
-0.040290255,-0.054492246
-0.057860605,-0.06874938
-0.068124205,-0.06964834
-0.06442617,-0.016275486
-0.0076660905,0.0039681145
0.011545504,0.0051918784
0.0086461445,0.009540312
0.010755752,0.004555338
0.005916495,0.00083243474
0.004164552,0.0055198977
0.009316623,0.0021516224
0.0038728921,-0.022546846
-0.022879496,-0.033676103
-0.034489483,-0.03328615
-0.031870075,-0.0363092
-0.032504506,-0.04169078
-0.03877588,-0.0408494
-0.039322346,-0.04528523
-0.041929662,-0.041060664
-0.03613508,-0.011621513
-0.0053214445,0.002072485
0.008973382,0.0071019595
0.012008419,0.01307122
0.015749313,0.013617613
0.015161736,0.015351757
0.018298004,0.020651218
0.023596408,0.022281907
0.024106834,0.016294066
0.016776657,0.0151923355
0.0140034985,0.014707188
0.0140432045,0.015360245
0.01637638,0.021617612
0.023565724,0.023833921
0.025555324,0.025169166
0.026710544,0.025421716
0.026275031,0.021416442
0.02130614,0.02000183
0.020488609,0.018608551
0.019395035,0.017989904
0.017959334,0.020494089
0.020062862,0.020349577
0.019129312,0.021158384
0.020301746,0.019991968
0.019983975,0.01276614
0.012383642,0.009938752
0.009626443,0.007201283
0.007094191,0.0063952273
0.0058798,0.0113405185
0.012028994,0.0120275235
0.01391027,0.0156222
0.017157031,0.015428601
0.016637664,0.0036130282
0.0033820556,0.001345108
-0.00023073118,-0.0020362423
-0.0023413298,-0.00019612336
0.0011956835,0.019678628
0.02296175,0.027644677
0.031369388,0.031439606
0.03323548,0.033906404
0.033699006,0.027430203
0.02672749,0.025968798
0.026382482,0.026385818
0.027397292,0.026622312
0.027619718,0.029414147
0.03012368,0.030225707
0.029814329,0.030554643
0.029843235,0.03021722
0.029898744,0.028035548
0.027272845,0.026959738
0.025610123,0.024523448
0.023232993,0.023318725
0.021993065,0.025939895
0.024845337,0.024987034
0.024756432,0.024789535
0.025214862,0.022313105
0.022286821,0.011634588
0.010395447,0.0060637672
0.0044865175,0.004633787
0.0043646446,0.0020045873
0.0033823114,-0.0015616466
-0.00043038712,-0.0030925558
-0.00306308,-0.005323545
-0.005812099,-0.0057270317
-0.0064841793,0.000820048
0.0014669171,0.0038841602
0.005646127,-0.00011996786
0.0010929551,0.00041335006
0.00076131045,0.009473332
0.009732153,0.009856862
0.01045786,0.015942192
0.016760062,0.013467826
0.014872725,-0.016432386
-0.016633466,-0.027157236
-0.028545255,-0.029732302
-0.029106976,-0.03058171
-0.028372249,-0.017367125
-0.013773966,-0.009753639
-0.006037554,-0.010682186
-0.008149506,-0.005717627
-0.003842004,0.01282188
0.015424355,0.022030963
0.025307586,0.023279728
0.02491944,0.025937144
0.026012357,0.031112276
0.031085718,0.031537324
0.031460546,0.027728861
0.02738933,0.023403367
0.023234125,0.015174902
0.014775823,0.004383529
0.0038333766,0.0051934845
0.0051906644,0.00023695373
0.00019662186,-0.057720598
-0.061729085,-0.07556622
-0.076898,-0.020993458
-0.017447963,-0.0071138875
0.0019921416,-0.027952282
-0.024111165,-0.02969147
-0.030428555,-0.03443972
-0.033930253,-0.036236946
-0.03359858,7.890812e-05
0.006155628,0.0084814755
0.015984848,-0.033164345
-0.031818777,-0.046024304
-0.048058562,-0.033651557
-0.032258697,-0.033134297
-0.026731845,-0.036211483
-0.03130745,-0.03773299
-0.035646316,-0.043399002
-0.04041245,-0.042602353
-0.039010867,-0.045696285
-0.04139136,-0.04161623
-0.036001917,-0.015693769
-0.009216102,-0.0033707987
0.0013248198,0.00092877605
0.004727058,0.0066197943
0.010992216,0.007982794
0.011101159,0.009554534
0.0118470825,0.017772906
0.020313302,0.019217566
0.021226425,0.0075205853
0.0082153315,0.006821423
0.0075149466,-0.003138662
-0.0023208305,-0.0015286154
-0.0008676376,0.03523752
0.039333533,0.044136703
0.048855502,0.052445453
0.053273465,0.048754893
0.047949027,0.00066200236
-0.003522507,-0.019598344
-0.023788415,-0.026583089
-0.027344313,-0.033984166
-0.032740425,-0.028576665
-0.026420955,-0.02871957
-0.026594417,-0.03356095
-0.031647418,-0.035071675
-0.032609656,-0.032647315
-0.029976357,-0.03242206
-0.029223258,-0.03133776
-0.027684927,-0.031321704
-0.027655838,-0.035477456
-0.031356197,-0.03576212
-0.031080846,-0.03670535
-0.033131532,-0.03519302
-0.032873306,-0.025228346
-0.022253014,-0.020479407
-0.017064687,-0.018953545
-0.016100246,-0.016838854
-0.01350064,-0.015791487
-0.012229293,-0.014975796
-0.012112438,-0.013003781
-0.009595396,-0.012460601
-0.008541837,-0.015752949
-0.01226886,-0.016775545
-0.013154459,-0.015874982
-0.012310379,-0.015668306
-0.013043934,-0.016047249
-0.01416043,-0.015413002
-0.0135007845,-0.015554074
-0.013449659,-0.014502347
-0.011959998,-0.009462551
-0.007086511,-0.00688955
-0.005316293,-0.0067553604
-0.005531125,-0.0057148742
-0.0041825967,-0.0035499476
-0.0018768085,-0.0031170999
-0.0008091263,-0.001590549
0.00091007934,-0.001969721
-9.500173e-05,-0.008354167
-0.007432168,-0.010988413
-0.01025999,-0.010892531
-0.008879699,-0.011499481
-0.008802013,-0.011994492
-0.010508986,-0.011591464
-0.0112154195,-0.0125766685
-0.011932159,-0.011677254
-0.010647104,-0.0056965235
-0.0037136683,-0.0030650296
-0.00017451608,-0.0015510949
0.00014902835,-0.0004587681
-9.7242984e-05,-0.0019848603
-0.0011676041,-0.0020018346
-0.0004686405,-0.0016343613
-0.00017125916,-0.0012762928
0.0006929579,0.00064388104
0.002408152,0.0015634816
0.0021097981,0.00032664288
0.00076704536,0.00023190728
0.0010766989,0.0026278237
0.00397031,0.002250028
0.0034443254,0.0030145652
0.0038437976,0.0014068123
0.002306986,-0.007986005
-0.0076755593,-0.012453948
-0.012171328,-0.013635047
-0.012523743,-0.0154547505
-0.0139391925,-0.016651906
-0.014758222,-0.017163662
-0.015025637,-0.018723244
-0.016624,-0.018678972
-0.016696671,-0.014091062
-0.011786745,-0.012056196
-0.00904913,-0.012536756
-0.010208539,-0.011868331
-0.01093886,-0.009809609
-0.008680238,-0.009484571
-0.0077111656,-0.007832777
-0.006031957,-0.008079824
-0.006433369,-0.0147065
-0.01397367,-0.017120307
-0.017125947,-0.01627457
-0.015512106,-0.01613648
-0.013926102,-0.016046561
-0.013615202,-0.014558547
-0.012663634,-0.014277551
-0.01250316,-0.011814884
-0.010147665,-0.003313682
-0.0010136148,0.0016460599
0.0044446164,0.0044576204
0.0064416667,0.0077148736
0.008761297,0.010684709
0.011367285,0.01352563
0.014231777,0.015646974
0.016207244,0.017599033
0.017775383,0.021595592
0.02147903,0.024146112
0.023681367,0.020495465
0.01976445,0.020525284
0.019885171,0.029455895
0.02961757,0.02890629
0.029449072,0.03194517
0.03210047,0.027237061
0.02686016,-0.0028361045
-0.0055260677,-0.016695488
-0.020313708,-0.02058676
-0.02192318,-0.025960311
-0.025351858,-0.027512552
-0.026044443,-0.028304616
-0.026721513,-0.032904685
-0.031405795,-0.032483533
-0.03080445,-0.01976052
-0.016561167,-0.0143672405
-0.010141166,-0.012383069
-0.009330547,-0.010135334
-0.008318153,-0.011016628
-0.00950326,-0.010217224
-0.008527988,-0.008742056
-0.00671678,-0.007266428
-0.004919331,-0.00559743
-0.003217902,-0.0044236714
-0.002441002,-0.0007725655
0.0009382038,0.00072301854
0.0024057196,-0.0032042658
-0.0021306176,-0.0022837475
-0.0015280971,-0.0030040136
-0.0016121927,-0.00038651214
0.0014439623,0.014621168
0.017279567,0.021505214
0.024197299,0.021754554
0.022990454,0.023676563
0.02387971,0.02645211
0.026483769,0.025911452
0.026110753,0.027803412
0.027611135,0.025214583
0.024466977,0.009653169
0.00794899,0.0017777263
-0.00034208887,-0.0006560384
-0.0015838661,-0.004683793
-0.004716016,-0.009091407
-0.009102635,-0.011897004
-0.0120125115,-0.015594216
-0.015232307,-0.017230641
-0.016121468,-0.013260233
-0.011438181,-0.012451196
-0.010358562,-0.013268032
-0.011502537,-0.013663261
-0.012201372,-0.015074432
-0.013357682,-0.015980728
-0.013799595,-0.015683446
-0.01351011,-0.016138315
-0.014323334,-0.018258054
-0.016689343,-0.018782884
-0.016927637,-0.019701108
-0.017738864,-0.01949168
-0.017381681,-0.015593069
-0.013169029,-0.01404702
-0.012046801,-0.013586418
-0.0117429895,-0.0125576295
-0.010329345,-0.014803071
-0.012911866,-0.01608785
-0.014172309,-0.0062975097
-0.003731139,-0.003676797
-0.0008960212,-0.023864888
-0.022449465,-0.024941845
-0.023681363,-0.015496728
-0.012243577,-0.0061754775
-0.0020572653,0.024439953
0.028626934,0.039944023
0.043473918,0.043167327
0.044963963,0.048742507
0.049499944,0.054085776
0.054789994,0.053356566
0.05407672,0.05985364
0.05903227,0.05528867
0.05372684,0.021367813
0.01707212,0.006197957
0.00103743,-0.002393393
-0.0054995227,-0.009409564
-0.010878651,-0.0033776802
-0.0033374117,-0.0052019716
-0.0052777664,-0.008699161
-0.008872189,-0.0128984945
-0.012485548,-0.025429975
-0.02526226,-0.032404855
-0.031777024,-0.03248032
-0.031006029,-0.035351522
-0.033256095,-0.042397514
-0.039601684,-0.043078326
-0.03991487,-0.049253114
-0.045814645,-0.04800825
-0.044711173,-0.019879797
-0.015661336,-0.008596397
-0.0033788534,-0.017072367
-0.014287284,-0.016077757
-0.01435948,-0.006903772
-0.003930626,-0.0039045752
-7.465509e-05,-0.0017534117
0.0016033254,-0.0011494434
0.0014745754,-0.010527581
-0.009000423,-0.014624839
-0.013763203,-0.007272621
-0.005004326,-0.005159306
-0.0016848254,-0.023190498
-0.021630313,-0.02543938
-0.025419496,-0.0040110094
-0.0013169856,0.005374927
0.009719155,0.00841266
0.011337633,0.013224679
0.014855815,0.019660736
0.020990955,0.023893561
0.025041938,0.024863854
0.025710333,0.026636994
0.027874153,0.029401071
0.030269073,0.03086156
0.030705966,0.029947234
0.029591378,0.029864198
0.029478248,0.031083373
0.03017598,0.031276744
0.030045923,0.029127415
0.028202219,0.028420683
0.027562642,0.02923064
0.028589157,0.028852385
0.028480707,0.029592607
0.029122425,0.031098055
0.030502278,0.021731844
0.02057966,0.02147264
0.02056108,0.042174093
0.042825885,0.043192327
0.043426346,0.055004
0.053492047,0.049927503
0.048321836,-0.012783573
-0.018271342,-0.035616234
-0.041104596,-0.035151042
-0.03601433,-0.031257708
-0.028991036,-0.02547654
-0.022343036,-0.016895512
-0.014836363,0.050783794
0.05483651,0.07300721
0.07042499,0.02851152
0.027802378,0.015220091
0.010734459,0.031458646
0.030875698,0.029711887
0.03216687,0.001890354
0.0026573583,-0.006946437
-0.007823542,-0.013972241
-0.014886408,-0.014880602
-0.016244832,0.011029932
0.013188662,0.020152995
0.024299901,0.018257136
0.020116966,0.018736778
0.018509783,0.016416786
0.01632673,0.012233281
0.012359658,0.0145619875
0.014713233,0.009244636
0.009901217,-0.014792978
-0.015263669,-0.025693078
-0.02760391,-0.03618694
-0.037040703,-0.041401297
-0.039824933,-0.029624263
-0.026724156,-0.03045899
-0.028446008,-0.024286725
-0.021797463,-0.027826121
-0.025280183,-0.06486889
-0.0637455,-0.0761672
-0.07335833,-0.08167357
-0.07560484,-0.08179308
-0.07437596,-0.04325197
-0.033640664,-0.022744346
-0.012692455,-0.05116113
-0.046252005,-0.057182692
-0.055482306,0.04033604
0.046336792,0.06372358
0.06805442,-0.062142204
-0.06304694,-0.09775454
-0.091805585,-0.038962256
-0.037150443,-0.022037156
-0.010838411,-0.043681607
-0.036273897,-0.040645935
-0.03857739,0.0006675076
0.004057608,0.018706957
0.023619445,0.020258741
0.024478672,0.026170427
0.030004652,0.031641696
0.0338537,0.032367006
0.031942688,0.038982213
0.040168606,0.036818665
0.039185233,0.010400502
0.008650123,-0.00082211243
-0.004065039,-0.0038348425
-0.004521983,-0.007729325
-0.0078209555,-0.006370454
