Predicted,Actual
-0.12731792,-0.18141605
-0.13069743,-0.16091774
-0.12204588,-0.15273026
-0.11747335,-0.11798442
-0.10091543,-0.10411977
-0.08851645,-0.1523219
-0.116199985,-0.14014265
-0.111385874,-0.15174095
-0.11683248,-0.112875104
-0.093373135,0.08942083
0.104313806,0.18189149
0.1528311,0.2287069
0.16805398,0.2631732
0.1776037,0.23229203
0.1700167,0.23443674
0.1640183,0.23088068
0.15841123,0.23421392
0.15398277,0.28110102
0.16419598,0.2837655
0.15621169,0.279295
0.16166249,0.25763193
0.15702422,0.17614537
0.11460583,0.12626015
0.08443032,0.1081016
0.07271308,0.074543126
0.051727526,0.004468638
-0.012332378,-0.04049195
-0.049149986,-0.0441764
-0.040910505,-0.06688405
-0.06113351,-0.1302843
-0.116975136,-0.14639601
-0.1255766,-0.18059717
-0.13831815,-0.17393142
-0.13326266,-0.02650365
-0.010617606,0.037797954
0.051691882,0.03257953
0.033890363,0.050400537
0.044251215,0.08480941
0.07892016,0.084795594
0.07948913,0.11033239
0.1025418,0.09488367
0.084613286,-0.05290784
-0.07509353,-0.12041932
-0.13137127,-0.10647075
-0.10788827,-0.12572138
-0.11078052,-0.18649183
-0.14196308,-0.18735792
-0.14281128,-0.23872833
-0.14972834,-0.21386302
-0.13772817,0.049532
0.06945267,0.15592647
0.14014722,0.18887764
0.15170875,0.21429153
0.1664369,0.15107653
0.12814176,0.124152854
0.105108425,0.1402912
0.11470723,0.12554923
0.101873964,0.04875155
0.031431038,0.01134454
0.0014348027,0.011547208
0.0067652357,-0.0023537178
0.00029117207,-0.03239183
-0.03411594,-0.036634915
-0.04031489,-0.06124229
-0.06283167,-0.05393025
-0.045734283,0.05014461
0.0556111,0.090618424
0.08880752,0.099072054
0.09492633,0.10740464
0.10230022,0.08578964
0.08236222,0.07398306
0.07019934,0.07975666
0.07374503,-0.1881611
-0.13321702,-0.052856453
-0.06684548,-0.049922798
-0.040578224,-0.002809434
-0.004414407,0.01843664
0.022252843,0.004484903
0.002224301,0.007685136
0.0044124206,0.041189052
0.037069242,0.039707042
0.029257623,0.05469515
0.04384011,0.038864125
0.027883207,-0.08136419
-0.10864925,-0.1367399
-0.13883978,-0.13776359
-0.1345386,-0.15538783
-0.13125254,-0.18472813
-0.13506323,-0.18556759
-0.13198678,-0.20906259
-0.13506657,-0.19414645
-0.12638435,-0.057629094
-0.03925386,0.008048299
0.025933953,0.015412303
0.025115063,0.041472472
0.05219822,0.07983885
0.08905716,0.09075632
0.09557622,0.11966076
0.10636012,0.11504141
0.09364334,0.015275847
0.0026787142,-0.025106851
-0.03545106,-0.03267424
-0.04085637,-0.04505602
-0.051269934,-0.03961391
-0.04309943,-0.037689712
-0.04186152,-0.04845043
-0.045446537,-0.046676792
-0.03830012,-0.014945935
-0.009113791,-0.0016607874
0.0042063706,-0.00030198751
0.004624739,0.0037133812
0.009338996,0.004088203
0.009777722,0.0029107681
0.0075026783,0.01012709
0.009525634,0.008095655
0.007465594,-0.015005238
-0.011386609,-0.022162113
-0.02036406,-0.03420131
-0.03634374,-0.035639565
-0.03463923,-0.004594586
0.0007939052,0.0014912253
0.008748908,0.013621969
0.022173418,0.01211966
0.020313026,-0.045013126
-0.04826085,-0.06469054
-0.069598556,-0.05369131
-0.05329795,-0.049172148
-0.045810618,-0.047370296
-0.040341705,-0.029948872
-0.02436815,-0.021385841
-0.021270458,0.009258119
0.0060289125,0.09082973
0.09083164,0.14105393
0.12820677,0.19679712
0.1649399,0.22652447
0.17573804,0.24472173
0.18543878,0.24100979
0.18611766,0.2240756
0.17608081,0.19770712
0.15523815,0.11378236
0.09100553,0.0717763
0.046547543,0.042158205
0.022632888,0.019738728
0.0035960036,0.032699
0.018441187,0.025230208
0.008678775,0.012674119
-0.0052949525,-0.0009223718
-0.013142331,-0.03201701
-0.037553504,-0.0504656
-0.05378277,-0.059460018
-0.060163915,-0.06965375
-0.06529872,-0.07812984
-0.06748051,-0.08286592
-0.070835665,-0.09223919
-0.079776354,-0.09347723
-0.084917136,-0.07546751
-0.0678197,-0.06890598
-0.059562925,-0.061044805
-0.05441708,-0.057319764
-0.0519643,-0.07094188
-0.06783111,-0.070028864
-0.0708202,-0.07084285
-0.068452,0.5348697
0.12666902,-0.02821093
-0.03584281,-0.0111614475
-0.036498066,0.11139554
0.111026876,0.16557941
0.1345895,0.15920211
0.13025613,0.17181075
0.12463439,0.20274201
0.14610045,0.19741419
0.14642194,0.21390231
0.13892901,0.19072916
0.13331468,0.047756348
0.027256412,-0.020377968
-0.04762345,-0.028441235
-0.04659201,-0.05647872
-0.06772362,-0.10007576
-0.107921645,-0.11419087
-0.11415547,-0.1487562
-0.12946796,-0.1464235
-0.12673055,-0.035391986
-0.026841797,0.009137785
0.018007908,0.024894394
0.030101227,0.039222248
0.037161212,0.016388364
0.011686406,0.013241245
0.008444578,0.01992182
0.015671985,0.022772998
0.015509877,0.03133833
0.025089785,0.036009636
0.03235539,0.030024007
0.02715937,0.029886976
0.029811138,0.043352626
0.042762876,0.04196144
0.034640037,0.045706343
0.03961975,0.037688274
0.03864761,-0.009600842
-0.011406385,-0.032430407
-0.03362394,-0.03704975
-0.039062403,-0.04653947
-0.046963334,-0.057107307
-0.06607947,-0.06089093
-0.06944128,-0.070376046
-0.07081138,-0.0703248
-0.07717179,-0.039241247
-0.045534432,-0.025489446
-0.020327503,-0.03298357
-0.025422864,-0.029996946
-0.025356902,-0.010229863
-0.003907793,-0.009540675
-0.008367993,0.0017349168
0.002407886,-0.004737519
-0.00124503,-0.072486795
-0.06984939,-0.10148436
-0.10489175,-0.097428545
-0.088815406,-0.10311751
-0.09324493,-0.11460484
-0.10366864,-0.1082333
-0.09902523,-0.12024976
-0.10976248,-0.1038945
-0.09150905,-0.008320202
0.008318342,0.03611975
0.046691135,0.06490054
0.06384437,0.086100124
0.072420485,0.0645463
0.05585632,0.06910073
0.058166407,0.0797463
0.0685374,0.09142017
0.076399155,0.1317476
0.09786755,0.15390135
0.10867682,0.1381698
0.10526342,0.14316656
0.10880873,0.19262429
0.12923738,0.19365461
0.14428362,0.208965
0.14570808,0.1898943
0.13871703,0.05179302
0.02775399,-0.011502874
-0.03483987,-0.0031646795
-0.016059754,-0.020172132
-0.028556773,-0.07904919
-0.0930908,-0.08652677
-0.09087044,-0.085855715
-0.09058244,-0.074838206
-0.072233126,0.091287024
0.09952015,0.19426592
0.15466945,-0.041110605
-0.057293527,-0.023516018
-0.038701817,0.50331056
0.1874794,0.88580483
0.18753521,0.32182643
0.1983127,0.3284651
0.16511054,0.061072297
0.028572889,0.047841847
0.016722756,-0.00802095
-0.0253933,-0.038605176
-0.06028839,-0.0759834
-0.0925513,-0.09753146
-0.10873522,-0.09280445
-0.097112,-0.08545772
-0.08955634,-0.110408105
-0.10847506,-0.09947639
-0.10520556,0.0021028293
0.0067673344,0.044418074
0.055662114,0.065809816
0.06756546,0.080204606
0.08020466,0.049786918
0.04869112,0.044571802
0.041951854,0.04865511
0.041192167,0.051258568
0.05058524,0.068490714
0.06413318,0.07527118
0.063431986,0.06968211
0.058334168,0.06842925
0.06485264,0.0746174
0.06801437,0.071703754
0.06447897,0.06657573
0.0565493,0.058260415
0.048251547,0.03278177
0.027507829,0.013264133
0.006497461,0.019641567
0.012976212,0.0069343415
-0.0031003428,-0.05190155
-0.05361885,-0.07150195
-0.06262062,-0.093052745
-0.086317904,-0.09371516
-0.07847404,-0.022653814
-0.01258994,0.0042396286
0.0066345786,0.016246583
0.019480966,0.024649551
0.032073397,0.0009927588
0.0057696216,-0.0023220507
-0.0012502922,-7.297792e-05
-0.0008923435,0.0039045345
0.0031767455,0.028489312
0.02705861,0.040871233
0.043124177,0.03359359
0.031390447,0.03645456
0.0293016,0.059360843
0.060417965,0.060213692
0.06507275,0.06897752
0.06812353,0.060622625
0.047709502,-0.008086731
-0.012181061,-0.039683722
-0.042147692,-0.03478715
-0.03133426,-0.04386721
-0.046109375,-0.0706301
-0.08062511,-0.07149115
-0.07828628,-0.08850293
-0.08675582,-0.07748758
-0.071563095,0.02523942
0.030036692,0.07109359
0.06826292,0.07086041
0.058059298,0.0838417
0.06628237,0.10553341
0.08367044,0.105182916
0.09009407,0.116666645
0.09412542,0.103923
0.08932831,0.015089156
-0.0040897545,-0.030162623
-0.05437977,-0.02754535
-0.035252705,-0.044130336
-0.042937547,-0.108112395
-0.10952354,-0.13078578
-0.11656812,-0.10759493
-0.09267948,-0.09866485
-0.0738857,-0.078789376
-0.056184128,-0.06392232
-0.049252577,-0.055716984
-0.04984003,-0.04343352
-0.042612642,-0.0237564
-0.021740971,-0.009072148
-0.0029812234,0.0013327466
0.003721875,0.011961757
0.011346948,0.025321899
0.026182292,0.03576537
0.038988806,0.035860658
0.03667567,0.04116271
0.0368996,0.05972199
0.053176407,0.06284781
0.055040643,0.07107013
0.063168176,-0.3420554
-0.15180552,-0.08166575
-0.08793444,-0.07061801
-0.054688446,-0.09225906
-0.0905717,-0.08844924
-0.07414742,-0.004720678
0.0035496873,0.05824775
0.07362487,-0.052671056
-0.050668873,-0.072355375
-0.080365896,0.36644587
0.20307074,0.44836035
0.19786033,-0.00045254946
-0.02571176,-0.15861009
-0.14163199,-0.08686834
-0.08836948,-0.119070455
-0.09924632,-0.25220016
-0.15285519,-0.28470427
-0.16083677,-0.3630788
-0.16405997,-0.32921
-0.16213366,-0.066309005
-0.04108706,0.1769903
0.11027072,0.1975233
0.09496658,0.39390516
0.14070682,-0.078750655
-0.05023425,-0.17349125
-0.113611616,0.349057
0.14723846,0.46821767
0.13929935,0.14360744
0.092805125,0.059221942
0.014207253,0.10349895
0.06848308,0.10007446
0.07424308,0.109014906
0.08346724,0.10334306
0.06592648,0.105922624
0.0734206,0.092972286
0.060206454,0.04093917
0.02977234,0.017411783
0.008976893,-0.015694283
-0.027791252,-0.035169743
-0.06377034,0.018184312
0.012891358,0.022290075
0.018069,-0.04333003
-0.059072703,-0.11201218
-0.12052781,-0.01639182
-0.011012843,-0.016117468
-0.007222045,-0.55831057
-0.20198078,-0.7463833
-0.21729459,-0.17808382
-0.09623592,-0.0024531807
0.040200356,-0.34480685
-0.16482945,-0.3970717
-0.16928257,-0.102488205
-0.06656018,-0.00035582134
0.030737936,0.005997432
0.02289593,0.027470931
0.03281616,-0.020857867
-0.016273746,-0.028602306
-0.02049055,-0.021208506
-0.016399998,-0.0139278425
-0.010706553,0.017201342
0.026049523,0.031922873
0.040367957,0.039307605
0.050190274,0.045858633
0.040716276,0.04065302
0.036533993,0.03982205
0.031598955,0.050447606
0.03927297,0.048761915
0.029068958,0.04093687
0.02528734,0.04599998
0.03204105,-0.014991133
-0.018842962,-0.03443003
-0.042393897,0.13997827
0.100972615,0.17295796
0.124955446,-0.010810807
-0.012569434,-0.075001
-0.07624568,-0.046554442
-0.051213685,-0.053475685
-0.05767032,-0.10205451
-0.10679757,-0.11769654
-0.10839161,-0.07510205
-0.059196275,-0.06670513
-0.057991866,-0.06991803
-0.053285223,-0.07370007
-0.051923778,-0.10438318
-0.09763515,-0.118486054
-0.11259273,-0.11172185
-0.09533599,-0.11364418
-0.08951427,-0.13045716
-0.10797335,-0.12780146
-0.11817851,-0.13544673
-0.111784436,0.15407813
0.103473544,0.023874719
0.03055119,0.020198762
0.018412082,-0.02829859
-0.03228188,-0.046710473
-0.050328523,-0.04451106
-0.051510613,-0.045518644
-0.05430976,-0.040214
-0.037714083,-0.029795142
-0.02661402,-0.03310765
-0.034214873,-0.019808251
-0.027543897,0.039856452
0.04192871,0.06957746
0.07702035,0.07952823
0.08164511,0.092266396
0.085480645,0.10171279
0.0997566,0.10700305
0.11016913,0.11124987
0.11017524,0.11170083
0.098852046,0.097625166
0.09024951,0.08650719
0.073277645,0.10094372
0.08898218,0.09687667
0.0824147,0.034595564
0.02454403,0.015829874
-4.054439e-05,0.037786298
0.028533535,0.060600314
0.05042063,0.04001493
0.026859714,0.054310974
0.03984726,0.22609293
0.13165496,0.27782765
0.13534237,0.18880986
0.12685223,0.14986382
0.10881961,0.19282104
0.12902999,0.17418131
0.11914981,-0.0005117091
-0.012694998,-0.07895275
-0.09553497,-0.016664587
-0.029246135,-0.03035392
-0.03261169,-0.1488466
-0.1305535,-0.18709782
-0.15718213,-0.21345422
-0.16145898,-0.21302153
-0.14772896,-0.09031744
-0.0770087,-0.0322548
-0.0092670005,-0.04065676
-0.026358316,-0.018068727
-0.009066863,0.048522975
0.060847998,0.06718272
0.07349045,0.09963112
0.07959519,0.09456167
0.05967554,-0.027414938
-0.047327682,-0.076368295
-0.09201886,-0.08654879
-0.091844305,-0.10095365
-0.09792767,-0.088974044
-0.0850121,-0.08439918
-0.084453754,-0.09416786
-0.09563198,-0.09027109
-0.086054705,-0.057205476
-0.04402283,-0.040929817
-0.028627004,-0.03440225
-0.033045918,-0.025850303
-0.023529556,-0.020507947
-0.015384649,-0.014615304
-0.011201702,-0.008344816
-0.0050310884,-0.0024141727
-0.0007660309,-0.0011967227
-0.00068299676,0.000555611
0.0010326782,0.01848846
0.016869925,0.02445811
0.023396613,-0.0031060956
-0.0055727917,-0.0023279523
-0.0018962728,0.0046812384
0.0080103725,0.020450803
0.024227075,0.0755582
0.069728136,0.111284845
0.09342653,0.116931066
0.09928169,0.17836149
0.12813826,0.14647028
0.10799339,-0.039489113
-0.053463247,0.9206088
0.17410761,-0.14053027
-0.11653277,-0.14014438
-0.13782091,-0.35407865
-0.15514828,0.017531253
0.023752136,0.09931445
0.10516069,-0.023182075
-0.032073826,-0.045989186
-0.047773283,0.017212857
0.017658424,0.95011234
0.11659363,0.07126344
0.036289673,0.060087744
0.005054826,-0.009034724
-0.027371159,-0.03973957
-0.054259542,-0.058974076
-0.061188538,-0.07277036
-0.08007133,-0.054265775
-0.064409494,-0.055254217
-0.06619339,-0.05988522
-0.05541886,-0.06624437
-0.06777295,-0.09691885
-0.10457806,-0.11245149
-0.10341752,-0.100600995
-0.09054018,-0.10222695
-0.09209594,-0.13207635
-0.111260794,-0.12937345
-0.09157354,-0.14217019
-0.11622782,-0.12413645
-0.10192878,-0.0064322767
0.010997054,0.048540823
0.062467307,0.0673104
0.07372682,0.09058071
0.08393572,0.089377224
0.07620305,0.091227144
0.07936153,0.12684497
0.11563983,0.12972912
0.10744199,0.06698869
0.052794036,0.04450113
0.026866755,0.04124548
0.03899556,0.03593824
0.030204877,0.04684218
0.03836622,0.050043132
0.042456344,0.04468523
0.038895234,0.045189165
0.036999572,0.0520773
0.0474085,0.05241614
0.048519313,0.06415234
0.060044196,0.064232945
0.058256224,0.032433286
0.018197516,0.027396226
0.025229983,0.019158935
0.024540875,0.023464488
0.027419567,0.08586118
0.07389527,0.112909794
0.09395836,0.08856266
0.083811365,0.08985467
0.07718012,0.1382039
0.12908795,0.13239576
0.09573158,0.15004447
0.12135994,0.12218764
0.10615603,-0.057450607
-0.07154243,-0.14167173
-0.13121077,-0.14833589
-0.13469256,-0.17879662
-0.13887344,-0.22350156
-0.14895707,-0.22983898
-0.13848373,-0.27280772
-0.15687586,-0.25876415
-0.15848744,-0.06667058
-0.04037261,0.019185131
0.04203434,0.033229135
0.045580488,0.06233768
0.060385384,0.07646013
0.075029254,0.07787305
0.07114391,0.106975265
0.094838485,0.09930078
0.09235257,-0.0070553957
-0.02790109,-0.052121203
-0.07678842,-0.05576607
-0.065131135,-0.06949599
-0.08029058,-0.07817706
-0.08067361,-0.07725094
-0.06509649,-0.09339087
-0.085406676,-0.086865745
-0.08275108,-0.0143698845
0.004886813,0.017751195
0.028917715,0.019400466
0.028277418,0.029357562
0.025809273,0.040474243
0.035120226,0.040310152
0.03005333,0.052878477
0.04332176,0.046759125
0.041717846,-0.013574757
-0.015802128,-0.039944686
-0.03981144,-0.043163776
-0.047678445,-0.05164836
-0.049658347,-0.056932565
-0.054586127,-0.056639213
-0.050281394,-0.06587243
