Predicted,Actual
0.004558636,-0.019309428
-0.009209075,-0.0044459086
0.005279593,0.00034456156
0.010075099,0.031329907
0.0349015,0.07570265
0.0718007,0.055802546
0.061600782,0.0038345603
0.0059178104,0.030844823
0.026498793,0.01593697
0.017266577,0.011735242
0.015640235,-0.039924093
-0.026151216,-0.03459215
-0.023071082,-0.016516035
-0.009280896,-0.028583905
-0.02093999,-0.0034387072
-0.00024266538,0.0006821681
0.0040439386,-0.04970286
-0.036183912,-0.026419882
-0.023072356,-0.0040482623
-0.0037727184,0.021105431
0.021549923,0.011812669
0.017672226,0.028020268
0.028068434,0.012116813
0.009245421,-0.008330503
-0.0042739725,-0.0041675773
-0.004585449,0.00954019
0.01229172,-0.0083631305
-0.003043748,0.0015022014
0.00024393167,-0.0042600427
-0.0006121445,0.022340469
0.019803038,0.010537953
0.013243326,-0.02636913
-0.015206345,-0.070017464
-0.045526557,-0.07271148
-0.05374309,-0.034215275
-0.025720365,-0.047034714
-0.035141297,-0.06634126
-0.046538368,-0.080772154
-0.0583996,-0.10987267
-0.08026149,-0.100538306
-0.077940464,-0.08019657
-0.062438015,-0.06322095
-0.049331125,-0.010159409
-0.008198301,-0.027711995
-0.019510051,-0.07319845
-0.051693346,-0.026334116
-0.013596016,0.02239306
0.024802007,-0.0029184322
0.0037165224,-0.014896895
-0.010542219,-0.052724995
-0.03773215,-0.016899645
-0.008354956,-0.060881358
-0.039226715,-0.03349006
-0.023234596,-0.005959169
-0.0005279413,-0.07015293
-0.048155066,-0.055186033
-0.040664054,-0.002717144
-0.0052637854,0.0029759854
0.004907236,0.0090129785
0.011359316,0.096861996
0.07469488,0.11299132
0.08687747,0.1047498
0.08915978,0.084736146
0.07744068,0.1343449
0.10263209,0.10271635
0.08756929,0.085294105
0.0744655,0.06924962
0.06076263,0.051420383
0.04696825,0.02834008
0.023475096,0.015103565
0.008094076,0.043215133
0.03248216,-0.013335716
-0.0120519865,0.018669117
0.009045314,0.05082715
0.040439006,0.04339262
0.039872676,0.038303282
0.03420364,0.026819363
0.023614261,0.015213428
0.011166858,0.036046628
0.029829187,0.027198762
0.028320983,0.017467592
0.016253073,0.05166052
0.045221407,0.067154944
0.059056748,0.073464476
0.067738175,0.01616951
0.010982709,0.021596469
0.013629816,0.025079753
0.014768623,0.004848777
-0.0023433343,-0.0029092205
-0.007715879,0.030833576
0.019413248,0.023340423
0.02024289,0.05940179
0.054111876,0.01545284
0.019482046,0.009865448
0.0104756495,0.00079201313
0.0049683284,-0.043138847
-0.031913504,-0.08491573
-0.061228104,-0.055604506
-0.0410252,-0.0490091
-0.036608636,-0.039363332
-0.027025852,-0.0077708317
0.00041468086,-0.0066067944
0.0002118704,-0.00068191503
0.0023635002,-0.036281336
-0.025547532,-0.010142831
-0.011531539,0.007959044
0.010403743,0.0044946163
0.008635894,0.0013329458
0.010212875,0.0030950266
0.011170131,-0.036146734
-0.018153705,-0.033208806
-0.019579345,-0.041157864
-0.025641885,-0.009752637
-0.0038358092,-0.007255929
0.000107393374,0.00012521524
0.000769781,0.03131048
0.029376501,-0.015290939
0.0011495438,-0.020659534
-0.006514107,0.003915124
0.007843239,-0.048911087
-0.03650435,0.0086229
0.00748957,-0.044910792
-0.035254072,0.029066833
0.02587225,-0.03698243
-0.027080927,-0.055490497
-0.043988064,-0.048839867
-0.039910313,0.008133697
0.004279153,-0.020021804
-0.014068044,-0.007668686
-0.0057421,-0.069257796
-0.052120667,-0.044014476
-0.037881672,-0.08787897
-0.07225857,0.008268771
0.00051636255,-0.0005633543
0.0035535612,-0.02042528
-0.020739483,0.036795326
0.026503723,0.048162445
0.040715635,0.06927211
0.053929247,0.06610722
0.058755223,0.06380938
0.060656726,0.05370038
0.05037075,0.022751631
0.019989518,0.029827144
0.0216809,0.0024046288
-0.0010417467,-0.013759477
-0.0129618775,0.012010021
0.00015584913,0.008827759
0.0060668546,0.0039411765
0.0010805216,0.017041529
0.01243566,0.030720865
0.026277905,0.040181845
0.032992978,0.051417843
0.049352665,0.040432043
0.038273945,0.018066918
0.025020987,0.041138347
0.041587766,0.05499197
0.049660396,0.064514354
0.06061317,0.017280145
0.020766193,0.018661713
0.019339846,0.0028353764
0.008889217,-0.020905353
-0.015515268,-0.018440848
-0.012111547,-0.015064782
-0.010365506,-0.011583671
-0.006858047,-0.009657065
-0.0037898964,-0.017166771
-0.010465847,0.0017156858
0.0027558834,-0.023985827
-0.017021842,-0.010215698
-0.008050344,-0.011449641
-0.008653188,0.030321328
0.023940904,0.03260582
0.036659542,0.07477274
0.06841225,0.035005994
0.035371292,0.045638617
0.044956747,0.015834067
0.017203111,-0.019245287
-0.013308909,-0.014069792
-0.014376995,-0.024208112
-0.021368943,-0.02560855
-0.020805001,-0.03562384
-0.022651557,-0.09310441
-0.06653938,-0.06917778
-0.050572168,-0.04129758
-0.03152953,-0.042713262
-0.033552065,-0.017863223
-0.012881767,-0.016787402
-0.01173487,-0.008826402
-0.0015247217,-0.0026916782
0.0066402815,0.021566492
0.02245761,0.014678342
0.017198855,0.012991087
0.012071569,0.020770296
0.01706735,0.023092376
0.021343624,0.00723819
0.008328916,0.011330382
0.013445691,0.032706115
0.028082013,0.03139262
0.02633384,0.021446884
0.024835922,0.026910728
0.024043486,0.050554167
0.042376067,0.06151029
0.05424753,0.086972706
0.06839357,0.06435044
0.062757514,0.05522559
0.05204569,0.08217902
0.07136074,0.06878622
0.06481392,0.05370254
0.04862676,0.039997052
0.038284447,0.03090528
0.030659247,0.020354781
0.016001105,0.005828372
0.005708025,0.016756691
0.014136604,-0.0076616043
-0.00564718,0.0027656544
-0.0022728618,0.0146966465
0.008286107,0.01924779
0.019145723,-0.026813708
-0.023659253,-0.04556093
-0.034683432,-0.07905082
-0.0627838,-0.045762878
-0.038787432,-0.036142148
-0.02598039,-0.019004446
-0.015618009,-0.0060745417
0.0005050949,-0.024678178
-0.015160106,-0.00031412643
0.0046697417,-0.011174909
-0.0041883993,-0.058252215
-0.043834824,-0.054248296
-0.04405833,-0.03247503
-0.026198719,0.0042159497
0.0019510534,0.005323404
0.008119335,0.0037125426
0.008687623,-0.051960107
-0.033902727,-0.106641576
-0.08294403,-0.0887464
-0.07252949,-0.049227927
-0.03808559,-0.06723754
-0.04931071,-0.081021026
-0.06004509,-0.04858746
-0.03436582,-0.01873932
-0.011822061,0.009586661
0.013429301,-0.0055170264
0.0001014359,0.034599263
0.03488251,0.030020185
0.031166475,0.0317407
0.036716066,-0.0211108
-0.008427434,-0.114498876
-0.077342525,-0.13264066
-0.099601775,-0.14052188
-0.10553833,-0.08635691
-0.07114604,-0.049345005
-0.036009233,-0.04969738
-0.0361104,-0.041708548
-0.028428396,0.055504512
0.046243,0.033245925
0.034804724,0.02807923
0.0298619,0.0064681014
0.013537593,0.06283552
0.05492603,0.0665758
0.06313021,0.050841846
0.055049986,0.008682911
0.018053984,0.012408133
0.014267125,-0.03681093
-0.028820995,-0.026795868
-0.02779696,0.0046239127
-0.00064552424,0.00081217685
0.0006555194,-0.046477824
-0.03692362,-0.03328097
-0.028093962,-0.025922544
-0.018972412,0.0043862625
0.0056361225,-0.0007043816
0.0004235501,0.046642084
0.03655331,0.059629038
0.051371455,0.031707946
0.028243741,0.014130647
0.017254222,0.04118839
0.038142253,0.004237227
0.0071309637,-0.058640704
-0.04131612,-0.11627747
-0.08655559,-0.07257923
-0.060092956,-0.06375926
-0.05125885,-0.056859344
-0.04555666,-0.05937606
-0.044834718,-0.07605828
-0.05892659,-0.0021712459
-0.007311922,-0.029202068
-0.020648314,0.0016065922
0.0013974531,0.017982788
0.018112766,0.038808297
0.039043106,0.00038250987
0.007987476,0.036666017
0.03958517,0.039398137
0.0409383,-0.03636391
-0.01982996,-0.0004556702
-0.001996125,0.01961006
0.01590949,0.01717054
0.015648395,0.053373523
0.049832653,0.071490325
0.064039245,0.05961106
0.05517338,0.018351158
0.020510102,-0.031510327
-0.019189712,0.014662906
0.01218781,0.024292473
0.027542565,0.05485768
0.049888894,0.042325627
0.03954301,0.04166308
0.042419024,0.014604278
0.017119404,0.00988883
0.008931033,0.026481196
0.022943629,0.024930194
0.01737875,0.053339183
0.04620847,0.0045947726
0.010858355,-0.0062334547
0.0008929575,-0.01575432
-0.009803426,-0.048027154
-0.038625743,0.009252021
0.0038104702,0.023084797
0.014504087,-0.00025834757
0.002671573,0.051602434
0.05183614,0.0057802214
0.014294353,0.03443002
0.03229573,0.041744705
0.042563275,0.0076472615
0.009863216,0.0011241599
0.007846103,-0.014705826
-0.007898402,0.012969508
0.0144839175,0.017788054
0.014993868,0.01633714
0.0060897176,0.012523531
0.0041607865,0.02304913
0.010914891,-0.012380877
-0.014137804,-0.06452274
-0.05386659,-0.07424566
-0.060439575,-0.053388547
-0.045099955,-0.013451175
-0.010883512,-0.00319244
-0.0066114403,0.011412661
0.01560454,0.028792623
0.028669013,0.024126459
0.023078792,0.012278847
0.013238413,-0.025444569
-0.018165302,-0.041812744
-0.02964655,-0.041174743
-0.03050233,-0.016788462
-0.014300465,0.024801858
0.02178778,0.02069977
0.023106394,0.032399047
0.03305217,0.045347653
0.046182495,0.0056920215
0.011158215,0.002602973
0.0051811724,-0.020935224
-0.013982361,-0.034382004
-0.022817653,-0.011120191
-0.0049914117,-0.012329286
-0.0063012247,-0.0022949295
0.00729352,0.0005048296
0.005781175,0.01873992
0.020773504,0.047060527
0.040960968,0.030235974
0.026689198,0.029416505
0.025517514,0.039528485
0.034355354,0.026473088
0.02861303,0.03561324
0.042765845,-0.041342475
-0.023812803,-0.06623493
-0.04668017,-0.04237644
-0.031400174,-0.044668708
-0.041193713,-0.0075676637
-0.009276036,-0.028837657
-0.023998432,-0.048662577
-0.03948001,-0.051882338
-0.039080985,-0.027773336
-0.025878051,-0.028616782
-0.022926046,-0.033270855
-0.022862209,-0.04237789
-0.029909117,-0.033512183
-0.02577584,-0.042102795
-0.029856296,0.0035360553
0.0057528536,-0.011371845
-0.0026215338,-0.01658795
-0.014637437,-0.011163665
-0.01032488,-0.056838755
-0.047388647,-0.08612243
-0.06663161,-0.08567348
-0.065858245,-0.0367823
-0.027682673,-0.019672617
-0.015276403,-0.052020077
-0.03625365,-0.023904212
-0.016645644,0.010370371
0.010481203,0.0026784416
0.0026449345,-0.000119994045
-0.00056544214,-0.01718364
-0.008626569,-0.041602112
-0.024294334,-0.056767445
-0.036319382,-0.041590694
-0.025452653,-0.0061976127
0.0035645007,-0.004021781
0.006709438,0.0007618895
0.0022461065,-0.006412808
-0.005880338,0.005013104
0.005217257,0.01992774
0.016326843,0.0025217598
0.0053354953,0.030340763
0.024860293,0.024428662
0.024818767,-0.008936477
0.0019509046,-0.053964645
-0.035168238,-0.025069736
-0.014643877,0.006629024
0.007330368,0.0388543
0.033315267,0.040212456
0.03937647,0.05643598
0.049716927,0.04062329
0.03836077,0.022199228
0.018108163,0.03492505
0.026938984,0.03847352
0.031864688,0.052626032
0.046036024,0.03094314
0.02939419,0.04324662
0.037114713,0.040761333
0.036123052,0.03416958
0.032752324,-0.016982973
-0.012370516,-0.009841141
-0.011902779,-0.030656438
-0.026065791,-0.019375449
-0.01754255,-0.08704999
-0.065891646,-0.0881321
-0.06753299,-0.11856955
-0.08738956,-0.11888758
-0.0892082,-0.091598906
-0.07427414,-0.15746893
-0.12584521,-0.18886392
-0.14705728,-0.2460485
-0.17183313,-0.09205019
-0.08227928,-0.07145543
-0.054660942,-0.008086132
-0.006898627,0.042921405
0.033131707,-0.014741084
-0.005811445,0.11070759
0.07278719,0.13686402
0.078581326,0.2677275
0.15094969,0.20505297
0.14444916,0.1462525
0.11585175,0.10131882
0.08702971,0.029480023
0.03733967,-0.06661377
-0.04440649,-0.15386623
-0.109846845,-0.06746061
-0.061532427,-0.031262994
-0.033687025,0.008930816
0.0042886306,0.07143789
0.052232157,0.08453736
0.067758925,0.079957955
0.061899856,-0.009611936
-0.010904814,0.009632172
0.0056122015,-0.035052385
-0.027251447,-0.027885856
-0.023805443,-0.017861215
-0.01570142,-0.066644266
-0.052033987,-0.017891712
-0.010781964,0.030785525
0.023151234,-0.0009640322
-0.0011725072,0.0061730677
0.0016596167,0.016330216
0.007134707,0.030776024
0.020756757,0.058405977
0.047660623,0.024253359
0.03208964,0.03812887
0.041781805,0.027304042
0.031160368,0.010061342
0.013218727,-0.061159786
-0.048389222,-0.07381805
-0.06506342,-0.032525677
-0.031437363,0.030314064
0.014786119,0.045630313
0.033088855,0.021991456
0.023461629,0.0017539342
0.0023652513,0.016540147
0.015162156,-0.01392085
-0.012217664,0.00915002
0.004606953,0.015434695
0.007584747,0.0031407159
-0.0025815652,-0.0045877723
-0.006033917,-0.0026558829
8.5028805e-05,-0.05315356
-0.031703424,0.0035903822
0.0045163617,0.010518831
0.016356712,0.0094294
0.017821738,-0.038881812
-0.017457515,-0.012223214
-0.00041966324,-0.041457035
-0.019966222,-0.051267605
-0.035078943,-0.046944045
-0.036257476,-0.02709978
-0.02119128,-0.029950557
-0.025566475,-0.06843513
-0.0578809,-0.0006762488
-0.004249979,-0.038227446
-0.028393744,-0.0837175
-0.059265148,-0.121592045
-0.09009311,-0.09462076
-0.07325849,-0.0100769345
-0.0014123266,-0.03474636
-0.028354565,-0.010709445
-0.009299026,-0.029556489
-0.025438918,-0.0019540265
-0.0013056762,0.0063173813
0.010003495,-0.03208636
-0.022184465,-0.047672357
-0.032435328,-0.014105948
-0.0042381906,-0.0070713665
0.003307891,-0.008466021
-0.0017759692,0.017181095
0.02424279,-0.016529122
-0.004899749,-0.024927163
-0.014117114,-0.02399907
-0.020016149,-0.024817113
-0.019497875,-0.038267773
-0.026204914,-0.02835147
-0.027912986,-0.05490582
-0.044640396,-0.02980199
-0.026113397,-0.015570861
-0.0072483183,-0.009413684
-0.005691606,-0.020171123
-0.019124653,0.01842852
0.012609515,0.0234817
0.014863985,-0.034428213
-0.026013395,-0.02590403
-0.02314399,-0.065744095
-0.056967083,-0.07998232
-0.06800039,-0.09660063
-0.076948375,-0.11457682
-0.090446,-0.09727931
-0.07970095,-0.093350574
-0.074692704,-0.11650228
-0.09257084,-0.1216032
-0.09887595,-0.0662283
-0.057968322,-0.015296196
-0.012274237,-0.047114477
-0.031222498,-0.0753
-0.051313553,-0.05033073
-0.03445434,-0.018495394
-0.014339715,0.009313649
0.004884798,0.016735986
0.013390465,-0.024219632
-0.022623925,-0.037087556
-0.027843341,-0.034273565
-0.024144402,-0.046925295
-0.03302116,-0.06032376
-0.0381054,0.0386617
0.030188879,-0.025249194
-0.015154862,0.010620823
0.012464384,0.010447303
0.013479051,-0.023944827
-0.013033903,-0.0150985215
-0.010095173,-0.006538987
-0.0059169866,-0.04213738
-0.031988006,-0.037767243
-0.031290583,0.013792739
0.013746313,0.021255568
0.025108503,0.007173207
0.013433559,0.036168616
0.037899878,0.04945567
0.047149833,0.05345312
0.051803842,0.0014868663
0.0072079836,-0.012855145
-0.016104627,-0.02370455
-0.021600123,-0.02411334
-0.023461202,-0.020461058
-0.020776106,-0.005757342
-0.009130326,-0.0135008115
-0.010142286,0.015650086
0.013257292,0.034679387
0.03451621,0.06870704
0.06215047,0.086488046
0.06950557,0.09181791
0.07684976,0.088825405
0.07499099,0.035402544
0.033759784,-0.011939261
-0.010513326,0.0052734874
0.0041080415,-0.01403924
-0.016721379,0.0033594267
-0.006510908,-0.03913427
-0.030302785,-0.010864665
-0.012510978,-0.0125149945
-0.00972773,-0.01196264
-0.011478773,-0.05334257
-0.041092433,-0.061712343
-0.049241457,-0.004192954
-0.0063952063,-0.011859172
-0.011300746,-0.005664075
0.00048181848,0.00054041523
0.0059672846,-0.03756622
-0.024188643,-0.05190019
-0.03935638,-0.0540823
-0.04352346,-0.030313563
-0.023505421,-0.044615578
-0.038732115,-0.009553828
-0.010065659,0.0021101588
0.0047928304,0.013001864
0.016332211,0.049414378
0.047979157,0.052171674
0.049818855,0.055157773
0.05096984,-0.008229073
-0.003776421,-0.0141517585
-0.009051594,-0.06710983
-0.058786083,-0.09059405
-0.07462657,0.029894566
0.01861088,0.045606818
0.03793588,0.048813526
0.043296464,0.022509357
0.027163731,0.003260615
0.006752255,-4.438413e-05
0.0013218911,-0.008306239
-0.007987059,-0.009297867
-0.012033206,-0.012275891
-0.009827532,-0.0024862909
-0.002716548,0.0051113125
0.0027392767,-0.004415759
-0.0012386149,-0.03224609
-0.021074627,-0.033911552
-0.028203981,-0.04671371
-0.040040486,-0.002493449
-0.002550187,-0.07190585
-0.0503858,-0.096303485
-0.07080655,-0.10544417
-0.079191916,-0.07452409
-0.0605878,-0.07467824
-0.06127155,-0.06933977
-0.053221483,-0.05164855
-0.041971713,-0.06730142
-0.056382097,-0.025673835
-0.023527,-0.04706783
-0.03755449,-0.041633576
-0.03337863,-0.03923682
-0.029851198,-0.036539156
-0.02571834,-0.037189953
-0.030387603,-0.0125082685
-0.008308297,0.020267384
0.016656741,0.004978196
0.002920647,0.030979473
0.027490988,0.005121085
0.009611519,-0.038037047
-0.027483936,-0.04681505
-0.036794003,-0.0050713457
-0.0079521155,-0.038388416
-0.027760139,-0.05287005
-0.0341249,-0.04362248
-0.030308539,0.015194561
0.018813353,0.01730535
0.023079038,0.052701112
0.049709994,0.0114187375
0.01111551,0.017561773
0.014633987,0.020213455
0.018058786,0.04059283
0.03662416,0.023813402
0.028208336,0.0029774138
0.008797699,0.011823049
0.014648127,-0.02339041
-0.017659275,-0.016683659
-0.01172965,0.008422264
0.00777019,-0.0049660546
0.0011008638,0.012412568
0.014768995,0.009227823
0.0040386915,0.02283136
0.022521224,0.0670312
0.0628936,0.056199808
0.05527883,0.058068175
0.054767698,0.08765215
0.07606372,0.029392265
0.026019694,0.022265399
0.024668152,-0.032982457
-0.02163199,-0.04292743
-0.032181535,-0.035278253
-0.03131138,-0.01605058
-0.013204604,-0.027587336
-0.022732418,-0.0024854003
-0.007959235,0.049196586
0.038949855,0.015637433
0.01115486,0.017659647
0.011772063,0.01077261
0.0068433033,0.07845115
0.060009994,0.07493294
0.057589024,0.046759997
0.04858975,0.05824088
0.054680232,0.104175724
0.07961059,0.08357465
0.069114834,0.105560504
0.0848928,0.1525649
0.11864983,0.12782583
0.1036189,0.15016848
0.11319784,0.05904061
0.0532606,0.06291567
0.05649763,0.0015664282
0.00568123,0.057275645
0.045746997,0.02046214
0.019773306,-0.0038389615
0.00118006,-0.021641303
-0.012731035,0.021075636
0.021695437,0.03145133
0.026096132,-0.024853455
-0.020485694,0.06602361
0.06004321,0.064834855
0.05517127,0.08479476
0.07340674,0.0644807
0.059962828,0.050726276
0.052473083,0.0638327
0.06056066,0.06308213
0.055137273,0.03579686
0.034513876,0.033865213
0.030425305,-0.019333163
-0.0116889905,-0.058380704
-0.047022104,-0.05271255
-0.040515017,-0.0914043
-0.07195145,-0.068832025
-0.049501736,-0.071763135
-0.05674762,-0.069270425
-0.055810645,-0.04262011
-0.037498213,-0.032067418
-0.028643895,-0.043287758
-0.034616396,-0.08074344
-0.063573785,-0.05226668
-0.04544917,-0.034166817
-0.031883974,-0.027879635
-0.024389613,-0.04422895
-0.03795587,-0.04092299
-0.030291291,-0.03109985
-0.027597636,-0.053593364
-0.041801043,-0.05450053
-0.045562323,-0.0057579256
-0.006442482,-0.026063427
-0.018068302,0.0024789632
0.0063162013,-0.0041808654
0.0006898279,-0.045166504
-0.029885832,-0.082558535
-0.057971038,-0.067841426
-0.05092915,-0.03500077
-0.02508873,0.014445401
0.015149896,-0.013567978
9.06033e-05,-0.045419797
-0.02997219,-0.021432916
-0.012920784,-0.059904456
-0.04585324,-0.0023565143
0.0010309268,-0.051353548
-0.038644098,-0.0346067
-0.033257965,-0.037126478
-0.031055255,-0.04546239
-0.039391186,-0.012416
-0.0069338847,-0.019061815
-0.012869127,0.008548408
0.0058214045,-0.0016660824
-0.00075494306,-0.012958705
-0.0030309826,-0.0059975213
7.3441e-05,0.03967667
0.039494637,-0.0043065683
0.00012584917,-0.012808347
-0.0038419554,-0.017737152
-0.0059167575,-0.024411097
-0.019506942,-0.027019352
-0.018263415,0.00842444
0.004586928,0.01579054
0.013356951,-0.00031984466
-0.002753414,0.083855905
0.06972615,0.13715187
0.107394725,0.14662768
0.11781397,0.08078609
0.076040365,0.062288094
0.052775525,0.058179233
0.048832223,0.041003555
0.036027472,0.033739153
0.02996942,0.037134673
0.027823329,0.04258199
0.040322512,0.06691444
0.054799154,0.05766692
0.052794743,0.007978934
0.008039677,0.014809931
0.02083328,0.029013613
0.024721367,0.035304885
0.028886544,-0.05259079
-0.033812407,-0.04542774
-0.030712465,-0.032987084
-0.020125471,-9.498242e-05
-0.0017031586,-0.030428011
-0.021404786,0.0010159669
0.001283806,0.013452948
0.014996133,-0.009290264
-0.0075498703,0.027523333
0.027374612,-0.006616791
0.001118993,0.003289402
0.010865372,0.0030996762
0.010514893,-0.019367475
-0.014175527,-0.02875836
-0.021051103,-0.056869872
-0.039401792,-0.075769894
-0.057818945,-0.056948707
-0.050325584,-0.054766007
-0.040971912,-0.057779416
-0.04363785,-0.022581726
-0.0127991205,-0.01790933
-0.010567495,0.046454612
0.043916136,0.07453803
0.06613464,0.079995155
0.06688305,0.064776376
0.062517025,0.06110617
0.057344373,-0.011585035
-0.005125132,-0.034782454
-0.02589105,-0.016590253
-0.012007422,0.012788405
0.010715216,0.020842228
0.017387737,0.007466742
0.0077276197,-0.030854769
-0.01695883,-0.028819181
-0.020033002,-0.008620578
-0.0051547308,0.02329951
0.021123804,-0.030906755
-0.023655936,0.015926022
0.013998566,0.0015051066
0.0029209957,-0.0025411516
-0.0023776353,-0.0037494884
-0.0030473762,-0.008929549
-0.006862971,0.0025315562
0.0009685023,0.038853407
0.026463207,0.04224041
0.034000646,0.0010995318
0.0066781095,0.010086666
0.010026666,0.034051914
0.02974917,0.018346595
0.016034482,0.011400193
0.011203767,0.07060446
0.060428042,0.09315568
0.079977214,0.03512153
0.03746657,-0.0004602073
-0.0001828506,0.00930703
0.0048374846,-0.011046484
-0.0059844307,0.0099670235
0.010527857,0.014995938
0.01360386,0.039071694
0.03931801,0.06629092
0.058219373,0.037193507
0.037013803,0.021796178
0.020897638,-0.029846674
-0.02153947,0.0023393196
-0.0016853082,-0.0030441678
-0.0071457867,-0.0005627158
-0.002035645,0.0025148066
0.0017594785,-1.682473e-05
0.0019344203,0.021677705
0.023084026,-0.033998795
-0.023144536,-0.03468951
-0.026355918,-0.0271274
-0.019328661,-0.015693936
-0.01142268,-0.018797211
-0.015177082,-0.047574513
-0.031224135,-0.042194977
-0.027889598,-0.05131178
-0.033909097,-0.010697399
-0.009242772,-0.009260152
-0.0069364575,-0.020594476
-0.011296028,-0.066177994
-0.048317842,-0.018689085
-0.013766653,-0.07183205
-0.04728138,-0.017984603
-0.004688698,-0.031709403
-0.016036114,-0.018111126
-0.00989843,-0.0130064115
-0.008902156,-0.012433799
-0.005885416,-0.019934338
-0.012655665,0.037110053
0.034901578,0.050520923
0.04515223,0.044318028
0.04257448,0.06604052
0.06407983,0.089036375
0.078220986,0.057340514
0.059064977,0.022230603
0.025478253,0.03549633
0.04045474,0.061011836
0.05661016,0.061293595
0.054260913,0.055120885
0.048095446,0.059077654
0.05271924,-0.049411803
-0.035256177,-0.045225326
-0.034806713,-0.069965415
-0.05616341,-0.05066658
-0.037858497,-0.03031189
-0.020735165,-0.04773527
-0.03869289,0.018848622
0.015339616,0.017419672
0.016025307,-0.028666332
-0.018279264,0.0061705457
0.0056794886,-0.014179877
-0.0115610305,0.0024666595
-0.0030438553,0.008137363
0.0013668753,0.014858648
0.010995961,-0.029856868
-0.024173433,0.013332797
0.014208342,-0.02460141
-0.015667556,0.008096046
0.0074352995,-0.02052008
-0.021197435,-0.031084908
-0.02483067,-0.025414107
-0.024012532,-0.020955492
-0.022914138,-0.015984137
-0.012576683,-0.036273066
-0.027537337,-0.037835363
-0.027457444,-0.0439228
-0.03155298,0.021898597
0.018148031,-0.0052646473
-0.0019088414,-0.0013247643
0.0014447918,0.035534274
0.030846048,0.011807931
0.014889127,0.07358353
0.061899204,0.02773454
0.03431367,-0.047411356
-0.031142829,-0.06320944
-0.04839182,-0.02708179
-0.022342838,-0.027673416
-0.019871658,0.009149601
0.011818561,-0.002667618
0.0022650368,0.0056684827
0.010706516,-0.037209
-0.020508107,-0.02368119
-0.010931631,0.026075916
0.027264465,0.06112203
0.057716828,0.104842104
0.08613294,0.08559025
0.0807074,0.04038292
0.050705254,-0.011544146
0.0011830701,-0.03170674
-0.023167921,-0.019123329
-0.0233082,0.032843236
0.017888647,0.012620079
0.0042389664,0.013295121
0.009277301,0.011338328
0.014426643,0.015624827
0.012338343,0.023657547
0.020934552,0.00019985274
0.0008724656,-0.00077642704
-0.00035917028,-0.013417368
-0.011129109,-0.029772183
-0.021480355,-0.012582035
-0.014200775,-0.05485242
-0.037542805,-0.0020601233
-0.0031947012,-0.028020808
-0.018269995,0.039223712
0.03283124,0.032237254
0.03542388,-0.044199314
-0.027058264,-0.022953354
-0.019273221,-0.0044740955
-0.005288957,-0.026908983
-0.022029433,-0.02402401
-0.015710557,0.048195057
0.038364347,0.059232876
0.050585907,0.032171275
0.027188495,0.04305874
0.03927761,0.08040417
0.06694421,0.09436326
0.072541036,0.10264357
0.07994909,0.074234255
0.065736845,0.032312464
0.034675337,-0.014957507
-0.005304391,-0.00026214012
5.8434794e-05,-0.007700186
-0.012963701,-0.024652256
-0.019747674,-0.020111933
-0.022637406,-0.017962165
-0.017012129,0.016060317
0.007215728,-0.0075164717
-0.0032594132,-0.06624907
-0.04617048,-0.057992905
-0.038589094,-0.014481786
-0.0109649515,-0.013848175
-0.012097487,0.013421551
0.017156737,0.03929467
0.03627259,0.02714432
0.027216274,0.03193683
0.034169726,-0.0005891669
0.00756452,0.017006438
0.016985184,0.01602395
0.013572583,0.08171591
0.063245855,0.07473583
0.0649982,0.058540247
0.05761086,0.11213977
0.0922226,0.06653816
0.06960165,0.088576205
0.07532619,0.10324165
0.08765885,0.09226852
0.07458976,0.106429584
0.08347676,0.13593845
0.106731996,0.13137823
0.10164375,0.11766473
0.09849295,0.12776089
0.106528156,0.10174056
0.08615092,0.03777604
0.028565371,0.1261145
0.10028015,0.13709556
0.10506372,0.1461925
0.11157267,0.13170087
0.11107242,0.09342276
0.08851023,0.14277668
0.106754914,0.10033276
0.08759387,0.076052815
0.06555447,0.00076240796
-0.0035598446,-0.04651764
-0.037061248,-0.16658084
-0.13066769,-0.09869926
-0.07687937,-0.1509772
-0.115576394,-0.17188863
-0.13546611,-0.12619717
-0.10402398,-0.11172529
-0.09186521,-0.10389303
-0.08227536,-0.08732781
-0.07573874,-0.05199435
-0.04281197,-0.02146483
-0.022816543,-0.05282964
-0.04275191,-0.0039530597
-0.0034828738,0.062457226
0.05712487,0.063152134
0.050140917,0.10053623
0.079615384,0.0898701
0.0709025,0.14102691
0.106420375,0.17641254
0.13776523,0.18076712
0.13484585,0.08078861
0.0764879,-0.15009603
-0.1025771,-0.0900369
-0.07184285,-0.10097708
-0.082041875,-0.08639952
-0.06779638,-0.10446529
-0.07642111,-0.09948949
-0.07476871,-0.09199769
-0.06936607,-0.08366348
-0.06050808,-0.059518334
-0.042373598,-0.0664969
-0.048258774,-0.054914087
-0.037435826,-0.0034358962
-0.0047242115,0.010125535
0.014625399,0.059909537
0.059090495,0.07141339
0.071372956,0.06821037
0.057648785,0.09170856
0.08217333,0.115188666
0.10148842,0.089810155
0.08806406,0.038843226
0.0427408,0.071335874
0.060903985,0.005025513
0.010672869,0.012915349
0.017908059,-0.06472851
-0.04291649,-0.024941945
-0.018127881,-0.05529923
-0.039331317,-0.083798446
-0.076393016,-0.04987309
-0.05150334,-0.050431952
-0.04590884,-0.06546986
-0.058418628,-0.09029641
-0.07646626,-0.09470855
-0.07809825,-0.095273286
-0.07762674,-0.010598954
-0.022434346,0.014538439
-0.0020693638,-0.03339012
-0.032972395,0.030402768
0.021822406,-0.03388501
-0.027093764,-0.035612818
-0.028834173,-0.11143164
-0.08824033,-0.10022498
-0.0838912,-0.07908762
-0.058397334,-0.034322534
-0.022258546,0.005546872
0.012940656,0.02394394
0.03542868,0.046620224
0.051371876,0.06639979
0.058285326,0.089791946
0.07282916,0.06918068
0.058338564,0.07719176
0.06549509,0.036160953
0.035233907,0.05319478
0.04943891,0.058004923
0.054768506,0.08830378
0.0781624,0.09428483
0.08193493,0.11522101
0.09523289,0.086715005
0.07775336,0.056575775
0.048182573,0.06866835
0.05721744,0.010538018
0.009244821,-0.04017964
-0.030706672,-0.110715665
-0.08091709,-0.1429565
-0.10190227,-0.052724835
-0.036832977,-0.037420295
-0.017001394,-0.03282319
-0.017367484,-0.0016804348
0.004270464,-0.002982889
0.004960148,-0.0045710327
0.0047200015,0.012572534
0.019884069,0.09651058
0.08078243,0.11466084
0.08638072,0.17997581
0.1204811,0.12619078
0.098593965,-0.021859942
-0.005485102,-0.017644005
-0.012796182,0.07959375
0.046142172,0.093792945
0.057802696,-0.02062524
-0.02314843,0.019391663
0.01423191,0.06888296
0.052803416,0.08935968
0.060814835,0.104726724
0.07947286,0.06833228
0.058469657,0.059113286
0.052862164,0.06055501
0.04701445,0.09845853
0.07611374,-0.0005073601
0.0011318141,-0.014996707
-0.011405578,0.062205143
0.040792964,0.049139906
0.03282395,-0.000481217
0.0021432312,0.020681985
0.017509155,-0.030425927
-0.023084229,-0.094954066
-0.07485872,-0.036170106
-0.031207686,0.012963752
0.008901588,0.04914981
0.04151555,0.025899416
0.017247727,0.045921855
0.038608007,0.118430465
0.090706654,-0.053660642
-0.034182742,-0.09060226
-0.07111463,-0.09097391
-0.074309066,-0.08643364
-0.07006922,-0.22863159
-0.15153427,-0.35276738
-0.21294817,-0.26910555
-0.19089963,-0.21801536
-0.16400816,-0.16458103
-0.13311468,-0.07696877
-0.06290407,-0.033329684
-0.032714117,-0.0025537838
-0.008270346,-0.05322793
-0.041132264,-0.11249343
-0.08944541,-0.08765397
-0.066304445,-0.04008326
-0.025405087,-0.012170035
-0.004583532,0.020381918
0.020444307,-0.043228127
-0.01759448,-0.10277703
-0.07311646,-0.07956874
-0.06819203,-0.024408033
-0.03252332,-0.023739818
-0.02186434,-0.023751426
-0.021401329,-0.051225785
-0.037982736,-0.057053935
-0.038732503,-0.03378323
-0.023497717,-0.09053956
-0.06308041,-0.098960415
-0.0782108,-0.05427811
-0.042716842,0.0055776965
0.0017652082,-0.03782781
-0.028885588,-0.052187487
-0.036562756,-0.035429902
-0.025163658,0.0070017506
0.0031761955,0.024483636
0.016957825,-0.002962538
0.002442056,-0.016414668
-0.009151325,-0.01672092
-0.010487842,-0.054184213
-0.04289801,-0.029614836
