time,open,high,low,close,tick_volume,spread,real_volume,EMA 9,trend,signal,magnitude
2021-01-04,1.07027,1.07199,1.06684,1.06777,459403,30,45940300000,1.0667503860847618,0.0010196139152383,1,0.06577415
2021-01-05,1.06778,1.07179,1.06689,1.07092,441975,30,44197500000,1.0675843088678096,0.0033356911321904,1,0.019188756
2021-01-06,1.07083,1.07123,1.06793,1.0692,590454,30,59045400000,1.0679074470942478,0.0012925529057521,1,0.04669184
2021-01-07,1.0692,1.07052,1.06713,1.07051,478815,30,47881500000,1.0684279576753983,0.0020820423246017,1,0.020726843
2021-01-08,1.07047,1.07332,1.06863,1.06903,537385,30,53738500000,1.0685483661403188,0.0004816338596811,1,0.029548299
2021-01-11,1.07094,1.07459,1.07035,1.07419,452926,30,45292600000,1.0696766929122552,0.0045133070877447,1,0.006839722
2021-01-12,1.07418,1.07753,1.07322,1.07604,422541,30,42254100000,1.0709493543298043,0.0050906456701957,1,0.060283195
2021-01-13,1.07576,1.07821,1.07351,1.07671,390518,30,39051800000,1.0721014834638436,0.0046085165361564,1,0.0798413
2021-01-14,1.07682,1.08005,1.07607,1.07979,414746,30,41474600000,1.073639186771075,0.0061508132289249,1,0.06999894
2021-01-15,1.0793,1.08032,1.07652,1.07869,442966,30,44296600000,1.07464934941686,0.0040406505831398,1,0.083789
2021-01-18,1.07879,1.08078,1.07833,1.07966,320521,30,32052100000,1.0756514795334882,0.0040085204665119,1,0.069612056
2021-01-19,1.07966,1.08412,1.07857,1.07997,391722,30,39172200000,1.0765151836267906,0.0034548163732095,1,0.06719746
2021-01-20,1.07972,1.08383,1.07884,1.0796,384508,30,38450800000,1.0771321469014326,0.0024678530985673,1,0.05155455
2021-01-21,1.07971,1.08029,1.07508,1.07563,328788,30,32878800000,1.076831717521146,-0.001201717521146,1,0.035600945
2021-01-22,1.07531,1.07677,1.07034,1.07035,411988,30,41198800000,1.075535374016917,-0.0051853740169169,0,-0.019503303
2021-01-25,1.07434,1.07504,1.06937,1.06993,434944,30,43494400000,1.0744142992135337,-0.0044842992135334,0,-0.06754834
2021-01-26,1.07014,1.07213,1.06805,1.06998,366368,30,36636800000,1.073527439370827,-0.003547439370827,0,-0.057379026
2021-01-27,1.0699,1.07144,1.06807,1.06977,551072,30,55107200000,1.0727759514966615,-0.0030059514966616,0,-0.04968334
2021-01-28,1.06971,1.07116,1.0671,1.07065,578147,30,57814700000,1.0723507611973293,-0.0017007611973292,0,-0.04107387
2021-01-29,1.07084,1.07098,1.06316,1.06316,633073,30,63307300000,1.0705126089578636,-0.0073526089578634,0,-0.025998315
2021-02-01,1.06396,1.06614,1.0622,1.06431,564487,30,56448700000,1.069272087166291,-0.0049620871662909,0,-0.09609713
2021-02-02,1.06436,1.0676,1.05706,1.05747,471013,30,47101300000,1.066911669733033,-0.009441669733033,0,-0.06688765
2021-02-03,1.05752,1.05944,1.05395,1.05654,425839,30,42583900000,1.0648373357864265,-0.0082973357864264,0,-0.12593862
2021-02-04,1.05647,1.062,1.05624,1.06174,394720,30,39472000000,1.0642178686291413,-0.0024778686291413,0,-0.11903286
2021-02-05,1.06159,1.06781,1.06092,1.06777,388734,30,38873400000,1.064928294903313,0.0028417050966871,0,-0.038516566
2021-02-08,1.06566,1.06723,1.06446,1.06552,348060,30,34806000000,1.0650466359226505,0.0004733640773495,1,0.02672293
2021-02-09,1.06556,1.06894,1.06517,1.06837,372913,30,37291300000,1.0657113087381205,0.0026586912618795,1,0.008680426
2021-02-10,1.0683,1.07261,1.06756,1.06963,397258,30,39725800000,1.0664950469904964,0.0031349530095037,1,0.043429952
2021-02-11,1.06965,1.07289,1.06914,1.07204,310888,30,31088800000,1.0676040375923972,0.0044359624076029,1,0.048575394
2021-02-12,1.07193,1.07578,1.07098,1.07413,284082,30,28408200000,1.0689092300739178,0.0052207699260822,1,0.06695348
2021-02-15,1.07658,1.0771,1.07371,1.07586,223580,30,22358000000,1.0702993840591342,0.0055606159408658,1,0.0713313
2021-02-16,1.07586,1.07661,1.07176,1.07489,392490,30,39249000000,1.0712175072473074,0.0036724927526925,1,0.08428737
2021-02-17,1.07497,1.07938,1.07471,1.07758,429510,30,42951000000,1.072490005797846,0.005089994202154,1,0.06537241
2021-02-18,1.07758,1.07949,1.07514,1.07514,431670,30,43167000000,1.0730200046382767,0.0021199953617232,1,0.07906073
2021-02-19,1.0751,1.07926,1.07507,1.07732,435207,30,43520700000,1.0738800037106215,0.0034399962893785,1,0.047535118
2021-02-22,1.07881,1.08154,1.07635,1.07944,449701,30,44970100000,1.0749920029684974,0.0044479970315025,1,0.056434613
2021-02-23,1.07929,1.08261,1.07711,1.07741,456533,30,45653300000,1.075475602374798,0.0019343976252019,1,0.05991976
2021-02-24,1.07737,1.08199,1.06859,1.07098,514350,30,51435000000,1.0745764818998385,-0.0035964818998384,1,0.031297173
2021-02-25,1.07098,1.07396,1.06696,1.06701,602924,30,60292400000,1.073063185519871,-0.0060531855198708,0,-0.04590188
2021-02-26,1.06696,1.07156,1.06384,1.06463,665203,30,66520300000,1.0713765484158968,-0.0067465484158968,0,-0.079171896
2021-03-01,1.06451,1.07015,1.06425,1.06915,480594,30,48059400000,1.0709312387327174,-0.0017812387327174,0,-0.085408926
2021-03-02,1.06915,1.07726,1.06682,1.07206,517534,30,51753400000,1.071156990986174,0.000903009013826,0,-0.026728569
2021-03-03,1.07213,1.07548,1.07184,1.07258,483637,30,48363700000,1.0714415927889394,0.0011384072110607,1,0.0130362585
2021-03-04,1.07246,1.07527,1.07166,1.07437,587247,30,58724700000,1.0720272742311514,0.0023427257688486,1,0.019250674
2021-03-05,1.0742,1.0766,1.07172,1.07172,584602,30,58460200000,1.0719658193849213,-0.0002458193849212,1,0.030687962
2021-03-08,1.07261,1.07639,1.07115,1.07186,537246,30,53724600000,1.071944655507937,-8.465550793701482e-05,0,-0.00092901406
2021-03-09,1.07186,1.07698,1.07016,1.07609,481421,30,48142100000,1.0727737244063498,0.0033162755936502,1,0.00033230928
2021-03-10,1.0763,1.07692,1.07361,1.07473,449867,30,44986700000,1.07316497952508,0.00156502047492,1,0.047911905
2021-03-11,1.07469,1.07833,1.07348,1.07735,423376,30,42337600000,1.074001983620064,0.0033480163799359,1,0.022759153
2021-03-12,1.07737,1.08175,1.07668,1.08118,441575,30,44157500000,1.0754375868960513,0.0057424131039487,1,0.043682136
2021-03-15,1.08026,1.08072,1.07411,1.07657,360743,30,36074300000,1.0756640695168411,0.0009059304831589,1,0.09634282
2021-03-16,1.07657,1.07754,1.07469,1.0767,350273,30,35027300000,1.075871255613473,0.0008287443865269,1,0.018338239
2021-03-17,1.0767,1.07834,1.07472,1.07831,388408,30,38840800000,1.0763590044907785,0.0019509955092216,1,0.017812047
2021-03-18,1.07831,1.08396,1.07645,1.08186,522660,30,52266000000,1.077459203592623,0.0044007964073771,1,0.032526437
2021-03-19,1.08187,1.08278,1.07892,1.07943,441686,30,44168600000,1.0778533628740985,0.0015766371259016,1,0.06269421
2021-03-22,1.07949,1.08236,1.07811,1.08158,343557,30,34355700000,1.0785986902992786,0.0029813097007214,1,0.025203748
2021-03-23,1.08158,1.0936,1.08158,1.0889,425199,30,42519900000,1.080658952239423,0.0082410477605769,1,0.04172187
2021-03-24,1.08893,1.09296,1.08723,1.08799,377669,30,37766900000,1.0821251617915384,0.0058648382084616,1,0.11684165
2021-03-25,1.08799,1.09072,1.08786,1.0894,413621,30,41362100000,1.0835801294332308,0.0058198705667691,1,0.08795097
2021-03-26,1.0894,1.09286,1.08899,1.08971,335220,30,33522000000,1.0848061035465848,0.0049038964534151,1,0.082265675
2021-03-29,1.09029,1.09453,1.08893,1.08991,352427,30,35242700000,1.085826882837268,0.004083117162732,1,0.07552373
2021-03-30,1.08991,1.09098,1.08669,1.0876,356413,30,35641300000,1.0861815062698144,0.0014184937301855,1,0.060137305
2021-03-31,1.08759,1.09009,1.08589,1.08702,513644,30,51364400000,1.0863492050158516,0.0006707949841484,1,0.021300646
2021-04-01,1.08668,1.08824,1.08352,1.08453,530183,30,53018300000,1.0859853640126813,-0.0014553640126813,1,0.010880652
2021-04-02,1.08453,1.08516,1.07695,1.08085,203304,30,20330400000,1.0849582912101452,-0.0041082912101451,0,-0.024990177
2021-04-05,1.08078,1.08433,1.08065,1.08285,234473,30,23447300000,1.084536632968116,-0.0016866329681159,0,-0.057861302
2021-04-06,1.08285,1.08742,1.08162,1.08507,328029,30,32802900000,1.084643306374493,0.000426693625507,0,-0.03148649
2021-04-07,1.08494,1.08648,1.08348,1.0849,357905,30,35790500000,1.0846946450995945,0.0002053549004055,0,-0.008196052
2021-04-08,1.0849,1.0864,1.08284,1.08405,319647,30,31964700000,1.0845657160796756,-0.0005157160796755,0,-0.0034568561
2021-04-09,1.084,1.0847,1.08174,1.08254,331051,30,33105100000,1.084160572863741,-0.0016205728637406,0,-0.018167928
2021-04-12,1.08278,1.08445,1.08114,1.08411,322095,30,32209500000,1.0841504582909929,-4.045829099275089e-05,0,-0.028540479
2021-04-13,1.08418,1.08533,1.08139,1.08252,480680,30,48068000000,1.0838243666327942,-0.0013043666327943,0,-0.006434565
2021-04-14,1.08242,1.08401,1.07951,1.08091,527599,30,52759900000,1.0832414933062355,-0.0023314933062354,0,-0.024216147
2021-04-15,1.08082,1.08235,1.07909,1.08079,509242,30,50924200000,1.0827511946449886,-0.0019611946449886,0,-0.035064578
2021-04-16,1.08093,1.08408,1.07958,1.08221,478636,30,47863600000,1.082642955715991,-0.000432955715991,0,-0.026909515
2021-04-19,1.0838,1.08392,1.07868,1.0788,518648,30,51864800000,1.0818743645727928,-0.0030743645727928,0,-0.009207029
2021-04-20,1.0788,1.08219,1.07486,1.07614,541615,30,54161500000,1.0807274916582343,-0.0045874916582342,0,-0.04028104
2021-04-21,1.07588,1.07792,1.07308,1.07445,510632,30,51063200000,1.0794719933265875,-0.0050219933265875,0,-0.060552407
2021-04-22,1.07426,1.07905,1.07252,1.07297,537431,30,53743100000,1.07817159466127,-0.00520159466127,0,-0.06378997
2021-04-23,1.07313,1.07823,1.07286,1.0739,457954,30,45795400000,1.077317275729016,-0.003417275729016,0,-0.063802384
2021-04-26,1.07486,1.08006,1.07461,1.07756,499685,30,49968500000,1.0773658205832128,0.0001941794167872,0,-0.03888388
2021-04-27,1.07751,1.07924,1.07643,1.077,468634,30,46863400000,1.0772926564665704,-0.0002926564665703,1,0.0077342107
2021-04-28,1.07718,1.07875,1.07147,1.07274,535166,30,53516600000,1.0763821251732564,-0.0036421251732563,1,0.008044143
2021-04-29,1.07274,1.07415,1.07132,1.07202,526324,30,52632400000,1.0755097001386051,-0.0034897001386051,0,-0.032093026
2021-04-30,1.07197,1.07727,1.07118,1.07593,370441,30,37044100000,1.0755937601108845,0.0003362398891157,0,-0.03837917
2021-05-03,1.07514,1.07881,1.07489,1.07608,312852,30,31285200000,1.0756910080887074,0.0003889919112924,1,0.009820517
2021-05-04,1.0763,1.08203,1.07582,1.07752,440370,30,44037000000,1.076056806470966,0.0014631935290341,1,0.010769951
2021-05-05,1.07769,1.07899,1.0732,1.07344,489581,30,48958100000,1.0755334451767729,-0.0020934451767729,1,0.023965485
2021-05-06,1.07349,1.07655,1.07164,1.07513,416369,30,41636900000,1.0754527561414182,-0.0003227561414183,0,-0.0260156
2021-05-07,1.07513,1.07897,1.074,1.07713,549184,30,54918400000,1.0757882049131346,0.0013417950868652,0,-0.004421643
2021-05-10,1.07686,1.0812,1.07355,1.07399,527884,30,52788400000,1.0754285639305077,-0.0014385639305076,1,0.023733424
2021-05-11,1.07399,1.0794,1.07382,1.07732,632164,30,63216400000,1.0758068511444063,0.0015131488555937,0,-0.016075823
2021-05-12,1.07724,1.08038,1.07582,1.079,668342,30,66834200000,1.076445480915525,0.0025545190844749,1,0.024453677
2021-05-13,1.07902,1.07962,1.07472,1.07593,656301,30,65630100000,1.07634238473242,-0.00041238473242,1,0.04506902
2021-05-14,1.07579,1.07702,1.07026,1.07216,530570,30,53057000000,1.075505907785936,-0.0033459077859361,0,-0.000663718
2021-05-17,1.07234,1.0778,1.0713,1.07623,560736,30,56073600000,1.075650726228749,0.0005792737712511,0,-0.040135246
2021-05-18,1.07601,1.07734,1.07332,1.07337,544801,30,54480100000,1.0751945809829992,-0.0018245809829993,1,0.009543369
2021-05-19,1.07338,1.07904,1.07338,1.07712,713996,30,71399600000,1.0755796647863995,0.0015403352136005,0,-0.021009445
2021-05-20,1.07716,1.07991,1.07612,1.07816,576616,30,57661600000,1.0760957318291198,0.0020642681708802,1,0.02520848
2021-05-21,1.07822,1.0807,1.07705,1.07759,566916,30,56691600000,1.076394585463296,0.0011954145367041,1,0.034559548
2021-05-24,1.07511,1.07889,1.07362,1.0741,516284,30,51628400000,1.075935668370637,-0.0018356683706368,1,0.024155594
2021-05-25,1.07405,1.07476,1.07106,1.07115,541084,30,54108400000,1.0749785346965095,-0.0038285346965094,0,-0.017646272
2021-05-26,1.07115,1.07312,1.06139,1.06277,576710,30,57671000000,1.0725368277572076,-0.0097668277572076,0,-0.045171738
2021-05-27,1.06282,1.06382,1.05991,1.06139,486914,30,48691400000,1.0703074622057662,-0.0089174622057661,0,-0.13058862
2021-05-28,1.06146,1.0655,1.05971,1.06289,514455,30,51445500000,1.068823969764613,-0.005933969764613,0,-0.11944444
2021-05-31,1.06194,1.06587,1.06162,1.06216,353317,30,35331700000,1.0674911758116905,-0.0053311758116902,0,-0.0780839
2021-06-01,1.06216,1.0701,1.0612,1.06818,477636,30,47763600000,1.0676289406493522,0.0005510593506476,0,-0.06875553
2021-06-02,1.06793,1.07166,1.06617,1.07086,464717,30,46471700000,1.0682751525194818,0.0025848474805181,1,0.013868145
2021-06-03,1.07082,1.07326,1.06945,1.07105,475563,30,47556300000,1.0688301220155854,0.0022198779844146,1,0.046822924
2021-06-04,1.07105,1.07558,1.06951,1.07112,477288,30,47728800000,1.0692880976124683,0.0018319023875317,1,0.033628806
2021-06-07,1.0722,1.07469,1.07166,1.07173,440242,30,44024200000,1.0697764780899748,0.0019535219100252,1,0.03266548
2021-06-08,1.07179,1.07578,1.07135,1.07438,441173,30,44117300000,1.07069718247198,0.0036828175280199,1,0.02964101
2021-06-09,1.07449,1.07765,1.07351,1.07662,408809,30,40880900000,1.071881745977584,0.0047382540224159,1,0.048527103
2021-06-10,1.07651,1.07798,1.07439,1.07498,451380,30,45138000000,1.0725013967820674,0.0024786032179326,1,0.05973202
2021-06-11,1.07498,1.08106,1.07471,1.08027,406663,30,40666300000,1.0740551174256538,0.0062148825743462,1,0.037680984
2021-06-14,1.07924,1.08066,1.07811,1.07916,415130,30,41513000000,1.075076093940523,0.0040839060594768,1,0.091087624
2021-06-15,1.07883,1.08023,1.07696,1.07908,481412,30,48141200000,1.0758768751524186,0.0032031248475814,1,0.06417985
2021-06-16,1.07911,1.08029,1.07664,1.0789,505191,30,50519100000,1.076481500121935,0.0024184998780649,1,0.053052668
2021-06-17,1.07877,1.0802,1.07428,1.07686,670733,30,67073300000,1.076557200097548,0.0003027999024518,1,0.037641805
2021-06-18,1.07689,1.08115,1.07603,1.07726,619003,30,61900300000,1.0766977600780383,0.0005622399219615,1,0.00057315716
2021-06-21,1.07741,1.07986,1.0763,1.07676,636800,30,63680000000,1.076710208062431,4.979193756904365e-05,1,0.0019367721
2021-06-22,1.07676,1.07878,1.07431,1.07509,528798,30,52879800000,1.0763861664499448,-0.0012961664499446,0,-0.010339471
2021-06-23,1.07489,1.07764,1.07375,1.07452,476321,30,47632100000,1.076012933159956,-0.001492933159956,0,-0.022869978
2021-06-24,1.07443,1.07526,1.07249,1.07371,490575,30,49057500000,1.0755523465279648,-0.0018423465279648,0,-0.015023405
2021-06-25,1.07373,1.07465,1.071,1.07107,461492,30,46149200000,1.074655877222372,-0.003585877222372,0,-0.016155384
2021-06-28,1.07163,1.07494,1.07161,1.07474,482487,30,48248700000,1.0746727017778976,6.729822210238545e-05,0,-0.041329723
2021-06-29,1.07485,1.07647,1.07277,1.07396,488409,30,48840900000,1.0745301614223182,-0.0005701614223181,0,-0.003237656
2021-06-30,1.07416,1.07591,1.07237,1.07261,506926,30,50692600000,1.074146129137855,-0.0015361291378546,0,-0.008841119
2021-07-01,1.07261,1.073,1.07002,1.07044,482663,30,48266300000,1.0734049033102837,-0.0029649033102836,0,-0.02081231
2021-07-02,1.07044,1.07263,1.06957,1.06982,476523,30,47652300000,1.072687922648227,-0.0028679226482271,0,-0.036385268
2021-07-05,1.06994,1.07268,1.06945,1.07028,369791,30,36979100000,1.0722063381185818,-0.0019263381185818,0,-0.03807674
2021-07-06,1.07028,1.0725,1.06619,1.06868,530033,30,53003300000,1.0715010704948655,-0.0028210704948654,0,-0.021987196
2021-07-07,1.06855,1.06916,1.0652,1.06523,526610,30,52661000000,1.0702468563958925,-0.0050168563958925,0,-0.035434097
2021-07-08,1.06523,1.0705,1.06513,1.06613,722646,30,72264600000,1.069423485116714,-0.0032934851167139,0,-0.061408676
2021-07-09,1.06596,1.07177,1.06561,1.07094,564709,30,56470900000,1.0697267880933712,0.0012132119066288,0,-0.044083297
2021-07-12,1.06765,1.07229,1.06765,1.06959,496936,30,49693600000,1.069699430474697,-0.0001094304746969,1,0.01383486
2021-07-13,1.06959,1.07383,1.06832,1.0707,477970,30,47797000000,1.0698995443797576,0.0008004556202423,0,-0.00038833194
2021-07-14,1.0704,1.07199,1.06165,1.06276,503433,30,50343300000,1.0684716355038062,-0.0057116355038062,1,0.011367854
2021-07-15,1.06254,1.06586,1.06169,1.06169,564582,30,56458200000,1.0671153084030451,-0.0054253084030451,0,-0.07305247
2021-07-16,1.06169,1.06352,1.05545,1.05648,539301,30,53930100000,1.0649882467224363,-0.0085082467224362,0,-0.07363716
2021-07-19,1.05629,1.05872,1.0551,1.05718,487418,30,48741800000,1.063426597377949,-0.006246597377949,0,-0.106940426
2021-07-20,1.05711,1.06131,1.05497,1.05928,585637,30,58563700000,1.0625972779023594,-0.0033172779023593,0,-0.08541305
2021-07-21,1.0592,1.06017,1.05441,1.05528,535974,30,53597400000,1.0611338223218876,-0.0058538223218875,0,-0.038156
2021-07-22,1.0552,1.05985,1.05423,1.05762,524126,30,52412600000,1.06043105785751,-0.00281105785751,0,-0.07256321
2021-07-23,1.05762,1.06107,1.05445,1.05511,300241,30,30024100000,1.059366846286008,-0.0042568462860079,0,-0.032053262
2021-07-26,1.05548,1.05591,1.05287,1.05345,404172,30,40417200000,1.0581834770288063,-0.0047334770288063,0,-0.05338553
2021-07-27,1.05336,1.05968,1.05336,1.05763,532434,30,53243400000,1.058072781623045,-0.000442781623045,0,-0.056706138
2021-07-28,1.0577,1.06119,1.05663,1.06093,564414,30,56441400000,1.058644225298436,0.0022857747015638,0,-0.00236825
2021-07-29,1.06125,1.06125,1.05425,1.05425,456082,30,45608200000,1.0577653802387488,-0.0035153802387488,1,0.04208674
2021-07-30,1.05425,1.05574,1.0517,1.05225,514938,30,51493800000,1.056662304190999,-0.0044123041909991,0,-0.04495467
2021-08-02,1.04961,1.05631,1.04961,1.05539,522919,30,52291900000,1.0564078433527992,-0.0010178433527991,0,-0.055107582
2021-08-03,1.05532,1.05651,1.05245,1.05367,549462,30,54946200000,1.0558602746822394,-0.0021902746822393,0,-0.012198903
2021-08-04,1.05334,1.05369,1.04561,1.04561,500399,30,50039900000,1.0538102197457917,-0.0082002197457915,0,-0.02877778
2021-08-05,1.04535,1.04942,1.04471,1.04752,459418,30,45941800000,1.0525521757966332,-0.0050321757966331,0,-0.10345667
2021-08-06,1.04804,1.05036,1.04713,1.04892,436127,30,43612700000,1.0518257406373066,-0.0029057406373065,0,-0.06689683
2021-08-09,1.04792,1.05014,1.04702,1.04804,455973,30,45597300000,1.0510685925098453,-0.0030285925098452,0,-0.038401593
2021-08-10,1.04804,1.05101,1.04727,1.04798,404390,30,40439000000,1.0504508740078764,-0.0024708740078764,0,-0.04112984
2021-08-11,1.04798,1.04856,1.04549,1.04642,393325,30,39332500000,1.049644699206301,-0.0032246992063011,0,-0.031446382
2021-08-12,1.04635,1.04865,1.04506,1.04704,373952,30,37395200000,1.0491237593650409,-0.0020837593650409,0,-0.040389325
2021-08-13,1.04689,1.04881,1.04531,1.04531,356648,30,35664800000,1.0483610074920329,-0.0030510074920329,0,-0.024073431
2021-08-16,1.04576,1.04674,1.04224,1.04467,388507,30,38850700000,1.0476228059936263,-0.0029528059936263,0,-0.03866585
2021-08-17,1.04449,1.05395,1.04181,1.04768,508747,30,50874700000,1.0476342447949012,4.575520509875197e-05,0,-0.03781082
2021-08-18,1.04766,1.05402,1.04492,1.0493,502744,30,50274400000,1.047967395835921,0.0013326041640788,1,0.0072684945
2021-08-19,1.04915,1.05358,1.04308,1.04311,608146,30,60814600000,1.0469959166687368,-0.0038859166687368,1,0.025090622
2021-08-20,1.04369,1.04824,1.04263,1.04263,478800,30,47880000000,1.0461227333349896,-0.0034927333349896,0,-0.043561336
2021-08-23,1.04344,1.04707,1.04258,1.04548,422956,30,42295600000,1.0459941866679918,-0.0005141866679918,0,-0.03947773
2021-08-24,1.04539,1.04701,1.04081,1.04347,406575,30,40657500000,1.0454893493343935,-0.0020193493343936,1,0.00093355845
2021-08-25,1.04333,1.04584,1.04203,1.04273,405868,30,40586800000,1.044937479467515,-0.002207479467515,0,-0.01855187
2021-08-26,1.04273,1.04421,1.04004,1.04068,375813,30,37581300000,1.0440859835740122,-0.0034059835740121,0,-0.023960646
2021-08-27,1.04068,1.0442,1.03978,1.04229,361698,30,36169800000,1.0437267868592095,-0.0014367868592097,0,-0.046213742
2021-08-30,1.04292,1.04378,1.04073,1.04184,289770,30,28977000000,1.043349429487368,-0.0015094294873678,0,-0.021013042
2021-08-31,1.04172,1.04246,1.03428,1.0375,177007,30,17700700000,1.0421795435898944,-0.0046795435898943,0,-0.024937386
2021-09-01,1.0375,1.04333,1.03685,1.0408,375183,30,37518300000,1.0419036348719155,-0.0011036348719155,0,-0.05866961
2021-09-02,1.04096,1.04344,1.03905,1.03961,306250,30,30625000000,1.0414449078975323,-0.0018349078975326,0,-0.016990654
2021-09-03,1.03969,1.0443,1.03786,1.04121,369668,30,36966800000,1.041397926318026,-0.0001879263180259,0,-0.029719403
2021-09-06,1.04095,1.04275,1.03979,1.04243,376248,30,36546000000,1.041604341054421,0.000825658945579,0,-0.0032391595
2021-09-07,1.04243,1.04528,1.038,1.03991,442041,30,43582100000,1.0412654728435369,-0.0013554728435369,1,0.0054069874
2021-09-08,1.03977,1.04086,1.03597,1.03663,508512,30,50851200000,1.0403383782748294,-0.0037083782748295,0,-0.02866092
2021-09-09,1.03663,1.03796,1.03504,1.03602,569991,30,56999100000,1.0394747026198636,-0.0034547026198636,0,-0.04629276
2021-09-10,1.03602,1.03807,1.03303,1.03303,503024,30,50302400000,1.038185762095891,-0.005155762095891,0,-0.043323025
2021-09-13,1.03239,1.03655,1.03239,1.03495,534116,30,53411600000,1.0375386096767127,-0.0025886096767127,0,-0.07291751
2021-09-14,1.03473,1.03605,1.0295,1.03095,499389,30,49938900000,1.0362208877413703,-0.0052708877413703,0,-0.031892136
2021-09-15,1.03088,1.03253,1.02991,1.03136,400151,30,40015100000,1.0352487101930965,-0.0038887101930962,0,-0.0709708
2021-09-16,1.03121,1.03127,1.0278,1.02905,429518,30,42951800000,1.034008968154477,-0.004958968154477,0,-0.051604904
2021-09-17,1.02905,1.03461,1.02845,1.03297,436042,30,43604200000,1.0338011745235818,-0.0008311745235818,0,-0.06807426
2021-09-20,1.03184,1.03343,1.02881,1.03109,335828,30,33582800000,1.0332589396188654,-0.0021689396188653,0,-0.017223006
2021-09-21,1.03098,1.03571,1.02886,1.03193,377359,30,37735900000,1.0329931516950923,-0.0010631516950923,0,-0.027012344
2021-09-22,1.03183,1.03494,1.03034,1.03235,320150,30,32015000000,1.032864521356074,-0.0005145213560737,0,-0.013977646
2021-09-23,1.03221,1.03526,1.02995,1.03144,282147,30,28214700000,1.0325796170848591,-0.0011396170848592,0,-0.004336932
2021-09-24,1.03135,1.03552,1.02922,1.03374,418542,30,41854200000,1.0328116936678873,0.0009283063321128,0,-0.014156152
2021-09-27,1.03366,1.03916,1.03305,1.03786,469798,30,46979800000,1.0338213549343098,0.0040386450656901,1,0.015684554
2021-09-28,1.03781,1.04302,1.03673,1.03947,372325,30,37232500000,1.0349510839474478,0.004518916052552,1,0.055754576
2021-09-29,1.03936,1.04641,1.0386,1.04414,340134,30,34013400000,1.0367888671579584,0.0073511328420416,1,0.059132885
2021-09-30,1.0441,1.04851,1.04349,1.04695,363198,30,35965600000,1.0388210937263669,0.0081289062736333,1,0.08993537
2021-10-01,1.04687,1.04905,1.04418,1.04519,353856,30,35385600000,1.0400948749810934,0.0050951250189066,1,0.10818018
2021-10-04,1.04555,1.04849,1.04367,1.0443,348606,30,34860600000,1.0409358999848748,0.0033641000151252,1,0.0745281
2021-10-05,1.0443,1.04761,1.04328,1.0459,284082,30,28408200000,1.0419287199879,0.0039712800121001,1,0.058929436
2021-10-06,1.04572,1.052,1.04398,1.0513,367749,30,36774900000,1.04380297599032,0.0074970240096798,1,0.062472656
2021-10-07,1.05121,1.05513,1.05079,1.05472,274226,30,27422600000,1.045986380792256,0.008733619207744,1,0.09479312
2021-10-08,1.05486,1.05535,1.05181,1.05225,315278,30,31527800000,1.0472391046338048,0.0050108953661951,1,0.10426148
2021-10-11,1.05508,1.05922,1.05333,1.0573,275254,30,27525400000,1.0492512837070438,0.0080487162929561,1,0.07105475
2021-10-12,1.05743,1.06104,1.05656,1.05851,307436,30,30743600000,1.0511030269656352,0.0074069730343648,1,0.10338876
2021-10-13,1.05809,1.06072,1.05634,1.05887,303650,30,30365000000,1.0526564215725085,0.0062135784274917,1,0.09676457
2021-10-14,1.05878,1.06071,1.05318,1.05368,240012,30,24001200000,1.0528611372580066,0.0008188627419933,1,0.08478039
2021-10-15,1.05366,1.05464,1.0473,1.04878,262018,30,26201800000,1.0520449098064053,-0.0032649098064052,1,0.01874216
2021-10-18,1.04854,1.04854,1.04506,1.04546,292679,30,29267900000,1.0507279278451245,-0.0052679278451241,0,-0.034166906
2021-10-19,1.04539,1.04677,1.04229,1.04402,269006,30,26900600000,1.0493863422760994,-0.0053663422760994,0,-0.066557735
2021-10-20,1.04389,1.04563,1.04228,1.04344,276577,30,27657700000,1.0481970738208797,-0.0047570738208797,0,-0.076375134
2021-10-21,1.0433,1.04633,1.04191,1.04316,287119,30,28711900000,1.0471896590567038,-0.0040296590567037,0,-0.065157495
2021-10-22,1.04314,1.04946,1.04151,1.04247,326642,30,32664200000,1.0462457272453631,-0.0037757272453631,0,-0.045175225
2021-10-25,1.04335,1.04904,1.04296,1.04479,270786,30,27078600000,1.0459545817962903,-0.0011645817962904,0,-0.047047745
2021-10-26,1.04463,1.04832,1.04451,1.04565,426986,30,42698600000,1.0458936654370323,-0.0002436654370325,0,-0.01928581
2021-10-27,1.04435,1.05168,1.04435,1.04788,279274,30,27927400000,1.046290932349626,0.0015890676503738,0,-0.0022631218
2021-10-28,1.04779,1.04869,1.04544,1.0474,328235,30,32823500000,1.046512745879701,0.0008872541202991,1,0.021901654
2021-10-29,1.04733,1.05263,1.04528,1.04718,309083,30,30908300000,1.0466461967037608,0.0005338032962391,1,0.017657684
2021-11-01,1.04917,1.04917,1.04363,1.04579,268633,30,26863300000,1.0464749573630088,-0.0006849573630087,1,0.009851478
2021-11-02,1.04579,1.04831,1.04041,1.04234,255849,30,25584900000,1.0456479658904072,-0.0033079658904071,0,-0.008298962
2021-11-03,1.04233,1.04466,1.03762,1.04019,406571,30,40657100000,1.0445563727123257,-0.0043663727123257,0,-0.03267465
2021-11-04,1.04018,1.04224,1.0393,1.04116,484295,30,48429500000,1.0438770981698606,-0.0027170981698605,0,-0.048344143
2021-11-05,1.04116,1.04326,1.03807,1.03929,471323,30,47132300000,1.0429596785358886,-0.0036696785358885,0,-0.033552885
2021-11-08,1.03889,1.0411,1.03337,1.03523,262172,30,26217200000,1.041413742828711,-0.0061837428287108,0,-0.043576103
2021-11-09,1.03523,1.03788,1.03288,1.03461,280092,30,28009200000,1.0400529942629688,-0.0054429942629687,0,-0.08041319
2021-11-10,1.03451,1.0389,1.03386,1.03729,317387,30,31738700000,1.039500395410375,-0.0022103954103749,0,-0.07227103
2021-11-11,1.0373,1.04,1.03548,1.03829,258074,30,25807400000,1.0392583163283,-0.0009683163283,0,-0.029419582
2021-11-12,1.0382,1.04099,1.03722,1.0399,224845,30,22484500000,1.03938665306264,0.0005133469373599,0,-0.012004013
2021-11-15,1.03931,1.0436,1.03813,1.04162,212391,30,21239100000,1.0398333224501122,0.0017866775498878,1,0.01503129
2021-11-16,1.04158,1.04552,1.03881,1.0443,257962,30,25796200000,1.0407266579600898,0.0035733420399102,1,0.023388056
2021-11-17,1.0443,1.04454,1.03736,1.03775,263928,30,26392800000,1.0401313263680718,-0.0023813263680718,1,0.04980892
2021-11-18,1.03764,1.03825,1.03236,1.0324,251517,30,25151700000,1.0385850610944574,-0.0061850610944573,0,-0.022752069
2021-11-19,1.03235,1.03604,1.03137,1.03215,304176,30,30417600000,1.037298048875566,-0.0051480488755661,0,-0.076640815
2021-11-22,1.03147,1.04,1.03104,1.03742,312081,30,31208100000,1.037322439100453,9.75608995470445e-05,0,-0.06360037
2021-11-23,1.03665,1.04294,1.03235,1.03879,566704,30,56670400000,1.0376159512803624,0.0011740487196376,0,-0.0022192851
2021-11-24,1.03875,1.04825,1.03542,1.04547,544016,30,54401600000,1.03918676102429,0.0062832389757099,1,0.0145930005
2021-11-25,1.04547,1.05011,1.04515,1.04653,369255,30,36925500000,1.040655408819432,0.0058745911805679,1,0.07935491
2021-11-26,1.0465,1.04894,1.04097,1.04215,669521,30,66952100000,1.0409543270555457,0.0011956729444544,1,0.0851932
2021-11-29,1.04319,1.04956,1.04194,1.04567,596865,30,59686500000,1.0418974616444363,0.0037725383555635,1,0.02340716
2021-11-30,1.0458,1.04817,1.04211,1.0437,505079,30,50507900000,1.0422579693155494,0.0014420306844507,1,0.055844318
2021-12-01,1.0437,1.04557,1.04209,1.04219,465820,30,46582000000,1.0422443754524395,-5.43754524395812e-05,1,0.01964753
2021-12-02,1.04219,1.0437,1.03665,1.03927,455492,30,45549200000,1.0416495003619517,-0.0023795003619517,1,0.002550743
2021-12-03,1.03936,1.04189,1.03502,1.03622,405008,30,40500800000,1.0405636002895613,-0.0043436002895613,0,-0.033383973
2021-12-06,1.03505,1.04498,1.03472,1.04362,385427,30,38542700000,1.0411748802316492,0.0024451197683508,0,-0.056670904
2021-12-07,1.0437,1.05005,1.04256,1.04757,269612,30,26961200000,1.0424539041853194,0.0051160958146805,1,0.032934736
2021-12-08,1.04763,1.05354,1.04719,1.05296,317028,30,31702800000,1.0445551233482555,0.0084048766517443,1,0.07656298
2021-12-09,1.05296,1.05355,1.05111,1.05152,261923,30,26192300000,1.0459480986786045,0.0055719013213955,1,0.111425236
2021-12-10,1.05148,1.05621,1.05014,1.05361,249943,30,24994300000,1.0474804789428838,0.0061295210571161,1,0.08057469
2021-12-13,1.05163,1.05643,1.05136,1.05522,243767,30,24376700000,1.049028383154307,0.006191616845693,1,0.088502094
2021-12-14,1.05516,1.05613,1.05101,1.05243,259167,30,25916700000,1.0497087065234456,0.0027212934765543,1,0.08965157
2021-12-15,1.05235,1.05963,1.05101,1.05629,314727,30,31472700000,1.0510249652187564,0.0052650347812435,1,0.045515236
2021-12-16,1.05447,1.05955,1.05447,1.056,336260,30,33626000000,1.0520199721750052,0.0039800278249948,1,0.07777422
2021-12-17,1.05599,1.05893,1.0545,1.05728,322639,30,32263900000,1.0530719777400042,0.0042080222599958,1,0.06948939
2021-12-20,1.0569,1.05998,1.05524,1.0588,310196,30,31019600000,1.0542175821920037,0.0045824178079965,1,0.0646065
2021-12-21,1.05883,1.05955,1.05476,1.05645,237641,30,23764100000,1.0546640657536028,0.001785934246397,1,0.07296627
2021-12-22,1.05635,1.05931,1.05515,1.05877,215219,30,21521900000,1.0554852526028822,0.0032847473971178,1,0.03390833
2021-12-23,1.05869,1.06266,1.05619,1.06063,185719,30,18571900000,1.0565142020823055,0.0041157979176942,1,0.045048572
2021-12-24,1.06064,1.06262,1.05476,1.05797,261346,30,26134600000,1.0568053616658446,0.0011646383341554,1,0.05452512
2021-12-27,1.05664,1.0632,1.0556,1.06204,141554,30,14155400000,1.0578522893326756,0.0041877106673244,1,0.0055418815
2021-12-28,1.06198,1.06416,1.06066,1.0607,154560,30,15456000000,1.0584218314661404,0.0022781685338595,1,0.0528298
2021-12-29,1.06068,1.06416,1.0599,1.06069,190612,30,19061200000,1.0588754651729124,0.0018145348270874,1,0.028821856
2021-12-30,1.06013,1.06424,1.0599,1.06056,176440,30,17644000000,1.05921237213833,0.0013476278616699,1,0.021488614
2021-12-31,1.06044,1.06312,1.05958,1.0619,156764,30,15676400000,1.059749897710664,0.0021501022893359,1,0.026335416
