Predicted,Actual
0.017818654,0.019175295
0.022012753,0.02118708
0.01945978,-0.055780564
-0.060446512,-0.08435935
-0.07502454,-0.08429223
-0.06924147,-0.08926927
-0.071055725,-0.08176718
-0.067569666,-0.074463435
-0.06452814,-0.07986202
-0.06561682,-0.07151506
-0.059484813,-0.02924375
-0.015926745,-0.008862416
0.0012005821,0.0025979267
0.0065053133,0.0124986
0.013290587,0.008347755
0.007148766,0.011330685
0.009981667,0.017037824
0.016924089,0.021402119
0.021751089,0.029800108
0.02953536,0.035056323
0.033617236,0.032551322
0.029318687,0.033960484
0.03002281,0.04421618
0.042727433,0.043976717
0.041232023,0.048684515
0.04521245,0.043517653
0.04009946,0.008585031
0.0015566257,-0.006887563
-0.012233484,-0.014800478
-0.016154356,-0.020991303
-0.020612044,-0.015153314
-0.013758177,-0.0159674
-0.015467123,-0.01498593
-0.015004498,-0.017891224
-0.018666742,-0.027559586
-0.028320003,-0.024598299
-0.023147818,-0.056631185
-0.05864368,-0.021555206
-0.015529029,-0.008848716
-0.0006271804,0.0027005807
0.006909859,0.011160322
0.0138338255,0.0135448
0.013097813,-0.01090875
-0.014195305,-0.019120494
-0.021165345,-0.01699573
-0.01566248,-0.01717741
-0.013784661,-0.015258351
-0.0132837705,-0.011604695
-0.010720484,-0.0122146625
-0.0107411,-0.0074510695
-0.005297859,0.012152713
0.017187493,0.022416549
0.0264505,0.026445678
0.025959007,0.031821422
0.028858503,0.035709776
0.031269476,0.0383768
0.033560723,0.044887304
0.04125547,0.046757713
0.043256536,0.03772057
0.032821,0.036544908
0.030739568,0.034359585
0.028345618,0.03589622
0.02997432,0.051209174
0.04681924,0.05650252
0.05254808,0.059348445
0.054236937,0.05994094
0.054929066,0.049645733
0.04344281,0.045465503
0.038527735,0.046088178
0.040735144,0.04478167
0.039746247,0.041960564
0.03632859,0.04122074
0.03644029,0.039108682
0.034823835,0.038769744
0.03469339,0.047117304
0.043927286,0.04994615
0.045956533,0.043362383
0.037514962,0.042679742
0.03635241,0.04743182
0.042294618,0.042120602
0.036001008,0.06244356
0.05793458,0.06356739
0.058465354,-0.023640655
-0.040215075,-0.051382516
-0.05968309,0.024838155
0.032285493,0.040474758
0.04688625,-0.006710053
-0.017039659,-0.021819685
-0.031379487,-0.015104072
-0.016076988,-0.018066153
-0.01714654,-0.028673692
-0.030150572,-0.034535903
-0.036715083,-0.033376526
-0.036375917,-0.0354864
-0.04007777,-0.04399975
-0.047090773,-0.045028675
-0.04458242,-0.048903327
-0.047887564,-0.04622578
-0.04510314,-0.022822598
-0.019359607,-0.012237696
-0.008620395,-0.008936279
-0.008921471,-0.004657961
-0.0067144297,-0.004243174
-0.0063177575,-0.038652994
-0.044656184,-0.007304534
-0.009955411,-0.003936204
-0.00014946346,0.014132729
0.015267736,0.023228053
0.023119746,0.024185894
0.022606406,0.028211648
0.027016504,0.0346876
0.03359216,0.036273282
0.034906697,0.044031322
0.04217595,0.043659423
0.041298117,0.021579826
0.01593123,0.015274633
0.009378375,0.009623289
0.0068001207,0.00940011
0.007276386,0.033361834
0.03325212,0.041751284
0.041215602,0.03839785
0.03347268,0.038257267
0.032197066,0.03710901
0.03178351,0.03162247
0.027192084,0.037176322
0.034127716,0.03055284
0.025158787,-0.008761152
-0.017903578,-0.024281599
-0.030459378,-0.035183597
-0.037500523,-0.03940652
-0.03930108,-0.01628132
-0.013135346,-0.009554191
-0.0074985274,-0.006644529
-0.006862999,-0.005776634
-0.006563641,-0.018959265
-0.019666016,-0.021617949
-0.020394111,-0.024068745
-0.02139261,-0.022332955
-0.019212369,-0.003935807
-0.00033013968,0.0037565096
0.005893669,0.005887826
0.005134914,0.008136093
0.0067250356,0.006132846
0.0053904,0.005409501
0.0048894677,0.005421613
0.0048417887,0.0044490783
0.0048421877,0.0016613308
0.0017218525,-0.0012002802
-0.002418008,-0.0006866119
-0.0007880633,-0.0032805672
-0.003270787,-0.013889695
-0.0151620135,-0.018489478
-0.0180356,-0.021850064
-0.021427618,-0.023814393
-0.024491912,-0.017508404
-0.016647313,-0.015470212
-0.014549515,-0.021212297
-0.021928068,-0.022287684
-0.022159915,-0.014153577
-0.011175901,-0.015207521
-0.012701849,-0.012353256
-0.010853926,-0.016712189
-0.01584797,-0.04752494
-0.048890226,-0.06158361
-0.059601706,-0.05986787
-0.05358777,-0.06338214
-0.056742083,-0.072521344
-0.0647708,-0.07125455
-0.06237996,-0.07728037
-0.06620833,-0.070585415
-0.05935057,-0.025449911
-0.012697862,-0.0040702308
0.0050623664,0.0028359971
0.0060311314,0.012134843
0.0135786105,0.015908826
0.016704956,0.019055367
0.019275641,0.027489692
0.028101372,0.029446676
0.029037759,0.014927753
0.010063914,0.010299774
0.0054825605,0.012611381
0.011133188,0.012874668
0.011678513,0.013421694
0.011658184,0.01583675
0.014480048,0.014491125
0.012429648,0.017590806
0.01519569,0.0330777
0.032125562,0.03996844
0.038859103,0.04344538
0.040975556,0.04601114
0.042139307,0.04227528
0.0374323,0.041431013
0.037431296,0.043234907
0.03936889,0.042791132
0.03824099,0.041967712
0.03715617,0.04233564
0.03819504,0.032777082
0.02786477,0.031529546
0.027312135,0.049167607
0.0484676,0.048373576
0.04628877,0.059812076
0.057328913,0.052755542
0.048729327,-0.0093766805
-0.020921769,-0.031149307
-0.0396985,-0.04802074
-0.04903688,-0.051828872
-0.049584787,-0.0023852715
0.0059297215,0.013751498
0.019788688,0.017867595
0.017942615,0.019321831
0.017168134,-0.000597261
-0.005030314,-0.007118287
-0.0094803935,-0.015949132
-0.017520942,-0.019003345
-0.020724814,-0.00033893768
0.0006875728,0.00021007385
-0.0013549137,0.003452121
0.0006589548,-0.0031570646
-0.007156516,-0.047560483
-0.05234902,-0.06810642
-0.067611516,-0.06973857
-0.06429535,-0.07659833
-0.06881673,-0.085032456
-0.07313882,-0.08498441
-0.072984606,-0.094684936
-0.07624715,-0.09045407
-0.073155165,-0.043995384
-0.033711255,-0.023716902
-0.015619921,-0.022706244
-0.020671228,-0.016169135
-0.016651824,-0.01261833
-0.012047405,-0.203393
-0.103235,-0.0016688759
0.014045198,-0.0038359328
0.017235419,-0.016483253
-0.018442752,-0.023486972
-0.026965741,-0.019912738
-0.021341706,-0.022718355
-0.016740087,-0.037171356
-0.035750207,-0.039085254
-0.035246685,-0.050371066
-0.044379514,-0.048032057
-0.045236494,-0.0034612548
0.0034576005,0.011347364
0.018120106,0.016648253
0.019104782,0.017577304
0.016667176,-0.011516138
-0.014927458,-0.025864897
-0.024704074,-0.016340887
-0.0134251155,-0.017776458
-0.015722297,-0.0600152
-0.05990974,-0.0733265
-0.074315324,-0.029297559
-0.02305227,-0.018122543
-0.0085843885,-0.046561144
-0.045168404,-0.04823836
-0.048869796,-0.046541486
-0.041021485,-0.037945334
-0.031306908,0.0055278414
0.013472157,0.026330713
0.03228194,0.031735845
0.032016333,0.039808
0.03697985,0.044305928
0.042162213,0.045237757
0.044512913,0.053194154
0.050621357,0.051195674
0.04918137,0.024292916
0.020187177,0.013164959
0.008718179,0.0068256133
0.004978742,0.0022222558
0.0012579096,0.009758506
0.008260667,0.009354441
0.009052678,0.007978041
0.008323769,0.0048779626
0.0043256776,-0.008506602
-0.011415403,-0.015112809
-0.017280433,-0.015497414
-0.015572667,-0.017775664
-0.019420717,-0.02170194
-0.02336339,-0.021685459
-0.02154385,-0.025285108
-0.026563963,-0.023117853
-0.024402559,-0.0052597886
-0.0019635712,0.0022605774
0.0042129513,0.007658562
0.008093844,0.010962957
0.009593953,0.0033869941
0.0013611505,0.002916413
0.0017324424,0.0051172245
0.0034621437,0.007062095
0.00421692,0.01689943
0.016170481,0.023433957
0.021441326,0.013509655
0.01076641,0.015585574
0.0134825045,0.04270456
0.04526422,0.044657573
0.044696514,0.06377588
0.061331384,0.05718814
0.052779257,-0.026891837
-0.043371543,-0.054975018
-0.060787503,-0.07190363
-0.066547334,-0.074540876
-0.0667824,-0.009815095
-0.0007712722,0.015937021
0.022455504,0.014652155
0.010767714,0.021371936
0.01640193,0.029652182
0.027273385,0.03106353
0.028502312,0.034885366
0.031685498,0.031241238
0.027850244,0.004932169
-0.001712537,-0.0100611085
-0.016888794,-0.010412952
-0.013833374,-0.01872596
-0.021130724,-0.044260457
-0.04874371,-0.055553216
-0.0556171,-0.059548393
-0.056780826,-0.061607037
-0.056574166,-0.052589547
-0.04662998,-0.04533823
-0.039739717,-0.04766413
-0.045443837,-0.04064969
-0.036273472,-0.010852757
-0.003532024,0.004014436
0.008819592,0.011370198
0.013744654,0.01852502
0.018983595,0.01856771
0.014955892,0.020880308
0.017329795,0.025751123
0.024075134,0.027780779
0.025896218,0.02616174
0.022534853,0.026369432
0.022260202,0.024032012
0.021010797,0.023633905
0.020029338,0.029698843
0.027579987,0.029282866
0.02759585,0.030193252
0.027396522,0.026700824
0.023564825,0.00838012
0.002490112,-0.0008581656
-0.006370297,-0.0038810053
-0.0059260204,-0.008356492
-0.010352926,-0.012717609
-0.014791731,-0.015492847
-0.016789196,-0.018444406
-0.018613933,-0.020169672
-0.022469606,-0.01530124
-0.018517513,-0.012671345
-0.014056478,-0.022264056
-0.025430132,-0.022257306
-0.02496894,-0.0030323705
-0.0024478517,-0.002530417
-0.0026443214,0.013146692
0.01291493,0.008095588
0.008096551,-0.05860723
-0.06237468,-0.07938925
-0.071829215,-0.09611197
-0.07497964,-0.09584491
-0.074871734,-0.030939033
-0.017697925,-0.0107044345
-0.0021545254,0.01710732
0.02175483,0.0147470655
0.014897298,0.002356282
0.00060730777,-0.002784372
-0.0023865402,-0.009649895
-0.009710776,-0.012386217
-0.012843335,-0.0012441614
-0.0013697881,-0.0006673518
-0.0014252536,0.00026705986
-0.0012922649,-0.0026827105
-0.003885304,-0.026150422
-0.028742218,-0.037399895
-0.0391814,-0.02926996
-0.02790047,-0.03097398
-0.029559886,-0.051715896
-0.05187394,-0.0510269
-0.0500228,-0.060266178
-0.056335963,-0.050449494
-0.046254627,0.023375383
0.03423079,0.05656884
0.06478666,0.05959446
0.05735253,0.069947846
0.06431558,0.079672195
0.075877935,0.07857199
0.07503759,0.0910968
0.08679395,0.08354784
0.07816295,0.021938223
0.008928525,-0.0048829266
-0.016465884,-0.017000495
-0.02075375,-0.027619947
-0.026421921,-0.019169735
-0.017208919,-0.020606497
-0.019303568,-0.022609148
-0.021252617,-0.026008453
-0.025262654,-0.038304724
-0.037987076,-0.041150253
-0.03914357,-0.049742036
-0.04768842,-0.04875004
-0.04693496,-0.019251939
-0.01453611,-0.009636195
-0.006211935,-0.003180693
-0.0033593508,-0.0015783337
-0.0033633115,-0.026094826
-0.027905576,-0.03498226
-0.03614461,-0.027369367
-0.024588808,-0.026652375
-0.023333516,-0.035302732
-0.035399135,-0.031231707
-0.031213297,-0.03557317
-0.033295512,-0.026105946
-0.02291439,0.027466461
0.035613116,0.05251648
0.059001982,0.058425155
0.057437953,0.06772142
0.06357522,0.07255471
0.06789237,0.073282614
0.06838681,0.08238648
0.07855666,0.07964976
0.07604222,0.047824565
0.03984376,0.03464392
0.02569492,0.026107535
0.020229785,0.020562815
0.014658319,0.030681703
0.026238939,0.029800108
0.025642803,0.030936651
0.024779975,0.026557067
0.019903775,0.0022609744
-0.004800968,-0.007020398
-0.012210896,-0.014578887
-0.01715998,-0.017163511
-0.018255463,0.0014113468
0.0037101903,0.0072981804
0.008649136,0.0042981748
0.003240871,0.0040523605
0.0023486824,0.0027385054
0.0009606935,-0.0007894647
-0.0033751128,0.0035694686
0.0025662445,-0.00075928395
-0.0034612021,-0.024027446
-0.028542086,-0.0316592
-0.034760788,-0.049783137
-0.05006825,-0.053031735
-0.05087572,-0.012139608
-0.0063820845,-0.0058808764
-0.0018432478,0.004958378
0.0050014514,-0.0027482347
-0.0050323475,-0.075756244
-0.07128345,-0.10485961
-0.08212819,-0.12064851
-0.08509835,-0.12861642
-0.08851514,-0.09967647
-0.07340215,-0.09247022
-0.07168475,-0.079078905
-0.067472175,-0.07598717
-0.067009926,-0.111565694
-0.08811987,-0.113065995
-0.08849581,-0.12300797
-0.09271708,-0.10994726
-0.08370571,-0.017989708
-0.00011488267,0.022704259
0.03470039,0.039317764
0.040911686,0.05426895
0.052117642,0.040922306
0.036542222,0.03884639
0.036201004,0.04853957
0.04699097,0.0490308
0.046357613,0.034951087
0.028689533,0.029489167
0.022902783,0.026293384
0.023432974,0.023768526
0.022402309,0.027981916
0.027788825,0.027135864
0.026515948,0.025162004
0.022704395,0.021953115
0.019960692,0.012503167
0.011161241,0.006379256
0.005081789,0.004364691
0.0039618434,0.00025733054
-0.0010632451,-0.007954413
-0.010936197,-0.012343725
-0.014656659,-0.016120687
-0.01719848,-0.018003806
-0.017875496,-0.015011544
-0.014325768,-0.014679159
-0.013784989,-0.01214219
-0.011681822,-0.011837603
-0.012835129,-0.017861042
-0.018500932,0.1621373
0.09744987,0.008826279
0.0012791507,0.007854737
-0.00824914,0.0029569187
0.002244169,0.0007553128
0.0008176664,-0.0012902267
0.0014796664,-0.0024930881
-0.004705802,9.90802e-05
0.0004661773,0.00011992874
-0.0019516246,-0.0011389259
-0.003649121,-0.0019172714
-0.0011902658,-0.0059384583
-0.006438146,-0.009163231
-0.011255239,-0.0018799426
-0.0033529433,-0.0012441614
-0.00063016266,-0.023822535
-0.025560398,-0.027934065
-0.031468622,-0.015801802
-0.016469188,-0.008636855
-0.00794208,0.008005839
0.008646092,0.014091032
0.013336816,0.024746818
0.02540689,0.025770186
0.024357542,-0.0017004466
-0.006015346,-0.01032777
-0.012251612,-0.014193487
-0.014588708,-0.0145890135
-0.01656172,0.0022381404
0.0012213321,0.00793833
0.0080371415,0.013451081
0.011977417,0.015313748
0.0137213245,0.0025240632
0.00046375,0.0010031126
0.00045615048,-0.0014554266
-0.00074406306,0.0011089437
0.00023852578,0.025088139
0.025842104,0.03528764
0.03506477,0.032936323
0.029518535,0.034561913
0.031463813,0.040168185
0.038347613,0.037899666
0.033673663,0.040929653
0.034698155,0.034540273
0.028086416,-0.00010900808
-0.01027424,-0.017315805
-0.024626384,-0.022965759
-0.025837949,-0.031218803
-0.031049382,-0.037876435
-0.0369878,-0.042257804
-0.04224797,-0.049714237
-0.048581302,-0.052183498
-0.047916293,-0.04108969
-0.037061863,-0.03765544
-0.033618957,-0.039853472
-0.03714646,-0.040009934
-0.039155304,-0.0394365
-0.039065473,-0.040669743
-0.038892403,-0.039482765
-0.03748488,-0.041106965
-0.03873279,-0.052588556
-0.051250283,-0.05775224
-0.054763254,-0.05586118
-0.052582424,-0.05663714
-0.051461153,-0.061303046
-0.056315772,-0.06009939
-0.055285797,-0.0627142
-0.05584019,-0.058592338
-0.051868264,-0.034315504
-0.024234537,-0.022855757
-0.016418234,-0.017349757
-0.014012831,-0.01204152
-0.009190472,-0.013586894
-0.010920674,-0.012201956
-0.008671057,-0.008062826
-0.004440743,-0.0061425753
-0.004514548,-0.006104651
-0.005970267,-0.0045757582
-0.0046254895,-0.007562063
-0.00819426,-0.0067930496
-0.0054652374,0.004450071
0.005865567,0.0061403913
0.008392938,0.009773001
0.009649561,0.0076577677
0.0053957016,-0.016864682
-0.020324102,-0.027723394
-0.031235235,-0.023935117
-0.02264435,-0.0261123
-0.024351733,-0.03679013
-0.036522474,-0.035872195
-0.0352273,-0.04174553
-0.038511828,-0.035633925
-0.03366111,0.009321879
0.014426794,0.029888863
0.035117034,0.032031894
0.030688621,0.038897417
0.03588689,0.046540692
0.046116892,0.047071435
0.04588524,0.05423817
0.051847648,0.05063594
0.047104694,0.015156292
0.007526165,-0.0012169591
-0.007957566,-0.0014411305
-0.00360323,-0.0074649686
-0.006643445,-0.01837352
-0.01995392,-0.02071233
-0.021803182,-0.029829495
-0.028825369,-0.028617302
-0.026443437,0.006606803
0.013145327,0.020580685
0.025361264,0.015133061
0.013856759,0.015992021
0.0133617,0.024494255
0.022694558,0.020663086
0.018628206,0.020378554
0.016576456,0.010044231
0.005540605,-0.038125228
-0.046084292,-0.06682711
-0.069878586,-0.060612064
-0.057589415,-0.07480079
-0.06645868,-0.13263662
-0.10389956,-0.14936052
-0.110497884,-0.17331232
-0.115106225,-0.16985762
-0.11261384,-0.07376491
-0.050002456,-0.033509757
-0.015855229,-0.022012683
-0.016978186,-0.00791768
-0.005691284,-0.016152853
-0.015165292,-0.144533
-0.100521326,0.18307142
0.09659689,-0.14395897
-0.099759296,0.027114023
0.020144189,0.012254573
0.023849305,-0.0003071685
-0.006468488,-0.008268928
-0.00643319,-0.010207445
-0.014393775,-0.011170449
-0.0070591965,-0.006568283
-0.0059642233,-0.0032249712
-0.0044973767,0.001817397
0.0032147728,0.010816818
0.010199844,0.0047770953
0.0027530144,0.013133389
0.012507234,0.06233892
0.068167016,0.0804976
0.08076547,0.08836684
0.08282245,0.089690216
0.081249595,0.06265741
0.052411564,0.049316525
0.03853551,0.043590523
0.03521194,0.03451585
0.029581271,0.022090517
0.013490653,0.009054421
0.0012240653,0.009023843
0.004549763,-0.0015128098
-0.006443522,-0.041599587
-0.0481501,-0.057962514
-0.06007141,-0.06838778
-0.064004175,-0.071522005
-0.0655681,-0.04686831
-0.039944947,-0.036036998
-0.02815486,-0.031733464
-0.028794676,-0.025102237
-0.020867819,-0.019726094
-0.016150322,-0.011212742
-0.006962832,-0.009388594
-0.0062818374,-0.000707659
-0.00012830923,0.028308345
0.030460838,0.04204555
0.04454466,0.050267614
0.047523547,0.054814585
0.049682718,0.048698615
0.04305118,0.048022725
0.040511083,0.03776445
0.031214494,0.035821166
0.03046186,0.05317688
0.050685123,0.055781756
0.053176787,0.057199854
0.050593212,0.05335181
0.047881357,0.027938632
0.01865752,0.015806766
0.0075661363,0.012552409
0.008555401,0.006965398
0.0033500618,0.0031008727
0.00024534788,0.00097193907
-0.004033599,-0.007621829
-0.014220085,-0.009129079
-0.016008949,0.006471982
0.0058663306,0.009110613
0.0061807213,0.013960778
0.012798047,0.01181179
0.00845448,-0.014894395
-0.019599715,-0.024206743
-0.030402856,-0.029712941
-0.031522747,-0.030994233
-0.03042638,-0.01310162
-0.014469272,-0.0065823803
-0.003644557,-0.00473103
-0.0050787223,-0.0028080004
-0.004919126,-0.006902058
-0.008097981,-0.007254696
-0.007839962,-0.0062267636
-0.005988586,-0.0049238293
-0.0035332511,-0.0013813647
-0.00055415044,0.0007241393
0.0008693173,0.0034684027
0.0033274598,0.0053954036
0.0040835715,0.003918334
0.00078656914,0.00514264
0.001240441,0.0076355296
0.006039446,0.00961634
0.0059753093,0.016680023
0.0124707725,0.02256646
0.019400196,0.011444259
0.0045331083,0.008317575
0.0021414026,0.052465647
0.051493585,0.06445495
0.06354589,0.0006677489
-0.013822532,-0.015123134
-0.023971068,0.03241253
0.034555003,0.047227103
0.050285295,0.029068423
0.025777884,0.028771978
0.021503806,0.05172622
0.048410166,0.051331885
0.049372904,0.06626063
0.06311832,0.05789441
0.052871812,-0.021502389
-0.035531245,-0.049971964
-0.058454726,-0.06613316
-0.063975915,-0.07108737
-0.06345442,-0.019260874
-0.009512981,0.0010180044
0.006973828,-0.004111332
-0.004015535,0.0007376412
0.003263787,0.014645206
0.017501043,0.016941523
0.021017753,0.022900235
0.023827402,0.018883416
0.016696643,-0.016035307
-0.021266388,-0.032589443
-0.03743151,-0.037452713
-0.037945822,-0.04441692
-0.04342237,-0.052269474
-0.04998755,-0.058139626
-0.05469343,-0.052402705
-0.048883144,-0.05423678
-0.047482546,-0.067522064
-0.06008763,-0.06311409
-0.056696627,-0.09161345
-0.07440992,-0.091953374
-0.07505485,0.029874964
0.04429634,0.069876164
0.08288735,-0.014316196
-0.025166355,-0.028268633
-0.040649183,0.0137437545
0.019090654,0.17949599
0.08619926,0.0009959645
-0.014443059,-0.0050346246
-0.02683894,-0.019755282
-0.022748021,-0.028985625
-0.031610522,-0.038337883
-0.035139807,-0.04564361
-0.042268507,-0.046228558
-0.040965367,-0.05263224
-0.050514627,-0.05438669
-0.05039026,-0.06279937
-0.05335244,-0.08795522
-0.077182434,-0.0992869
-0.086718746,-0.12020434
-0.09480227,-0.12694159
-0.09653455,-0.09610522
-0.07320844,-0.09593227
-0.07208474,-0.07738323
-0.06290861,-0.07889643
-0.06737886,-0.19068988
-0.12108057,-0.23464634
-0.122443624,-0.14417122
-0.091265105,-0.12681413
-0.08517675,-0.23883511
-0.12015136,-0.22903828
-0.11909389,-0.25013205
-0.1254214,-0.20352325
-0.11189049,-0.10939765
-0.06685286,0.10862486
0.08415304,0.06980806
0.07880053,0.10703104
0.09036296,0.09000692
0.07577313,0.07855174
0.065265544,0.13584511
0.105791375,0.12755792
0.10180549,-0.03193599
-0.05179955,-0.07300682
-0.08133919,-0.13024598
-0.105972715,-0.12436293
-0.097353645,0.10413309
0.11962265,0.17873453
0.12332139,0.21704164
0.12817715,0.22241142
0.13706286,0.07403853
0.044727173,0.021122945
0.0010633285,0.008482575
0.0044692103,-0.0042963875
-0.00527986,0.03131391
0.03347226,0.03958006
0.03449233,0.035470713
0.029363086,0.033397574
0.027700124,0.021715641
0.017288242,0.016848598
0.016923789,0.011821519
0.010327686,0.009932046
0.008785601,0.017073564
0.016855178,0.017123997
0.01601655,0.022985615
0.023025835,0.020656534
0.020443833,0.00015110227
-0.0044267518,-0.0034737638
-0.0051570763,-0.02632575
-0.031770095,-0.034713414
-0.03772816,0.047300372
0.056128897,0.07222947
0.07862675,-0.0354725
-0.04613158,-0.056448117
-0.059068803,0.036071945
0.05003284,0.066238195
0.07719962,0.06386166
0.057774656,0.07104487
0.06021808,0.063913286
0.052900184,0.06542053
0.05732404,0.07893257
0.073080234,0.0843788
0.077420905,0.08661695
0.07989427,0.099466994
0.089219734,0.06885022
0.052666232,0.076884255
0.06560711,0.18841799
0.098613754,0.2114854
0.10460765,0.23600268
0.12039817,0.21990463
0.12864481,0.05351403
0.012142589,-0.019732844
-0.055309627,-0.02162192
-0.038008474,-0.04074718
-0.048252072,-0.0885773
-0.08073489,-0.10269911
-0.08527307,-0.052211296
-0.047608912,-0.03286842
-0.028192408,-0.028280746
-0.026070593,-0.019952053
-0.017283553,-0.0046436647
-0.0045590545,0.0030798258
0.0015229413,-0.004044418
-0.011417121,-0.003213852
-0.0119715985,0.0011744677
-0.005494159,0.004641282
0.00086579565,0.010554325
0.009972544,0.014302297
0.013052661,0.018043915
0.014286344,0.02061325
0.015695019,0.019654613
0.01398862,0.020872168
0.016182844,0.022003548
0.018889232,0.02366349
0.022664998,0.028896274
0.02912341,0.031566475
0.02564522,0.03127539
0.023343543,0.03165543
0.023676448,0.03465504
0.025081342,0.034828976
0.025803272,0.031019649
0.024352621,0.026712142
0.020418119,0.029393662
0.020981245,0.02680725
0.016819196,0.001089088
-0.007283278,-0.008015568
-0.016529748,0.005535585
0.0015366281,0.007950442
0.0069562914,0.0027281803
-0.0014831981,0.0014296141
-0.003402258,0.0030790314
0.0023793092,0.0031115948
0.0034021637,0.0026572952
0.0037186097,0.0022018044
0.0050719804,0.00076087244
0.0019934694,0.10778258
0.09838956,-0.0016531899
-0.0054432997,0.00011397202
-0.009502864,0.007971886
0.011053563,0.010710391
0.012734741,0.018098319
0.01847252,0.019775933
0.019266523,0.004721698
0.0052749063,0.0031540862
0.0046356185,0.00043682655
0.004588991,0.0037995968
0.011608793,0.034515254
0.04189795,0.048494298
0.054925233,0.04145444
0.03933378,0.044302948
0.03929279,0.061759528
0.060770888,0.059817437
0.055938948,0.07462149
0.06778688,0.064981125
0.05980621,-0.013546587
-0.028699677,-0.043124508
-0.052092332,-0.0658103
-0.06289632,-0.07427977
-0.06743715,-0.02172378
-0.013046951,-0.007891271
-0.0012003148,-0.006532741
-0.007163073,-0.008326112
-0.012089743,-0.043649692
-0.05392042,-0.059765216
-0.06272097,-0.05303551
-0.04749797,-0.057057887
-0.05235973,-0.07858271
-0.07021651,-0.079984725
-0.07357856,-0.09089725
-0.077119455,-0.08308044
-0.06798297,-0.015546458
0.0014570829,0.013933376
0.026334967,0.022874026
0.028721677,0.032717515
0.035624154,0.02862147
0.029700322,0.02791282
0.028042609,0.03034515
0.031426165,0.028313309
0.02970771,0.016652225
0.016082162,0.0069219135
0.003366461,0.010281904
0.00908516,0.0026755626
0.0052164155,-0.032290813
-0.033311717,-0.046273034
-0.046151042,-0.056332752
-0.049363233,-0.059621263
-0.049328946,-0.037080817
-0.030216895,-0.029200464
-0.023456903,-0.025378827
-0.021027379,-0.02134116
-0.021092715,-0.03117075
-0.034500267,-0.031903032
-0.032458752,-0.01510566
-0.0139142545,-0.0044830316
-0.0023452975,-0.02116226
-0.020437764,-0.014527461
-0.014305463,0.027982512
0.033095658,0.049884796
0.054385737,0.07324926
0.074095845,0.087286085
0.0839185,0.08433512
0.07890947,0.067509554
0.057962917,0.11492152
0.10326982,0.04777691
0.040834967,-0.017063636
-0.031237949,-0.0502422
-0.055601656,0.011003661
0.018945029,0.025771772
0.03598844,0.0107743265
0.009882143,0.010207842
0.008701417,0.019512048
0.023302387,0.023050344
0.027836753,0.024119973
0.025703922,0.02537704
0.02450223,0.02402804
0.020514315,0.02436539
0.019459153,0.025052994
0.020231266,0.025919301
0.021949999,0.02892308
0.025167352,0.030685874
0.02522542,0.029788394
0.024482934,0.030378705
0.024896845,0.03427083
0.029811839,0.0347426
0.03125814,0.036101133
0.033399556,0.03512661
0.03175149,0.02536612
0.021369653,0.020851517
0.01735763,0.022497362
0.019512147,0.021339174
0.018312527,0.015814709
0.013920205,0.015683463
0.013984454,0.012464051
0.010218122,0.014547714
0.012182421,0.033979546
0.03368747,0.04220757
0.041833874,0.042340208
0.038726903,0.044218563
0.040034905,0.045707542
0.041669987,0.044487804
0.039538715,0.045839384
0.040215082,0.042758964
0.03720996,0.026887866
0.020136751,0.01835307
0.010685385,0.016529318
0.011206842,0.011952369
0.009253118,0.0038530086
8.100889e-05,-2.5415362e-05
-0.0032230865,-0.0049504363
-0.00651455,-0.006522813
-0.007996689,0.0023791161
0.0011849394,0.005089625
0.0031729448,0.004036476
0.000271061,0.0039000667
0.00056984933,0.0027150756
-0.00021444402,0.0013944694
-0.001985738,0.001605139
-0.00086421845,0.00030974974
-0.003043566,-0.0054450426
-0.007928567,-0.00830864
-0.010627009,-0.008367611
-0.009803503,-0.00935603
-0.011764035,-0.0114182485
-0.015120612,0.18037601
0.08698226,-0.006559149
-0.022666492,-0.0011695038
-0.022398135,0.03124362
0.033784796,0.046038143
0.04897427,0.050209638
0.051051296,0.054925576
0.048920516,0.05701361
0.052177325,0.058155313
0.051513147,0.052003603
0.04518266,0.051894993
0.0498101,0.04951171
0.045936007,0.0372891
0.029962413,0.08729343
0.08549184,0.097733185
0.09242979,-0.07782303
-0.082137935,-0.12496495
-0.09771424,0.061193045
0.08247389,0.11070396
0.09977169,0.024272863
0.00930856,0.007046012
-0.013377814,0.02578607
0.02267891,0.029917853
0.030474024,0.039373163
0.03880334,0.03917798
0.038571555,0.044835478
0.040682245,0.039980948
0.030181285,0.0006715215
-0.011645339,-0.018081045
-0.02069071,-0.015657254
-0.015004596,-0.02242588
-0.023860896,-0.04013324
-0.039437637,-0.04215535
-0.038633358,-0.059488032
-0.054749645,-0.05585423
-0.050375085,0.01064447
0.023149196,0.033551257
0.04286494,0.04079404
0.03937995,0.043030392
0.03993806,0.006400502
0.0007560049,-0.007555908
-0.0144069195,-0.0058937827
-0.0066473703,-0.009304604
-0.009135396,-0.012180709
-0.015712708,-0.01139323
-0.014769677,-0.019620262
-0.021494145,-0.017522106
-0.016174605,0.010269395
0.0147732925,0.018656068
0.019204384,0.029886283
0.028417367,0.030704934
0.028686253,-0.003376272
-0.009757373,-0.012406867
-0.017667273,-0.020205412
-0.020425549,-0.018967405
-0.017359326,0.01807886
0.02010456,0.031121707
0.034132212,0.037349068
0.038158625,0.03952764
0.037554212,0.020453013
0.014884604,0.014271918
0.012623093,0.011136297
0.010294729,0.009585761
0.0083319815,0.01900672
0.018335668,0.020301713
0.02031421,0.020993289
0.019635607,0.01892154
0.015216517,0.004795164
0.001470284,-0.0018400325
-0.004487699,-0.002785762
-0.0037495464,-0.005335439
-0.00400697,-0.008233783
-0.005951372,-0.008900738
-0.0066387863,-0.012178327
-0.0115327565,-0.011697023
-0.011667137,-0.00037527372
0.0026686995,0.004027342
0.0066114026,0.004488591
0.004559539,0.0054138694
0.0037044303,0.0039157527
0.0022769917,0.0027061405
0.001663349,0.0040311147
0.0014961422,0.002669606
0.0010158977,-0.0038871604
-0.0036191836,-0.006475358
-0.0061347815,-0.011777837
-0.009979951,-0.013656787
-0.01360693,-0.0039056265
-0.0022261946,-0.0031900252
-0.0019568948,-0.0047546583
-0.0023783532,-0.0060550114
-0.006375198,-0.027071929
-0.031064874,-0.040884383
-0.040995494,-0.0022460828
0.002631127,0.014343994
0.021153169,-0.110953346
-0.09365328,-0.14111581
-0.10646714,0.074413
0.0966073,0.12942773
0.09502761,-0.017896783
-0.035120696,-0.0567807
-0.071366355,-0.036678936
-0.03518658,-0.036023498
-0.026251135,-0.022439383
-0.016146643,-0.019252932
-0.017568937,-0.014050923
-0.012921011,-0.015466638
-0.018179184,-0.036369186
-0.035936177,-0.043211874
-0.036271792,-0.05427133
-0.045976285,-0.059297018
-0.05464781,-0.026690897
-0.022620223,-0.01799626
-0.010519597,-0.05423281
-0.05119479,-0.06290541
-0.05929886,-0.04047714
-0.03231216,-0.030873112
-0.02360459,-0.04018844
-0.036234595,-0.03606678
-0.03123779,-0.005999217
-0.0013546722,0.004507057
0.0073009953,0.013476099
0.015803523,0.015162845
0.01520931,-0.01148556
-0.014033666,-0.020462345
-0.022316411,-0.021554412
-0.019986328,-0.022591677
-0.019448698,-0.01424948
-0.010655198,0.0223546
0.025016455,0.005827663
0.0056297183,0.0024521854
0.00073994725,-0.000909592
0.00012134076,-0.010182426
-0.00915673,0.0052699153
0.008725309,-0.0019722718
-2.8642782e-05,-0.06983903
-0.07038641,-0.088271126
-0.0775227,-0.108859956
-0.08832864,-0.10477582
-0.09044182,-0.011622167
0.0038064814,0.02579838
0.03842464,0.038548157
0.03983571,0.049939003
0.046403162,0.031661186
0.027069513,0.028243616
0.02799306,0.030551251
0.031409435,0.030670386
0.029481454,0.035835262
0.034251586,0.035211794
0.031959325,0.03355384
0.030466652,0.029160356
0.026805107,0.014919612
0.012087351,0.004823359
0.0020639542,0.0019373257
-0.0003091829,-0.0050669895
-0.0067603528,-0.025588108
-0.026286451,-0.03717791
-0.03630769,-0.03226659
-0.029302819,-0.035693295
-0.033489637,-0.055232745
-0.053831704,-0.0550322
-0.053132437,-0.06859785
-0.06553443,-0.059719153
-0.05685994,0.013928412
0.025355693,0.04283005
0.051386945,0.06477979
0.065889634,0.0742762
0.06949561,0.031477325
0.019636672,0.023022942
0.014180001,0.021921346
0.01941917,0.026861457
0.02712587,0.06758799
0.06956069,0.085060455
0.08288236,0.08784284
0.083467185,0.09283795
0.087519236,0.0932033
0.08554089,0.091671824
0.08329783,0.095251024
0.08810432,0.09139523
0.08601572,0.06989622
0.0606863,0.05912646
0.048765067,0.051937483
0.04392591,0.045265157
0.03869903,0.045628916
0.04003701,0.04114926
0.0335476,0.035512805
0.026870532,0.028942538
0.022494592,0.017263187
0.00988428,0.008586422
0.0007456366,0.0021894937
-0.0037769245,-0.0047532683
-0.010976839,-0.012977323
-0.021288663,-0.020157956
-0.025263853,-0.023742516
-0.024407335,-0.029280681
-0.03190665,-0.03959912
-0.044018835,-0.044620838
-0.046482198,-0.051733766
-0.051174805,-0.053938944
-0.051212277,-0.042737916
-0.03711534,-0.040490642
-0.03582739,-0.03696684
-0.034147833,-0.038085915
-0.036898576,-0.05246287
-0.051620178,-0.055573866
-0.051412582,-0.06866596
-0.061854616,-0.06897253
-0.0636354,-0.033283006
-0.02657779,-0.029007267
-0.024883496,-0.009029602
-0.008812925,-0.0011863812
-0.0013304694,-0.12599666
-0.09305658,-0.07057211
-0.065990806,-0.12268035
-0.08643434,-0.10732233
-0.07994779,-0.027021296
-0.0109239,0.008583443
0.017905304,0.09543131
0.099695615,0.12169928
0.10629413,0.01775263
-0.001890459,-0.012067333
-0.02466271,-0.0033899725
-0.0032234283,-0.0036866174
-0.0007667418,0.014728401
0.017055832,0.023375979
0.021772433,0.023930747
0.019564396,0.027906068
0.023510404,0.037505727
0.03517164,0.042816944
0.04345828,0.041476283
0.039710008,0.04278696
0.03912907,0.049466435
0.04678464,0.04876692
0.044584166,0.05164382
0.04759253,0.047190372
0.04269102,0.020808233
0.01468725,0.00829057
0.0044467347,0.002587006
0.00053057406,-0.003436435
-0.0033319849,-0.003333582
-0.00294757,-0.0056273188
-0.0060951672,-0.010881548
-0.0102410335,-0.014192296
-0.013209749,-0.012292498
-0.01100723,-0.013253119
-0.012838477,-0.020865219
-0.02068583,-0.023900766
-0.022932732,-0.020583466
-0.018426793,-0.021053253
-0.01788705,-0.022136383
-0.019097514,-0.023586847
-0.022566784,-0.029644836
-0.027790986,-0.03261089
-0.030933086,-0.03096723
-0.02935641,-0.03132622
-0.028704926,-0.035519358
-0.033776294,-0.02209012
-0.020461177,0.024997797
0.032134693,0.024157899
0.025095161,0.013544005
0.009094589,0.009367745
0.0061421036,0.008504616
0.0063894554,0.007652804
0.0061307587,0.009586556
0.0075530414,0.0107177375
0.009070297,0.01099413
0.009479696,0.012313743
0.011723574,0.015216456
0.016948337,0.017542755
0.019053785,0.019698892
0.018752746,0.022129633
0.020696262,0.02450041
0.021395857,0.027232759
0.024847891,0.030243289
0.028281337,0.03346985
0.032703042,0.036860216
0.036669143,0.04043306
0.03835401,0.044644468
0.04130469,0.048565976
0.04364469,0.05229747
0.046077058,0.056907777
0.05132914,0.059009906
0.0532383,0.06399171
0.059627634,0.07431372
0.07116736,0.07957371
0.07400313,0.09144388
0.085551746,0.09500878
0.087601714,0.08145842
0.07077492,0.08404761
0.075793885,0.06807207
0.06009736,0.07350718
0.06697925,0.1397281
0.1065934,0.15636306
0.1051752,0.17498536
0.102474764,0.17028889
0.10542188,0.08234518
0.057890594,0.048955347
0.028444124,0.042246886
0.03339703,0.038005695
0.032426246,0.04865652
0.043847386,0.05240866
0.04417224,0.09490553
0.088877484,0.10432708
0.09460949,0.059341297
0.045280777,0.041720904
0.030357953,0.046599664
0.041015673,0.03890437
0.03291203,0.020016186
0.0116183,0.011563593
0.0030207352,-0.010460606
-0.021545472,-0.016062906
-0.025211945,0.015515881
0.016954614,0.013459023
0.014528438,0.042058453
0.041459184,0.031529345
0.026606172,-0.0904364
-0.07818967,-0.12471755
-0.084509164,-0.17054403
-0.09132079,-0.16978931
-0.09442651,0.00224509
0.029774921,0.06068037
0.076010555,0.074898474
0.07029413,0.07388127
0.06376715,0.0059865094
-0.0070031555,-0.024096543
-0.030518131,-0.10284723
-0.078969605,-0.13143018
-0.08715274,-0.059238046
-0.04647148,-0.034684226
-0.025158513,-0.059970327
-0.057863753,-0.05903254
-0.056675933,-0.0010098636
0.0072103334,0.017961513
0.025998136,-0.019507084
-0.02196975,-0.026018778
-0.02996017,-0.012496416
-0.011645202,-0.00010305135
5.808403e-05,-0.008369001
-0.010969362,0.0035289628
0.002828142,0.07160342
0.07832144,0.10359004
0.09418449,0.101210326
0.08722326,0.110404335
0.08990812,0.13331012
0.102515884,0.13286556
0.11192362,0.14524324
0.11635004,0.13332522
0.11007651,0.044752482
0.022863228,0.0030496449
-0.013587526,0.0028141558
-0.00047406944,-0.009339351
-0.007125934,-0.048294548
-0.050159954,-0.060247116
-0.0592014,-0.030198812
-0.02334829,-0.01920905
-0.013766828,-0.0111337155
-0.009181509,-0.0039618183
-0.00146814,-0.00042987702
0.004074116,0.0033562176
0.00601224,0.0086473785
0.010698109,0.008240137
0.009684894,0.013960381
0.013197412,0.011136297
0.007315581,-0.019153057
-0.02367783,-0.032486193
-0.034268744,-0.028946707
-0.027296897,-0.031771984
-0.027683394,-0.042528242
-0.03803857,-0.041184206
-0.036190815,-0.047883138
-0.04049892,-0.040868696
-0.032330606,0.008822308
0.021136986,0.031482287
0.041929074,0.03677146
0.038869586,0.04506779
0.044661295,0.048301697
0.04467002,0.04907925
0.043950483,0.056746546
0.054828323,0.05513426
0.05441359,0.030171609
0.025861355,0.019691346
0.015112222,0.015882218
0.014816592,0.0118654
0.009625376,0.014573527
