Predicted,Actual
-0.0013499318,-0.045124814
-0.0022815235,-0.004015992
0.0003809943,-0.0031202435
-0.024777628,0.0031371256
0.005833517,0.0055745677
0.0030623502,0.007833412
0.006744523,0.008556078
0.01012721,0.0043987622
0.010053848,0.003797529
0.010955739,0.0013470493
0.007015146,0.0015568206
0.0071786097,0.010616684
0.0040035225,0.012663082
0.003961763,0.014141845
0.0129389865,0.0128701795
0.013097691,0.0012078147
0.013665355,-0.004196011
0.01267902,-0.0063352603
0.0014246617,-0.008933165
-0.0009476385,-0.009510997
-0.0023987838,-0.010863145
-0.004702629,-0.012986682
-0.004457529,-0.014406691
-0.005621553,-0.015073028
-0.007368766,-0.01619986
-0.007885212,-0.016322045
-0.0084574735,-0.017184114
-0.009822431,-0.020712951
-0.01017839,-0.021921853
-0.01044639,-0.022329444
-0.013834692,-0.02190121
-0.01377678,-0.019479647
-0.013000611,-0.017900929
-0.012419612,-0.014467032
-0.010646538,-0.012343244
-0.009296711,-0.013864462
-0.0064211804,-0.0112255225
-0.0046633063,-0.011537254
-0.0058333077,-0.0073587103
-0.003602776,0.010726083
-0.0047333813,0.019177109
-0.0010366498,0.02382233
0.01608066,0.027215026
0.020099236,0.024033021
0.021173593,0.024029009
0.021991985,0.023926046
0.020806387,0.024159135
0.020688528,0.027604481
0.020225918,0.027476447
0.019959059,0.028049348
0.022118824,0.02591737
0.021476338,0.016029118
0.022037953,0.010958586
0.020500548,0.006707082
0.011386472,0.0036812774
0.008507258,0.004181469
0.00543592,0.0038306245
0.003480498,0.0012781841
0.0041913916,0.00012703282
0.0034753182,0.006302165
0.0012249056,0.011326145
0.00055047456,-0.006339857
0.0072311605,0.017522004
0.011820535,0.0036747586
-0.0052230554,0.0038480079
0.019384975,0.005046546
0.0031241148,0.0049624704
0.0035613233,0.002377018
0.006590221,0.0014642203
0.0050405418,-0.0003125676
0.004001607,-0.00084643974
0.0033760928,0.0023086544
0.0019613907,0.0025470916
0.0012368591,0.0031613621
0.004831754,0.0024502291
0.0050111823,-0.0045098322
0.0059255674,-0.0076124417
0.004653504,-0.005467342
-0.0026358466,-0.005779241
-0.0043674945,-0.010251966
-0.0013350213,-0.00950849
-0.002353998,-0.012192058
-0.0074563795,-0.009119368
-0.0066456934,0.010814505
-0.009149852,0.01928517
-0.005969097,0.024776414
0.013138856,0.028912336
0.01795969,0.019193405
0.020166162,0.016758386
0.02231843,0.031512912
0.015088726,0.033946846
0.014032716,0.019415546
0.024990143,0.014670368
0.024399877,0.012115922
0.013075494,0.010600805
0.011250786,0.016272485
0.010046785,0.01567869
0.008972663,0.018240074
0.015738418,0.015468419
0.014451486,-0.0034368227
0.01603896,-0.010387858
0.013571505,-0.01695512
-0.0037418439,-0.01897277
-0.007267398,-0.002701704
-0.013327608,0.0017272284
-0.014375306,0.0006735246
0.0026483089,-0.00019698445
0.004414847,-0.009058693
0.0022421433,-0.014933878
0.0015612636,-0.010053311
-0.0057504107,-0.0124956
-0.009149152,-0.034647364
-0.004223416,-0.040756054
-0.0075496775,-0.040909998
-0.025517339,-0.03827198
-0.025793385,-0.015933927
-0.025814783,-0.006097241
-0.025151383,-0.0023628103
-0.004324809,0.0013569946
0.001659576,-0.001105687
0.0026490246,-0.0012068953
0.0060890685,0.001484696
0.00285965,0.001945775
0.0028618518,-0.0015141142
0.0049862373,-0.0026120287
0.004629554,-0.002780013
0.0010719715,-0.002913314
-1.4727916e-05,-0.0016998161
0.00036119338,-0.025337782
0.00050788745,-0.007753849
0.0015143087,-0.0063396897
-0.018145505,0.011027618
-0.00082160893,0.016458187
-0.0002004366,0.021113774
0.014184942,0.021311259
0.016983591,0.004289781
0.019219741,-0.0016958045
0.019655628,-0.0032838818
0.002516234,-0.004304574
-0.0001934937,0.0017022397
-0.00083119766,0.00397245
-0.0023637188,0.003982228
0.0037972513,0.0047608893
0.005086528,0.005784757
0.004849048,0.006715523
0.006237232,0.0063572405
0.0071020853,0.0068628644
0.0076828026,0.00972361
0.007302155,0.010380504
0.008116443,0.01110668
0.010613446,0.010612756
0.010915268,0.0060536987
0.011626843,0.0038849476
0.010635985,0.0030058306
0.0060547185,0.0019013971
0.005079935,0.0013351818
0.004873829,0.0005606159
0.004417213,-7.1372386e-05
0.004140953,-0.0007748166
0.0036746871,-0.0018348721
0.002955662,-0.00241471
0.0024959722,-0.0032704265
0.0016016809,-0.003563772
0.0009670764,-0.0025257801
-0.0002971345,-0.002430422
-0.001186733,-0.0017794623
-0.00029940074,-0.0019553024
-0.0006894759,-0.0042596944
-0.00039985141,-0.0046529113
-0.0007321443,-0.006591666
-0.0023200703,-0.0064213416
-0.0017793566,-0.0003384756
-0.0025134487,0.0010756839
-0.0017798058,0.003460725
0.002944702,0.0030757822
0.0026578635,-0.006646073
0.005197657,-0.00981011
0.0046330485,-0.011718192
-0.0052933972,-0.011965488
-0.0069379387,-0.004647479
-0.0073757204,-0.0019578934
-0.007014521,-0.0012674031
0.00045175967,-0.0006238816
0.0020398395,-0.002315758
0.0024313654,-0.002701871
0.003423734,-0.0029525936
0.001623283,-0.002933288
0.0018800092,-0.0018601115
0.0015257138,-0.0018832615
0.0008633213,-0.00052317465
0.0019640909,-0.0007433927
0.0016283032,-0.0055204118
0.0028978135,-0.0067227106
0.0025909394,-0.007856478
-0.0022840814,-0.0074290796
-0.0031133909,-0.001319052
-0.004217721,0.0011971171
-0.003631143,0.0024254075
0.0030360206,0.003511538
0.0044385563,0.001633876
0.0047928253,0.0013360175
0.0055292216,0.003925314
0.0038460514,0.0045486107
0.004120328,0.0027302862
0.00689446,0.0023197697
0.0066435044,0.0018816736
0.0040014745,0.0020693813
0.0038189224,0.003135287
0.0035674733,0.0028479588
0.0036736617,0.007317508
0.0043680947,0.0089858165
0.0034743354,-0.005551167
0.0076456727,-0.009309918
0.008953345,0.010806648
-0.0050515626,0.0158552
-0.006085205,0.002291605
0.014279805,-0.0009713832
0.01576628,0.0010257064
0.00128428,0.0014261105
0.00042376237,0.0050308337
0.0028705108,0.0068946225
0.003036116,0.0041029095
0.0070684724,0.0045788647
0.0075857816,0.009911652
0.00344718,0.009150709
0.0043627196,0.018185917
0.010005237,0.017626388
0.008596709,-0.016322965
0.016992308,-0.026084684
0.015274136,-0.016777525
-0.016931627,-0.01263308
-0.020304404,0.0014674797
-0.008921446,0.0077708983
-0.00662891,0.01289241
0.006613555,0.015281964
0.0102351615,0.0072257435
0.013382745,0.0051729935
0.0151713425,0.006235473
0.007638167,0.0062965653
0.0065605165,0.009152631
0.0074354648,0.010960926
0.0069701034,0.0060418313
0.009504699,0.0062375623
0.01048486,0.01681154
0.0052226596,0.0168499
0.0061741215,0.025461555
0.017240603,0.022676444
0.01622347,-0.016368847
0.022167962,-0.028378379
0.019514155,-0.033056613
-0.01645751,-0.023015672
-0.022256432,-0.0117944125
-0.023329282,-0.0052566514
-0.014130373,-0.001663127
-0.004311764,0.0003712367
-0.001044018,-0.006648413
0.0015187404,-0.07009387
0.0032709842,0.0035286709
-0.0027800812,0.0020499085
-0.012735424,-0.006338353
0.017487258,-0.00972244
0.00664722,-0.012356449
-0.0054400237,-0.016738662
-0.0045963004,-0.0037768863
-0.010186419,-0.022530273
-0.011511751,-0.013653604
0.00298868,-0.014380533
-0.01595223,-0.0120498985
-0.0057687224,-0.010871335
-0.0070731062,-0.0121648135
-0.00554383,-0.011954875
-0.0042384546,-0.0066227554
-0.007615904,-0.0054213763
-0.0065366565,-0.0077125635
-0.0012348158,-0.007893167
-8.717829e-05,-0.014336907
-0.0028179197,-0.015620356
-0.003132567,-0.0040282775
-0.009673528,-0.0002953513
-0.0098116025,-0.005450126
0.0017888835,-0.0058896425
0.003369513,-0.004004459
-0.0027481373,-0.0029029506
-0.0029145593,-0.0005961349
-0.0008855046,0.00076010753
0.0008657016,0.0010582168
0.0030399342,0.0015963513
0.0047084773,0.002647882
0.003957732,0.0027751657
0.0042378916,0.002917576
0.004983156,0.0024309233
0.0050811186,-0.00043776177
0.0046244557,-0.0022909367
0.003994314,-0.0016547696
0.0014378232,-0.002721344
-0.00029046446,-0.0075877034
0.0014321664,-0.009136084
0.00041032158,-0.011010319
-0.0042280885,-0.01107325
-0.005058422,-0.0044647856
-0.0070136823,-0.0019272215
-0.006688826,-0.002447137
0.00076222996,-0.0020267584
0.0013603593,-0.0016291123
-0.00023547937,-0.0023225276
0.00069306506,-0.0006466138
0.0013897653,-0.0015050882
0.00057061826,-0.01022656
0.0033250365,-0.013559165
0.0021821833,-0.013025962
-0.0074443477,-0.013111709
-0.009103771,-0.0122417845
-0.008134672,-0.010146997
-0.007722168,-0.0107658645
-0.006961397,-0.008255713
-0.0059399614,0.0045631523
-0.0068422765,0.011120971
-0.004147957,0.009515009
0.008575036,0.011881413
0.013311506,0.019981593
0.010126655,0.020360436
0.012897271,0.028448582
0.01900798,0.02611193
0.01791829,-0.0058843773
0.023061592,-0.016472228
0.020383846,-0.023400364
-0.009502083,-0.024442201
-0.0137889255,0.0009831672
-0.016461402,0.010487061
-0.016888894,0.0110577885
0.008692539,0.013155669
0.012828601,0.010931509
0.011270635,0.009656584
0.013608415,0.011343612
0.010570627,0.010198395
0.010236385,0.0022022643
0.012438869,-0.0015732012
0.009785931,-0.0019426828
0.00061712257,-0.003362358
-0.0015789795,-0.0054573966
-0.000105203355,-0.0059275017
-0.0010977127,-0.0075873695
-0.0028427795,-0.007088431
-0.0025765072,-0.0006283946
-0.0040091,0.0020981308
-0.0028470072,0.0035744696
0.0033809606,0.004594242
0.0051647015,0.0033604358
0.0056729782,0.003732341
0.0064509157,0.002163653
0.0048453533,0.0018340363
0.0048247925,0.009788213
0.0027374292,0.0121196825
0.0019875106,0.002606095
0.01026309,0.0003498417
0.01226356,0.0071229474
0.0025118878,0.009103657
0.0014641058,0.006938499
0.008480459,0.006717863
0.009268152,0.008767772
0.006361262,0.008544461
0.006548333,0.008887283
0.008304789,0.0077011976
0.007588321,0.00083206495
0.008286415,-0.00261136
0.006472282,-0.0024132056
-0.00036406625,-0.0038101487
-0.001889595,-0.0071028895
-0.00037605118,-0.007595894
-0.0014500493,-0.0110695725
-0.004256118,-0.01050787
-0.00408942,0.0013475508
-0.006756498,0.005082399
-0.00575597,0.007974234
0.005305439,0.008194704
0.007328691,-0.0023694127
0.009045986,-0.0059692054
0.008705884,-0.0073207677
-0.0019162645,-0.00789183
-0.0041878866,-0.002964712
-0.004698108,-0.0013393605
-0.004868703,-0.0008873911
0.00029843263,-0.0005660482
0.0015509957,-0.002355038
0.002587282,-0.017880872
0.0034043447,-0.0054643336
0.0016014529,-0.0028518867
-0.012120505,0.013379481
0.0016128384,0.021019919
0.002083682,0.021436537
0.015992979,0.024028843
0.020853464,0.028245999
0.018770661,0.028631441
0.02152192,0.031712823
0.023390615,0.030100927
0.022429291,0.014084513
0.023602067,0.0068382937
0.022416031,0.0070034363
0.009172712,0.004587222
0.0053097275,2.3902228e-05
0.0068113487,-0.00057206553
0.0043690233,-0.0042774123
0.00060824206,-0.003140385
0.001112207,0.013576716
-0.0013912147,0.020522736
0.0004802933,0.019075565
0.016115192,0.020133365
0.018579962,0.023945685
0.015114975,0.023572778
0.0164122,0.021766655
0.019650577,0.024235856
0.018746609,-0.000756096
0.01668202,-0.010643679
0.019803407,-0.0138037875
-0.004959241,-0.017870508
-0.00939289,-0.0186714
-0.00886727,-0.019609354
-0.012100082,-0.023104178
-0.011510184,-0.023535587
-0.012551963,-0.016977184
-0.015767755,-0.014550021
-0.015304341,-0.013633045
-0.00887155,-0.012815188
-0.007715978,-0.0145589635
-0.0073321606,-0.01459699
-0.0065034092,-0.014161819
-0.008244425,-0.0134421615
-0.008418958,-0.011126236
-0.008036185,-0.009762723
-0.0076642265,-0.008807887
-0.0052550994,-0.007817783
-0.0036280977,-0.0073951487
-0.002622212,-0.0066739866
-0.0015026501,-0.00539831
-0.0010138132,-0.0044906936
-0.00092596415,-0.00410667
-4.513054e-05,-0.003089154
0.00080509187,-0.0030403465
0.00057721976,-0.0019431843
0.0010513365,0.0022211522
0.0007130551,0.0040058796
0.0015418425,0.0054472843
0.0050718263,0.0060592983
0.006024826,0.003505688
0.0074757067,0.0028079266
0.007954381,0.0029157375
0.005371419,0.002954265
0.0051629455,0.003854443
0.005370516,0.0042241756
0.00534321,0.0043279747
0.0055131563,0.004433278
0.005222309,0.004399096
0.0059044445,0.0044346987
0.0058267647,0.0041908296
0.0056007225,0.0041879877
0.006166135,0.0046126284
0.00638006,0.0044965437
0.0062954044,0.0052818907
0.007574128,0.004999577
0.007431626,0.0023418332
0.007649508,0.0017620788
0.0074052964,-0.00054899906
0.004987156,-0.0007062022
0.004504846,0.006067405
0.0022404331,0.007572326
0.0019894377,0.007683229
0.008418327,0.006526311
0.008677018,-0.00057799934
0.007544187,-0.004660182
0.0067816665,-0.005661903
0.0009459102,-0.007979583
-0.001958812,-0.013955558
-0.002716605,-0.017459324
-0.0047647925,-0.015269679
-0.009519342,-0.015536114
-0.010872666,-0.024122948
-0.006996628,-0.024855392
-0.0075553306,-0.019969309
-0.016622858,-0.020492567
-0.016847149,0.003522737
-0.011959072,0.010729342
-0.013338444,-0.045569763
0.009816521,-0.058011625
0.013237906,-0.0052299914
-0.021841839,0.010304283
-0.022195559,0.009075409
0.007997095,0.010023223
0.013822485,-0.0042567695
0.009909563,-0.008691468
0.010834648,-0.010108135
-0.0045455345,-0.010365042
-0.004571899,-0.00230832
-0.00295153,0.00074548204
-0.0039201747,0.0010547066
0.002248047,0.0018082119
0.0032935229,0.0010904764
0.0034404679,0.0007777417
0.0044076242,0.0013905915
0.0031332064,0.0011563329
0.002809173,-0.00097021315
0.0037156937,-0.001903988
0.0037070976,-0.00215446
0.0015641672,-0.002490679
0.00068120944,-0.002467696
0.0007770592,-0.0024814021
0.00031589184,-0.0027582
0.0005025946,-0.002735217
0.0015696464,-0.0020310208
0.0015188343,-0.0017411853
0.0010787434,-0.0016122303
0.0015136467,-0.0014943907
0.0011365258,-0.0016220921
0.00089000864,0.0055576023
0.0012090888,-0.0030911597
0.000996668,-0.0022585934
0.006511304,0.0065007373
-0.0017822157,0.010145242
0.0004903656,0.008342881
0.008676284,0.00825496
0.010826091,0.011970336
0.009254597,0.013709097
0.008513121,0.004281591
0.011940412,-0.00035577547
0.013481154,0.021404278
0.003205679,0.023653511
-0.0004718284,-0.013000555
0.021189727,-0.02448123
0.020507172,-0.019043138
-0.01459191,-0.016657177
-0.020473083,-0.009926779
-0.01316581,-0.004176789
-0.010988335,0.00838893
-0.0042182934,0.013269665
-0.0013069278,0.02026466
0.010177759,0.021210719
0.011906129,0.0029938794
0.018703416,-0.0047091567
0.018872404,-0.0012195151
0.00039888755,0.0040759984
-0.0042360844,-0.023399696
0.0018852837,0.014695608
0.005665205,0.0020788251
-0.0223909,0.0061940197
0.018174527,0.0054056644
0.0016549308,0.0055301897
0.005859959,0.0060536154
0.00814925,0.005673436
0.0067145946,0.00081777375
0.007129181,-0.0024779758
0.0067749596,0.0026780523
0.0025857887,0.0038530224
0.0001103547,-0.01705683
0.0051062615,-0.023239067
0.0056828363,0.0064710686
-0.015035312,0.0131487325
-0.018381044,-0.010004921
0.012563903,-0.016818058
0.014242008,-0.013856271
-0.008969562,-0.014172182
-0.012796397,-0.013139706
-0.008892433,-0.012178352
-0.008516753,-0.013579307
-0.0053952616,-0.012931523
-0.0055435537,-0.0068179015
-0.009147287,-0.004815463
-0.007898416,-0.0041421894
-0.001316137,-0.00464915
0.00057552085,-0.008175481
0.0005815848,-0.010005673
-0.0012022788,-0.015664065
-0.0046105594,-0.015272102
-0.005514761,-0.016447322
-0.010786485,-0.014827404
-0.009489793,0.012136899
-0.009134698,0.020400718
-0.0076546343,0.0018566849
0.017484907,-0.002395655
0.017764311,-0.000100623365
0.0013400195,0.00047052288
0.00013896753,0.0045833774
0.0030653249,0.0052007404
0.003669765,0.007974234
0.0070725735,0.0073570386
0.0066482453,-0.0036660668
0.008487928,-0.00726611
0.007490379,-0.009116443
-0.0030589409,-0.009965892
-0.0042205,-0.00029267694
-0.0052734637,0.006064981
-0.005450321,-0.009064544
0.0046710344,0.010795533
0.008180336,0.00434494
-0.008485715,0.0053419806
0.013071497,0.009967981
0.0050394335,0.009755953
0.0050153136,-0.005041615
0.010810212,-0.009660846
0.009403795,-0.010130617
-0.004342238,-0.010133458
-0.0067288205,-0.0005257654
-0.006155847,0.0056521245
-0.005303607,-0.0031643708
0.0044692764,-0.0027392288
0.008337216,0.02920944
-0.0013232429,0.037044693
0.00079340144,0.018661205
0.02515794,0.010530854
0.025174305,0.0028767919
0.014156594,-0.0021130906
0.0090100905,-0.017270613
0.0024074311,-0.02165475
-0.0015050109,-0.0036953178
-0.014801784,0.0019312331
-0.017518831,0.0006690117
7.704484e-05,0.0013983638
0.003678589,0.00025682358
0.0033047334,-3.008672e-06
0.0049507543,0.0004275657
0.003073361,0.00041218806
0.0031763497,9.10959e-05
0.0045442465,1.5795527e-05
0.0035457646,-0.00075266947
0.0015580447,-0.0009298468
0.00035083562,0.0005143993
8.9180576e-05,0.00047938174
-0.00027355415,0.0008198631
0.0012728042,0.0002337571
0.00232566,-0.0040090554
0.0034736246,-0.005990517
0.0032221295,-0.005482803
-0.0009342041,-0.00673065
-0.0016833856,-0.0069303922
-0.000107835775,-0.0038702386
-0.0017336525,-0.021107506
-0.0025044226,-0.0037595865
0.00090699684,0.0019341583
-0.015351917,0.007426155
0.0033080173,-0.005069696
0.0067020515,-0.007438858
0.008942334,0.0008173559
-0.0036659986,-0.0062158327
-0.004622771,0.0034480216
0.0049918788,0.0023743436
-0.0035981995,-0.0033230782
0.0072099403,-0.0056592287
0.0037377747,-0.007262934
-0.002133692,-0.007870435
-0.0018205841,-0.005100702
-0.003535844,-0.004611375
-0.0038464407,-0.0023282107
-0.0013605572,-0.0021997571
-0.0010005477,-0.008180245
0.0009647106,-0.008678096
-0.0007086025,-0.01181096
-0.005909465,-0.010198479
-0.0046518315,0.0054818005
-0.007149874,0.010871335
-0.004842089,0.01653892
0.009840131,0.018405719
0.012358485,0.0019844698
0.015913026,-0.002812189
0.015843585,0.0055535906
-0.00011344478,0.00738863
-0.0015813734,0.005610087
0.00764025,0.0045871385
0.0075581414,0.006729731
0.005266884,0.0058298036
0.0041721063,-0.0015713625
0.006771673,-0.0043078335
0.0061146566,-0.007437855
7.332426e-05,-0.0081993
-0.0006942717,-0.0020699664
-0.0038936504,-0.0013210577
-0.0042451774,0.0031477395
0.0021176129,0.0026360145
0.0018024326,-0.013056048
0.0055405754,-0.016624333
0.0049661966,-0.02108051
-0.010004255,-0.019415546
-0.0112547595,0.004130071
-0.014949002,0.013400792
-0.013266669,0.017316913
0.009986877,0.01985949
0.014812454,0.012682639
0.015545847,0.01088362
0.01788371,0.009983108
0.009879391,0.009705224
0.009064354,0.013636388
0.009632837,0.01355131
0.0089149345,0.015697496
0.01396144,0.014157891
0.013226559,0.0013834041
0.0144222295,-0.0033241648
0.01238078,-0.006585732
0.00063688867,-0.0076338365
-0.0018074287,0.0008370794
-0.0047863713,0.0034857972
-0.0048223212,0.003958577
0.0040729595,0.00419108
0.0048088874,0.00079671305
0.0049474537,-0.0003384756
0.005659617,-0.0008548807
0.0021372805,-0.0010930672
0.0018259654,0.0005124771
0.001258843,0.0008502841
0.00090551504,0.0011015083
0.0019722595,0.0009793227
0.0023575819,-0.00096235715
0.0030262999,-0.0017074214
0.0032342442,-0.0015552327
0.0017286885,-0.0015991091
0.0009242257,-0.0015880774
0.0017330644,-0.0012361463
0.0016539338,-0.0013561589
0.0018939612,-0.0007941223
0.0019091172,0.0016083859
0.002014122,0.0028362584
0.0028262474,0.0035827432
0.0053942897,0.0043906556
0.0056513455,0.004081514
0.0052852747,0.0042308616
0.005891469,0.0066465745
0.005930221,0.008033906
0.006371978,0.0038073072
0.0083897505,0.0034835406
0.009058324,0.011957549
0.004215597,0.014787205
0.0040813843,0.011376541
0.012618383,0.010427138
0.014349684,0.012905698
0.009929292,0.012657316
0.009353229,0.008013765
0.011975044,0.0066820933
0.011592831,0.0035533253
0.0073205023,0.0032364954
0.00659224,0.010652537
0.003757413,0.011574528
0.0038668413,0.015775805
0.0111946175,0.014683573
0.0110369325,-0.0033826667
0.014939206,-0.008915364
0.012851567,-0.01200995
-0.0050494657,-0.011862525
-0.006830784,0.004244651
-0.008495672,0.011423343
-0.007522565,0.00930833
0.009065367,0.0114440685
0.01291244,0.019903285
0.008855246,0.02130073
0.011347416,0.024823382
0.019162534,0.022850111
0.019612793,0.0027739955
0.021551874,-0.0062089795
0.019777093,-0.0069425944
0.00073247997,-0.01010755
-0.004697527,-0.013676336
-0.0033212265,-0.014258766
-0.006476867,-0.018860111
-0.009122556,-0.01791355
-0.00879781,-0.0017986009
-0.0130543485,0.004200858
-0.010680818,0.007301629
0.0052224747,0.008743368
0.008112285,0.0011064392
0.009208003,-0.0010930672
0.010036616,-0.0014546929
0.0017913552,-0.0015664316
0.0005448942,0.0019225414
0.0009557674,-0.0052692713
0.0006465809,-0.003287977
0.003930242,-0.0028105176
-0.005919503,0.0023631447
9.112146e-05,0.0069568856
0.00052464067,-0.006115293
0.0051714093,-0.009468708
0.009490213,0.03402365
-0.0036554087,0.044112146
-0.005171147,-0.0063931774
0.020640034,-0.021344189
0.018362153,-0.001158673
-0.010847912,0.0016732395
-0.01749243,-0.005195308
0.0048493287,-0.0075098122
0.0048509934,-0.009498211
-0.00085135584,-0.010045705
-0.0026466423,-0.01168819
-0.0060348418,-0.009749602
-0.005306765,-0.0057992986
-0.0057420554,-0.010148167
-0.003864341,0.0248986
-0.00035207355,-0.024532963
-0.0035662237,0.0050719525
0.021172987,0.033631187
-0.020236755,-0.016959634
0.00974185,-0.025018863
0.018363727,0.009066299
-0.014842324,0.018917527
-0.012336335,0.013779467
0.013325914,0.013325993
0.013840044,0.008897646
0.013283138,0.004133999
0.010166599,0.010354511
0.0054920847,0.0068538385
0.0024302683,-0.020099685
0.009975389,-0.027622534
0.004733786,-0.03914792
-0.020399889,-0.038655
-0.02178967,0.002246308
-0.025413679,0.01574505
-0.024457032,0.022694329
0.010856182,0.024070045
0.013908029,-0.0025427458
0.013712669,-0.012058841
0.014908969,-0.0138212545
-0.0057797674,-0.015868153
-0.008119395,-0.009871035
-0.008485825,-0.008039004
-0.012100988,-0.00830335
-0.006776698,-0.007862913
-0.004563482,-0.007949413
-0.004923747,-0.0073205167
-0.0045497892,-0.007573078
-0.004155839,-0.005867495
-0.003051303,-0.0040301997
-0.0019841006,-0.0038753366
-0.00061827333,0.0114088
0.00085311866,0.0134462565
-0.00097071205,-0.011568929
0.014477945,-0.018729903
0.01344991,-0.021230862
-0.011532297,-0.0207585
-0.013121578,-0.0032796196
-0.013381009,0.0036998307
-0.012916251,0.006304171
0.0042413417,0.008695146
0.008429799,0.0050422
0.008963807,0.00470105
0.011505538,0.006345958
0.006775672,0.00729837
0.0069901966,0.008532343
0.007852899,0.0097619705
0.007303374,0.010267093
0.009587498,0.011227445
0.011775745,0.014236534
0.010212635,0.015863892
0.010852551,0.0148426145
0.013386763,0.015137297
0.014136714,0.018216005
0.013507894,0.01803983
0.013737992,0.019289766
0.014889552,0.017630568
0.013525063,0.006756976
0.013669918,0.001779128
0.012643557,0.00025281202
0.003590536,-0.0017128537
0.00086660055,-0.0020112137
-0.00014246069,-0.0023318878
-0.0012147821,-0.003996352
0.0013211361,-0.0040282775
0.00030523373,-0.00030730243
-0.0017746384,0.0011334335
-0.0011350022,0.0018142292
0.0032914067,0.0023488535
0.004334943,0.0013182998
0.0043028784,0.0013372712
0.0045943763,0.0015270682
0.0026874407,0.0019598156
0.0024552138,0.0036231098
0.0024965848,0.004482002
0.0033010659,0.004914248
0.004874932,0.005357442
0.0052049146,0.0054739444
0.0047682,0.0056707617
0.006125962,0.0060011307
0.007196908,0.006171037
0.0072449367,0.006063143
0.0075631393,0.0060943994
0.0073072757,0.006125322
0.006424382,0.006161844
0.006661051,0.006380223
0.0069086347,0.006440397
0.0062614125,0.0063253986
0.005939179,0.0062871217
0.005796411,0.0061664404
0.006775243,0.0059244093
0.0074199303,0.0064900396
0.0071672625,0.006462126
0.0057483437,0.004203867
0.0054141628,0.0035737173
0.005908987,0.0048286677
0.003816213,0.005209265
0.0035256036,0.0055554295
0.0053199115,0.005804564
0.0055536088,0.005595712
0.0051040156,0.005585767
0.0051422236,0.0061055147
0.005777079,0.076618336
0.0059448746,-0.009129314
0.006127086,-0.010688308
0.01032895,0.020733094
-0.019698184,0.028446242
-0.010745774,0.004349035
0.02301571,-0.0036195996
0.022203282,-0.002937634
0.0023204528,-0.003837227
-0.0032367292,-0.010992601
-0.001398994,-0.0115025705
-0.001696327,0.0017099286
-0.0065626297,0.0049938103
-0.005476716,0.0119842095
0.005222209,0.0032040686
0.0059789172,0.0040591164
0.013200143,0.0013782225
0.0034738253,0.0026192998
0.0047059166,0.001022447
0.0017850563,-0.006074258
0.0032396761,-0.008342964
0.0018875797,-0.012694005
-0.0050523635,-0.013175309
-0.0049620187,-0.0015190451
-0.007968027,0.0013303345
-0.0073738387,0.0033873469
0.0040858523,0.0026379367
0.00499749,-0.010923067
0.0063804258,-0.016573854
0.0052105556,-0.015759006
-0.00809896,-0.016947014
-0.011938347,-0.019298792
-0.009677869,-0.01850116
-0.01158486,-0.020687629
-0.013159395,-0.018322896
-0.011732578,-0.002375848
-0.012879645,0.0049904673
-0.009870691,0.0069992575
0.004608251,0.009836519
0.009503238,0.010852196
0.0097140735,0.011356567
0.011998743,0.013562091
0.011117092,0.013392686
0.011678882,0.006946104
0.013745631,0.0040086377
0.012225657,0.0044391286
0.0057218797,0.0031308576
0.0049743406,0.0006111783
0.006446047,0.00020041098
0.004446477,-0.0051520164
0.0028919585,-0.005945303
0.00438195,0.008114639
-0.0007901249,0.010995776
-0.00096533156,0.0073337215
0.013226543,0.004441552
0.0130039975,-0.0077569415
0.008468083,-0.012906116
0.0051543,-0.014600417
-0.0064583234,-0.015784329
-0.008742183,-0.011421337
-0.009807953,-0.0083661135
-0.011134399,-0.012161136
-0.006182867,-0.010227311
-0.0035314977,0.005317243
-0.0074614035,0.010202156
-0.0049671694,0.014597241
0.009893318,0.014709481
0.012359514,-0.0019980925
0.014788742,-0.008420019
0.015155426,-0.008028808
-0.002101679,-0.009284344
-0.006005421,-0.009397336
-0.0038050567,-0.008235487
-0.004897933,-0.010116492
-0.00551869,-0.00813946
-0.004301934,0.0037725405
-0.0063301357,0.0090678865
-0.0032175975,0.012661411
0.009072573,0.014645713
0.011773003,0.011774689
0.0128622,0.012509306
0.014496629,0.007190308
0.012436743,0.0056714304
0.012637348,0.026684329
0.0063660694,0.031882063
0.005268009,0.0072742165
0.024009101,0.00032192792
0.024509244,0.012636924
0.0031283163,0.014219736
0.00012915827,0.010982823
0.014204079,0.008820925
0.013589524,0.0024381944
0.010112969,-0.0010732602
0.008657265,-0.0017736121
0.0021447188,-0.003330934
-3.661748e-05,-0.005868164
0.0011012732,-0.0064023705
-0.00046421794,-0.008378984
-0.0038483273,-0.007860406
-0.0035744272,0.00012511062
-0.004355273,0.00348329
-0.0033226365,0.003937683
0.0039234636,0.0049510207
0.0051224325,0.0050909235
0.0055532944,0.0049422453
0.0062847417,0.00595926
0.0049552885,0.005548827
0.005628928,0.0013948538
0.0075868885,-0.00042087978
0.0066983933,-0.00082730124
0.0023723254,-0.0014689005
0.0013172635,-0.0015623365
0.0015216325,-0.0016049594
0.001220394,-0.0021927368
0.0015962241,-0.0021321455
0.0011467331,-0.000436341
-0.00014893014,0.0002571579
0.0006624167,0.00035452185
0.0029300097,0.0005606159
0.0031496778,0.00053345424
0.0029004088,0.00050236465
0.0025647043,0.00070494856
0.002518826,0.00065212965
0.002623263,-6.393428e-05
0.0026635,-0.00036521934
0.0023447524,-0.00037424537
0.0015656,-0.00045297228
0.0017679387,-0.0005065434
0.0017959882,0.022350088
0.0017997968,-0.0028328318
0.0018537997,-0.002508731
0.016705537,0.0040634624
-0.0043511386,0.0063102716
-0.00061079115,0.0058572157
0.0071468744,0.005134215
0.0073541547,0.004568919
0.007945037,0.0033878481
0.005445941,-0.0043292283
0.0051429896,-0.0071138376
0.004639885,-0.0032835477
-0.0029286582,-0.0029648792
-0.004182373,-0.0028895787
0.00010304204,-0.0032874756
-0.0010799413,-0.0070929443
-0.0011002857,-0.0075879544
-0.0020167578,-0.008859369
-0.00497772,-0.007907877
-0.0028555414,0.0010417526
-0.003968623,0.005094935
-0.003500442,0.004868115
0.005022843,0.0060903043
0.0075275037,0.008651603
0.0062967,0.0087657655
0.007671178,0.010508957
0.0097642895,0.009457176
0.00908216,-0.0005773307
0.010503334,-0.005146417
0.008851693,-0.004709658
-0.0006806978,-0.0060953186
-0.0035475977,-0.009451158
-0.0013483922,-0.00966586
-0.0022658063,-0.011896205
-0.005076273,-0.010555926
-0.004664015,0.0016602855
-0.006776158,0.0070347767
-0.0046058507,0.008338952
0.0069809747,0.010221044
0.00974739,0.01033671
0.009043101,0.010401898
0.0106349485,0.011885508
0.009987424,0.011616316
0.010169372,0.007048817
0.012043329,0.004998658
0.011141886,0.004679404
0.006757862,0.0039303284
0.005818205,0.002831244
0.0062790895,0.00222274
0.005677985,0.002809431
0.004409575,0.0028382642
0.004074464,0.002042554
0.0045829066,0.0028097653
0.004515211,0.0010445942
0.003817669,0.0021909818
0.0045567183,0.011465882
0.0031140542,0.014650144
0.0040278328,0.0170056
0.01259863,0.017374579
0.014551535,0.009765899
0.015980916,0.0070183123
0.015530867,0.006551383
0.007837872,0.005919562
0.006344972,0.0074340943
0.006712484,0.0078941705
0.006315942,0.00745808
0.008032278,0.0075092274
0.008008658,0.008169548
0.007168647,0.008363941
0.007910228,0.008516631
0.008799179,0.008482366
0.009635015,0.007837006
0.00967307,0.0075910464
0.009860501,0.0072593405
0.008728175,0.0070889327
0.008393355,0.0077293618
0.0077702235,0.0077779186
0.007681663,0.007292603
0.0083754305,0.0069374125
0.007940841,0.0066159028
0.0072169024,0.005967701
0.007060803,0.005833982
0.007000956,0.0049951477
0.006102607,0.0025218523
0.0059104892,0.0012527776
0.0051376703,-0.00051373075
0.003178856,-0.0016342103
0.0026223727,0.0006205386
0.0011669535,0.0006092561
0.0005280541,-0.0027439925
0.003384379,-0.0038488437
0.002880022,-0.0048662764
-0.0004274983,-0.008896643
-0.0009947555,0.002875204
-0.0016001278,0.00687515
-0.0048713493,-0.045806948
0.0068498985,-0.059030898
0.008971233,0.015156269
-0.021227928,0.035364266
-0.02064566,-0.0063933446
0.022504348,-0.015872583
0.017005881,-0.006671563
-0.009122878,-0.0047014677
-0.011544233,-0.0024167993
-0.0014440115,-0.0013259051
0.00012427906,0.0020611074
0.0037563082,0.0029602826
0.0032635757,-0.003705514
0.0041282615,-0.00501788
0.0051707295,-0.0033698797
0.00040181153,-0.003077537
0.00013711366,0.004776183
0.0008276284,0.0068840086
0.00072933774,-0.0038398176
0.009145927,-0.0067244656
0.00956663,-0.0010759345
-0.0023337235,0.00065204606
-0.003536117,-0.0013102767
0.003026511,-0.0009911067
0.003908828,0.0027006173
0.001712352,0.0040604537
0.0024556674,0.00483293
0.0057037342,0.005110898
0.0061388826,0.0031047824
0.0068533695,0.0024766384
0.0068501113,0.0021344856
0.0045132074,0.0019860577
0.0043738517,0.0030804623
0.004006143,0.010187363
0.0037941844,0.0017688484
0.0052224514,0.0012175093
0.011085493,-0.00376201
0.0022997519,-0.0057977107
0.0031996628,-0.0059379484
-0.00084074866,-0.006339188
-0.002667038,-0.0059542456
-0.0023247825,-0.0052909167
-0.0023987999,-0.005918643
-0.0011045228,-0.0051496765
-0.0005213538,-0.0002642617
-0.0010544843,0.002015643
0.00050544715,0.0018267654
0.004686083,0.0024994542
0.0045678564,0.004035298
0.0039129388,0.0039383518
0.0051394706,0.0053204186
0.0059220325,0.0044426387
0.0047070626,-0.0027928834
0.0063651274,-0.005765702
0.005624836,-0.0075388127
-0.001600433,-0.008617505
-0.0034372904,-0.0057699643
-0.0035881177,-0.00525147
-0.0037476881,-0.00577197
-0.0011324553,-0.005920398
-0.001215978,-0.008163279
-0.0011563429,-0.009581032
-0.0012998909,-0.00539154
-0.0038291155,-0.005366468
-0.0045994474,-0.014011636
2.1641108e-05,-0.013814234
-0.0011518716,-0.02061567
-0.010069029,-0.017443612
-0.008216203,0.014711988
-0.013829794,0.025304938
-0.009821121,0.03516101
0.019541074,0.0365104
0.019457152,0.0059004235
0.020432452,-0.003624614
0.02271928,-0.0061942707
0.0016945527,-0.0064918785
-0.0012817914,0.010524753
-0.0024169735,0.0177571
-0.0034933945,0.017533036
0.012960495,0.019961536
0.017368905,0.024667852
0.01602344,0.026382543
0.016826753,0.02759905
0.01958527,0.027262663
0.021226702,0.021499803
0.021963703,0.017959097
0.02167993,0.018706251
0.017213752,0.016404198
0.013692602,0.007637765
0.0149351135,0.004092212
0.012418864,0.0007957937
0.004541851,-0.00033471477
0.0031846396,0.00683002
0.0012410863,0.008993087
0.00043509202,0.0079762405
0.008080099,0.0077320365
0.00940672,0.0067720194
0.0075023365,0.005441768
0.008001855,0.0055791643
0.007761267,0.0040953876
0.006786899,-0.0018479096
0.006301692,-0.0048178867
0.004785907,-0.0061087743
-0.00023302805,-0.0074740425
-0.0023304624,-0.007727189
-0.0036049858,-0.008092993
-0.0041927784,-0.009121458
-0.0033466069,-0.009270972
-0.004040984,-0.0077561056
-0.0055742515,-0.0072157984
-0.005453557,-0.0063147848
-0.0032727954,-0.0059063574
-0.002201417,-0.007383448
-0.0011090046,-0.007184291
-0.0011401287,-0.007143256
-0.00320155,-0.006197029
-0.0029625122,-0.0017911628
-0.0028194156,0.0005527599
-0.0024671927,0.00092675455
0.0018417239,0.0020550902
0.004033933,0.004148123
0.00465492,0.00491149
0.005753067,0.0062191756
0.006648276,0.0063874107
0.0065690666,0.0023194354
0.006979249,0.00066633726
0.0061892206,0.0024946905
0.003567183,0.0025043015
0.002147466,-0.00074230623
0.004809406,-0.0003858622
0.0043674335,-0.0018815064
0.0008185843,-0.0001254449
0.0014522768,0.012625307
0.000360299,0.018234726
0.0024472426,0.018501911
0.0148033295,0.019937467
0.018271856,0.021460272
0.017052187,0.020920215
0.017915305,0.021693612
0.01917497,0.018684188
0.018285606,0.010868243
0.018930228,0.010066098
0.01573348,-0.014719175
0.008029982,0.0157168
0.009179055,-0.011348376
-0.013899546,-0.01342578
0.019112537,-0.016655423
-0.010182664,-0.016634947
-0.010276978,-0.0046785683
-0.010626032,-0.00031791633
-0.011677416,-0.0015824779
0.0019229212,-0.0011910163
0.0040866844,-0.002071638
0.0021253892,-0.0025991583
0.0023727515,-0.0021898118
0.0012854735,-0.0025498495
0.00095707347,-0.004961969
0.0010564615,-0.0060687424
0.00032398372,-0.005730434
-0.0017701286,-0.005951404
-0.0026820132,-0.0069949115
-0.0024826804,0.0252288
-0.0029411523,0.004680825
-0.0030819972,0.004375027
0.015683835,0.001459373
0.004794217,0.00012945647
0.0060087238,0.00043625743
0.0045453976,9.8032564e-05
0.0023250007,-0.0011748864
0.0038964236,-0.0012036359
0.002512213,-0.0017348337
0.0007089375,-0.001192437
-9.311303e-05,0.0032035671
0.00017773393,0.0053642113
0.0009681202,0.0047241165
0.005454883,0.005444443
0.0066892076,0.008372048
0.0058718114,0.008707347
0.0066007846,0.010531271
0.00957933,0.009851395
0.010167835,0.0009195672
0.011609468,-0.0026391067
0.010743495,-0.002404514
0.0016044794,-0.0029641269
-0.0005612342,-0.002860495
0.0005945673,-0.0016585304
0.00026909215,-0.0028417744
0.000976752,-0.0008824602
0.0020788459,0.008486795
0.000814641,0.012647203
0.0028705208,0.017717067
0.011994283,0.019914651
0.014329254,0.013620927
0.01812339,0.014196419
0.019531017,0.0110577885
0.01268905,0.013596774
0.013606769,0.034000415
0.010278376,0.040641394
0.011929705,0.04609185
0.02542517,0.046384778
0.02291911,0.02766499
0.022092178,0.02101574
0.023372125,0.01839059
0.01901018,0.016660104
0.016609363,0.023818152
0.015630543,0.025504095
0.014072897,0.02393808
0.019949647,0.023008235
0.019692581,0.020861045
0.01798123,0.018670147
0.017449193,0.017945977
0.015899735,0.01567535
0.014842841,0.009522781
0.0138358725,0.00598124
0.012048924,0.0035071087
0.006731434,0.0013731244
0.0042802207,0.00048681983
0.0026938636,-0.0011216496
0.0010890691,-0.00082571333
0.000558034,-0.0023914764
-0.00023618729,-0.0069475253
0.0009672189,-0.0076355916
-0.00022240274,-0.016191836
-0.003751159,-0.017833235
-0.0030105852,0.0060411626
-0.010029177,0.011276252
-0.009862858,-0.00049074786
0.012562365,-0.005932182
0.012276357,-0.01754131
-0.00094990333,-0.024051575
-0.003407318,-0.024046225
-0.013085642,-0.025970105
-0.016650151,-0.031060442
-0.01356073,-0.029827556
-0.0142832305,-0.03360252
-0.021334432,-0.029167654
-0.019874647,-6.443573e-05
-0.022527944,0.013515958
-0.018006952,0.017949069
0.009097723,0.023566594
0.015397048,0.024723846
0.015330132,0.025992837
0.017925417,0.031056933
0.02126016,0.031621143
0.022435138,0.022232499
0.023170687,0.019250987
0.022638066,0.017217962
0.016814249,0.016488275
0.01529182,0.022998873
0.01458582,0.024439026
0.014518364,0.023402872
0.02068436,0.02294405
0.020897007,0.016884083
0.0188276,0.012261091
0.01886601,0.02352163
0.014654127,0.0235284
0.010756675,-0.007821628
0.021962263,-0.012305468
0.020161519,-0.010658054
-0.010411328,-0.0032653285
-0.008844835,0.05059692
-0.005589383,0.06785508
-0.00066151697,0.06675457
0.02045762,0.06407945
0.013325561,0.030732665
0.019122534,0.016271316
0.023910688,0.013543119
0.019602628,0.006968001
0.011095682,0.007007197
0.011397396,0.0026157897
0.004575822,-0.010083397
0.005100275,-0.016965317
0.001417382,-0.021362156
-0.008893842,-0.022023898
-0.0129521545,-0.029415285
-0.014505782,-0.02757356
-0.013106758,-0.0003286974
-0.020142633,0.011216914
-0.017297262,0.013562508
0.007363852,0.017315242
0.013711441,0.016904809
0.013368364,0.016710833
0.015999254,0.019967971
0.014026941,0.019329464
0.014109996,0.009390901
0.017915683,0.005229657
0.01627452,0.0040561077
0.0064335903,0.0025882937
0.004294351,0.0032656628
