Predicted,Actual
0.006298042,0.13251276
0.0038458947,0.030295063
0.0027264848,0.024025375
-8.250702e-06,-0.025557993
0.011235537,-0.048482917
0.015235814,-0.045206103
-0.025968026,-0.051600486
-0.022932157,-0.070750326
-0.02512304,-0.07130794
-0.02489705,-0.080663644
-0.018208778,-0.071414106
-0.017035466,-0.003741281
-0.013014349,0.028334785
-0.016630264,0.036728002
0.0056633824,0.05147504
0.0009232256,0.059305143
0.010580847,0.07597866
0.02767497,0.07419665
0.046107583,0.064728774
0.041471876,-0.002241714
0.029938485,-0.02865553
0.02346045,-0.046654094
-0.015046025,-0.05476237
-0.01908749,-0.018160813
-0.014091543,-0.008113037
-0.01600418,-0.009460619
-0.005149946,-0.009781364
-0.00078608125,-0.025189174
-0.003261288,-0.032365263
-0.0026428504,-0.02632668
-0.013156893,-0.027952945
-0.015553115,-0.042530973
-0.01142364,-0.042708494
-0.014334128,-0.054905344
-0.01915894,-0.05011394
-0.028352777,0.0047132834
-0.029874196,0.02334282
-0.033027545,0.036573015
0.012730368,0.038190015
0.0082127275,-0.0034598464
0.011913444,-0.01741416
0.013074472,-0.031454604
-0.00790404,-0.040347345
-0.0143318735,0.0015854499
-0.0203581,0.011625214
-0.022728836,-0.04640195
0.013905732,-0.060726088
0.013293488,-0.021145426
-0.030666541,-0.013920511
-0.026706612,-0.0081974175
-0.0041813697,-0.010784916
-0.0018926447,-0.051366873
0.0011711823,-0.06065798
0.0003059388,-0.07571124
-0.03352441,-0.07186555
-0.037702005,-0.004675725
-0.034375668,0.019687673
-0.030229859,0.034041103
0.014660965,0.039272938
0.02049516,0.0016856047
0.021506513,-0.008993647
0.02270739,-0.0144270435
-0.0030465405,-0.014806129
-0.0057566194,0.010365017
-0.008522939,0.016789194
-0.007918521,0.025578525
0.015159155,0.026240047
0.008761227,-0.010066805
0.008591852,-0.021883314
0.008055967,-0.009444594
-0.010418988,0.0021222795
-0.013952519,-0.019307084
-0.0037627865,-0.018380152
0.00638418,0.09342136
-0.01841029,0.123567194
-0.015659995,0.03530956
0.023563243,0.012567921
0.0140269315,0.018313298
0.013998616,0.018995853
0.0075863027,0.041467827
0.016067198,0.045742933
0.017049318,0.05801715
0.022069229,0.05578545
0.020288445,0.010183486
0.024917621,-0.002762769
0.024687693,-0.01803587
0.00226837,-0.018993098
-0.0030479147,0.03877667
-0.01612057,0.05767387
-0.01430787,0.05011469
0.034233622,0.04288677
0.033060808,0.043359753
0.030908553,0.0344928
0.02630391,-0.033892624
0.027582325,-0.057741474
0.023962291,-0.028226117
-0.019955453,-0.013058679
-0.0207609,-0.033569124
-0.018384058,-0.022294201
-0.0058768573,0.06456327
-0.020260397,0.10330313
-0.0113001615,0.1057434
0.018438892,0.11777424
-0.0034904159,0.12941824
-0.008294897,0.12732175
-0.0040939096,0.14738199
0.0067236456,0.1408226
0.020078098,0.05100006
0.0158329,0.015392786
0.013650383,0.03055196
0.018819802,0.02504395
-0.0005229602,0.014641875
0.02217109,0.007154305
0.017891107,0.0024427746
0.009925249,-0.0030740001
0.0034656385,-0.010975961
-0.0005781269,-0.016814232
-0.003285973,-0.018362124
-0.009055247,-0.021730328
-0.014511634,-0.02945076
-0.01782467,-0.031648405
-0.019772967,-0.035893716
-0.021257693,-0.035065684
-0.020140044,-0.019238478
-0.010436264,-0.012654554
-0.0095325345,-0.0095357355
-0.004642447,-0.006567398
-0.004660485,-0.0105232615
-0.0048630824,0.25032333
0.00018854004,-0.007955293
-0.0037834432,-0.006284962
-0.020056222,0.003347673
-0.018212603,0.0069610067
-0.008458736,0.013029634
0.013897936,0.014514679
0.0019032145,0.0032853268
0.02117793,0.0024270003
0.012898026,-0.0038038779
-0.0023437024,-0.0017209093
0.0028257254,0.027841521
-4.4284152e-05,0.03695911
0.006053795,0.041064203
0.013575663,0.040073924
0.014586789,0.016467948
0.0132530825,0.0052138064
0.020743389,0.002115519
0.009502866,-0.003963875
0.0012775214,-0.011031296
0.0006890626,-0.016666003
-0.00711732,-0.022296203
-0.0129615655,-0.026858253
-0.015881736,-0.028627988
-0.01778634,-0.031790625
-0.025803924,-0.03507044
-0.021743761,-0.03783872
-0.02340348,-0.043883312
-0.01726884,-0.048214253
-0.020907788,-0.042094044
-0.027309563,-0.04276333
-0.028987274,-0.060267128
-0.024077218,-0.061078884
-0.029196344,-0.06708166
-0.027156832,-0.060897853
-0.027657222,-0.011030044
-0.028399881,0.0117428955
-0.030413646,0.011036554
0.003237124,0.017901663
0.0059378576,0.030897995
0.011817391,0.030790579
0.012768206,0.041156597
0.012242887,0.03457668
0.014611122,-0.022945708
0.0017635224,-0.048473403
0.008094103,-0.05307151
-0.020424778,-0.061869353
-0.023721056,-0.06578916
-0.024344258,-0.066073604
-0.027074115,-0.07489924
-0.03226435,-0.07231024
-0.032858033,-0.039190058
-0.020051818,-0.02470818
-0.020431865,-0.020913817
-0.018229688,-0.015476164
-0.011070578,-0.015235293
-0.00866975,-0.014284824
-0.006799387,-0.009652415
-0.007339356,-0.008893743
-0.0042314916,-0.017962757
0.00010288353,-0.021301916
0.00035839455,-0.019023145
-0.012394173,-0.019152345
-0.01212501,-0.022001248
-0.007990271,-0.020997446
-0.006841063,-0.023506824
-0.010350342,-0.021010967
-0.008609515,-0.003782595
-0.010840394,0.0032440128
-0.00874997,0.007099971
0.0045778807,0.0088579375
0.014166878,0.002674633
0.01472735,0.0012459253
0.014510348,-0.004080806
0.0061524357,-0.0069039185
0.0066180234,0.008226963
0.00073753437,0.010404327
-0.001635655,-0.010796433
0.011633013,-0.0128869135
0.009471411,-0.02129666
-0.014924439,-0.018473046
-0.012751367,0.0344918
-0.014146185,0.05344759
-0.010777743,0.036374457
0.009530769,0.035860665
-0.0031722526,0.036728255
0.018322453,0.03871157
0.02592878,0.04790878
0.027435238,0.052396465
0.02905153,0.05321598
0.031721804,0.054861274
0.029804481,0.056977045
0.020474834,0.057430744
0.017892698,0.05807474
0.029604439,0.057322327
0.032163933,0.051578954
0.027105391,0.047963865
0.023196382,0.049626935
0.033502564,0.049142938
0.030351086,0.03555945
0.032164983,0.030113533
0.034887675,0.050073374
0.02130863,0.05273474
0.01765455,0.02873365
0.036931388,0.021826226
0.03139744,0.020536233
0.0125086205,0.019806106
0.011794336,0.035880696
0.011662425,0.043243073
0.013771157,0.027779927
0.03093893,0.026717035
0.034548562,0.056632012
0.019924311,0.055470966
0.02352541,0.0668811
0.043451376,0.054007456
0.037847172,-0.04434002
0.037050538,-0.08783472
0.028903205,-0.08668044
-0.011443263,-0.098939635
-0.0016536807,-0.11293977
-0.00308253,-0.1057777
-0.000120704084,-0.14031757
0.0009468616,-0.12588727
-0.0077220863,0.021762379
0.0025486248,0.073712155
-0.0042395843,0.111656785
0.01610524,0.119698964
-9.0776055e-05,0.010609644
-0.008719515,-0.2353001
0.0008116258,-0.00566901
-0.010340524,-0.0061029308
0.01310548,-0.007952289
0.016657187,-0.009282594
0.000930882,-0.007686127
-0.009713115,-0.008213442
-0.0044655316,-0.013661861
-0.010104359,-0.014519937
-0.00106179,-0.01697498
-0.0008513873,-0.016177999
0.00094279327,-0.0032274872
-0.0047863773,0.0019465078
-0.0029646782,-2.253482e-06
0.015042713,0.00043942902
0.0059405756,0.0027592639
-0.0036711972,0.000665278
-0.002802576,0.003765068
0.00017612982,8.5632324e-05
0.0022681307,-0.024534162
0.0045203087,-0.035303302
0.002060742,-0.03685295
-0.021652011,-0.03986435
-0.020449191,-0.039772708
-0.019572584,-0.037839472
-0.023096917,-0.0420004
-0.02297614,-0.038819738
-0.024350159,-0.016847033
-0.026523443,-0.007374395
-0.022941172,-0.001401666
-0.0033984792,0.002465059
0.0035640975,-0.004982449
0.0056283944,-0.005571109
0.0055173053,-0.0042708497
-0.0035982386,-0.0029796043
-0.0020415944,0.0060951686
0.0018468852,0.01080695
0.00017906209,0.0028251156
0.010179715,0.0025459342
0.014162555,0.0196734
0.0026831978,0.018943774
0.0018183506,0.024822356
0.016202042,0.016803967
0.017903997,-0.03950705
0.020065831,-0.065359496
0.012267169,-0.066903636
-0.02743589,-0.07526505
-0.025684902,-0.08644933
-0.028011875,-0.0864268
-0.030935463,-0.09740452
-0.02795781,-0.09114735
-0.028187042,-0.03491195
-0.03756695,-0.009676453
-0.03503806,-0.0019900752
-0.014278135,0.007848128
0.0040023723,0.007937015
0.0049608466,0.009580304
0.012751452,0.01769209
0.010702914,0.018751977
0.010686259,0.0038642213
0.015628764,-0.0014597557
0.014446772,-0.0018328322
0.0029528278,-0.002996881
0.0005234643,-0.0006439951
-0.0035325934,0.00037032223
-0.0034824486,-0.0016826
0.0018197052,-0.0013708683
0.0073496643,0.0035354632
0.0070810723,0.0045320033
0.007549659,0.007264726
0.011329532,0.006660292
0.018678775,-0.002909496
0.020703664,-0.0055275415
0.008233676,-0.011388098
-0.0015912517,-0.012282981
-0.0048616882,0.0048217005
-0.0046450836,0.008735749
-0.01077678,0.006578916
0.0036560835,0.0037202488
0.008961811,-0.0104779415
0.008846385,-0.021325452
0.006804945,-0.015728805
-0.009654971,-0.022584148
-0.016129924,-0.060763646
-0.0054293154,-0.07342496
-0.012585488,-0.08290937
-0.019883065,-0.08246643
-0.018643446,-0.04455585
-0.01660816,-0.027521277
-0.025883578,-0.022948962
-0.028065981,-0.015141147
-0.014636179,-0.008253754
-0.012430837,-0.0015346213
-0.0047499537,-8.713464e-05
0.00084514974,0.004286874
0.0068318197,0.01704684
0.0073319357,0.02052697
0.006999866,0.026619384
0.015904725,0.02547161
0.018438756,0.0011144722
0.023480717,-0.009016934
0.020034825,-0.010407582
-0.004241936,-0.013581737
-0.010069801,-0.013937537
-0.010855902,-0.013737728
-0.012000516,-0.017329028
-0.009474124,-0.016667254
-0.009475995,-0.0048434846
-0.012607665,-0.000249135
-0.012223929,0.00041639342
-0.0008332856,0.001408176
8.4549916e-05,-0.00077720097
-5.2985465e-06,-0.0022998038
0.0010966897,-0.00029796042
-0.0018349391,-0.0018185602
-0.002717373,-0.0092297625
-0.0004785678,-0.011466469
-0.0034984068,-0.020487659
-0.011446677,-0.021628672
-0.011224948,-0.0038021253
-0.016675906,-0.0029042377
-0.015810322,0.010310933
0.0038194328,0.006311002
0.0023896117,-0.04909111
0.014382526,-0.0653898
0.008493383,-0.08113062
-0.019502148,-0.07993026
-0.017746065,-0.018215148
-0.018833011,-0.07950511
-0.017559906,0.0147745805
0.0024358493,0.011783709
-0.014653164,-0.0029009827
0.016287683,-0.007841617
0.010009064,-0.023046363
-0.004981611,-0.029038122
-0.0013785637,0.007995856
-0.019827088,0.015011697
-0.022625552,-0.019659879
0.013914494,-0.03186549
0.0145695275,-0.032672238
-0.022223333,-0.038430635
-0.025992379,-0.034171052
-0.022930846,-0.036714483
-0.024036186,-0.060777668
-0.020659845,-0.06169884
-0.023898967,-0.07165397
-0.025375249,-0.06281506
-0.023388745,0.011953471
-0.018635688,0.045769725
-0.021365149,0.04356557
0.01785261,0.05323426
0.017017873,0.073103964
0.019087018,0.0722241
0.024755957,0.08788155
0.030225962,0.0769151
0.03323254,-0.013086221
0.030213283,-0.052700434
0.026696643,-0.06243022
-0.026181806,-0.07591731
-0.022884214,-0.07710915
-0.0208939,-0.07754458
-0.017559426,-0.08286204
-0.021448303,-0.078530096
-0.021730615,-0.052752264
-0.01616532,-0.03565785
-0.017570889,-0.028056104
-0.022664594,-0.0150632765
-0.018058702,0.015046501
-0.0164504,0.02589877
-0.006668581,0.042345684
0.020125216,0.043551046
0.022571791,-0.0042300364
0.031040993,-0.02214547
0.03150085,-0.02035921
-0.013706024,-0.02334883
-0.02150102,-0.023054626
-0.014474898,-0.019200921
-0.01696248,-0.023735426
-0.014717825,-0.01795199
-0.0128493095,0.01685129
-0.016861971,0.033072356
-0.008898455,0.037020706
0.020532725,0.043228798
0.024847623,0.046221424
0.023686921,0.046926763
0.02807333,0.05368671
0.029841235,0.052487355
0.02655293,0.032116126
0.02416643,0.024497604
0.02578042,0.018136526
0.016785162,0.0152645875
0.013160044,0.028162768
0.009472577,0.029945023
0.008189629,0.028993553
0.020728651,0.026251815
0.021080086,0.009910064
0.017652147,0.00071210036
0.014615465,0.0056892913
0.0032919254,0.0015286121
-0.003516982,-0.01798429
0.0032881976,-0.020466877
-0.0014653361,-0.040683616
-0.014008969,-0.038196523
-0.015544027,0.02850655
-0.023657197,0.046359636
-0.026522981,0.064865984
0.026218217,0.061753426
0.024849605,-0.018803306
0.025996642,-0.047773574
0.026974022,-0.06434844
-0.013366232,-0.071131915
-0.013511753,-0.02788459
-0.01261194,-0.016401844
-0.013615944,-0.011019528
-0.015354856,-0.011728123
-0.010948777,-0.044909146
-0.0067836344,-0.055494253
-0.003776663,-0.062032606
-0.026073674,-0.061943218
-0.026918463,-0.0379549
-0.027425183,-0.02991748
-0.02553943,-0.014493646
-0.020095361,-0.010377536
-0.018123155,-0.04033082
-0.008171934,-0.04087416
-0.0066770636,-0.05418598
-0.02957948,-0.04447222
-0.028103933,0.040600486
-0.026771734,0.071956694
-0.02650624,0.0882028
0.013378543,0.09333898
0.009074676,0.04628252
0.008957149,0.028269183
0.006493902,0.024607776
0.02431093,0.018302532
0.020532511,0.016351517
0.022762634,0.009915822
0.016684573,0.018208386
0.013224301,0.0128799025
0.005709027,-0.023842843
0.014557998,-0.030611051
0.008720543,-0.059500445
-0.017034287,-0.05667883
-0.012543412,0.039557125
-0.010419459,0.06563017
-0.017975973,0.090514116
0.038754236,0.08683418
0.026487216,-0.024763266
0.009873004,-0.065732576
0.011964615,-0.07970917
-0.015107601,-0.088290684
-0.006973179,-0.04691099
-0.014256978,-0.031475637
-0.017249586,-0.03352255
-0.024189763,-0.02820834
-0.021009762,-0.01898784
-0.020260194,0.056409918
-0.013841277,0.003978648
-0.006326647,0.002818856
-0.008698854,-0.0028316255
-0.010502744,-0.004869024
7.1025115e-06,-0.009617612
0.0008228946,-0.010773147
-0.0046574855,-0.0014101791
-0.004420554,-0.0005428388
-0.008025082,0.0017782479
0.0009907311,-0.00046121268
0.0031253167,-0.020594824
0.007808726,-0.026705517
0.006487561,-0.031779356
-0.014938556,-0.031260304
-0.020434812,-0.0098033985
-0.02303568,-0.0010821723
-0.0214635,0.002167349
-0.0027492028,0.005283915
0.00054979173,0.0021726072
0.00060114707,0.0026796407
0.0040121195,0.0027377305
0.0016841621,0.003970886
0.005251436,0.010604136
0.0071725897,0.012583445
0.008169641,0.014360941
0.01320607,0.014177658
0.011514984,0.005663001
0.0114049995,0.0017446959
0.011173305,0.0039060358
0.004707896,0.002885709
0.003553036,-0.0036679178
0.011842612,-0.004328188
0.006531474,-0.007543657
-0.00073223375,-0.0060245595
-0.0015548146,0.01305292
-0.0051827314,0.021191997
-0.0025611552,0.017538352
0.016853828,0.018547911
0.021816779,0.026276603
0.019717911,0.024567714
0.021869238,0.028186806
0.024093231,0.022121683
0.018827856,-0.014776083
0.020750362,-0.032418594
0.017988427,-0.03598135
-0.016931199,-0.04312038
-0.022592496,-0.050288208
-0.023222962,-0.052626822
-0.023120312,-0.06002826
-0.022968743,-0.059318412
-0.026157655,-0.035473064
-0.024825059,-0.02548513
-0.027862234,-0.02461078
-0.018757163,-0.021460412
-0.012878524,-0.019828139
-0.013899258,-0.019694183
-0.013014356,-0.015799915
-0.012937985,-0.016376056
-0.011964203,-0.03000762
-0.008221049,-0.035396695
-0.009730192,-0.03404661
-0.021914572,-0.034663063
-0.02562507,-0.03615512
-0.024408264,-0.03436836
-0.024121989,-0.036306854
-0.023505075,-0.03278992
-0.021604246,-0.014324134
-0.022488168,-0.0057411212
-0.020813808,7.711917e-05
-0.0038255253,0.004318423
0.0031304257,-0.00046221423
0.0077548036,0.00021858777
0.010714777,0.003130838
0.0031596967,0.005438654
0.004319186,0.01293674
0.0061484417,0.018183848
0.0072631785,0.011327754
0.013621129,0.013054923
0.0137785785,0.03364524
0.0039365897,0.035435006
0.005967004,0.04768669
0.012733747,0.042682707
0.018988373,-0.017082898
0.026590051,-0.038853038
0.02830257,-0.04601811
-0.019885253,-0.049016993
-0.025192795,-0.021681502
-0.02586898,-0.008197667
-0.0275089,-0.011205315
-0.008981148,-0.0042630876
-0.0013074732,0.022440927
-0.0070830476,0.03445349
0.0009766843,0.037442356
0.02982187,0.040384904
0.023644902,0.03692806
0.015941948,0.032728072
0.017539693,0.036006387
0.02551291,0.03120547
0.022544432,0.0036869473
0.024825178,-0.0097478125
0.021082351,-0.009696985
-0.00474059,-0.014814893
-0.012206055,-0.024891213
-0.005764294,-0.025979895
-0.010609376,-0.037325926
-0.01995382,-0.03537291
-0.017034149,0.0071815974
-0.024311243,0.022043062
-0.02294008,0.0224562
0.012708236,0.022596918
0.0178102,0.008300827
0.018144472,-0.0026095323
0.020203432,-0.0013390692
0.0044735596,-0.0103284605
-0.004026989,-0.047744278
-0.0020227737,-0.06694319
-0.011538387,-0.066453435
-0.02378768,-0.073259205
-0.017370146,-0.09060075
-0.019314677,-0.092087045
-0.017995363,-0.10295059
-0.014654599,-0.09646281
-0.01692197,-0.036305603
-0.014196953,-0.009315144
-0.01716189,-0.0028536597
-0.0078014215,0.007199625
0.006272671,0.010003708
0.0050418773,-0.115457915
0.013124603,0.007676362
0.013120024,0.0066470215
0.0025085448,-0.005275903
0.019397529,-0.009322655
0.0081022065,-0.012599469
-0.0069661983,-0.012635525
-0.0019299899,-0.0041033407
-0.009780734,-0.0019895744
-0.0057438305,0.008562732
0.0048123067,0.009977918
0.0059020924,-0.011425655
0.014293541,-0.011679297
0.0124318255,-0.026427587
-0.008937897,-0.020271074
-0.0059807,0.050547358
-0.022070196,0.07348555
-0.01464506,0.087643184
0.015059616,0.08795742
-0.0077233943,0.030844662
-0.0064542745,0.007835357
0.009835871,0.0013235452
0.009285343,-0.007245446
-0.0051269364,-0.0036408762
-0.0006041142,-0.0064427056
-0.008871167,-0.01126666
-0.0046476824,-0.015434851
-0.009086906,-0.024267249
-0.01386292,-0.029584967
-0.01391155,-0.028521072
-0.018558426,-0.03014508
-0.018844685,-0.03811214
-0.01784437,-0.038318712
-0.020258835,-0.04042822
-0.024332521,-0.03565209
-0.019218264,-0.013426748
-0.021970553,-0.002141309
-0.023567751,0.012873894
-0.0011443867,0.020582054
0.0070648286,0.011405875
0.013137756,0.011699078
0.017319312,0.013071449
0.008858756,0.0144826295
0.009302074,0.029653322
0.008753366,0.035745736
0.00992243,0.01898083
0.017713686,0.016884591
0.012244314,0.035597757
0.010568857,0.038267884
0.013326817,0.04599282
0.02090373,0.04292433
0.017247532,0.006703859
0.011898666,-0.0042332914
0.0114341,-0.018926997
-0.0017849043,-0.020169668
-0.0075300285,0.025142852
-0.02008146,0.037517473
-0.018530067,0.044676285
0.021436142,0.042766836
0.019871674,0.0008067466
0.017799295,-0.016034527
0.023461597,-0.0213227
-0.008172514,-0.026654938
-0.0144291585,-0.01959553
-0.015857097,-0.018318055
-0.020610135,-0.021086084
-0.013166105,-0.02133622
-0.01340679,-0.019949077
-0.014705185,-0.019379696
-0.013024798,-0.016764905
-0.010540966,-0.015645426
-0.009989662,-0.018995604
-0.0073361513,-0.01784157
-0.008216062,-0.018064914
-0.0114854,-0.014862216
-0.011353477,-0.0004456887
-0.008939169,0.006826799
-0.006961216,0.010229557
0.004933702,0.014056221
0.010206962,0.014763563
0.012899115,0.01617925
0.015777964,0.021474183
0.013896609,0.022499517
0.01597513,0.019125553
0.020740548,0.021113375
0.02039587,0.005973981
0.015927926,0.000630975
0.015579377,0.054679494
-0.00038676304,0.06903843
-0.003288461,-0.0056459745
0.018622113,-0.023978803
0.009035376,0.029168323
-0.016363252,0.04384926
-0.020770304,0.032006707
0.027012302,0.030655371
0.018732464,0.034916203
0.020064592,0.032793425
0.01928126,0.031260554
0.023150543,0.025486132
0.023709249,0.0059334184
0.0261164,-0.006025561
0.02026768,-0.011866086
-0.0001253222,-0.018751225
-0.0074463864,-0.033197798
-0.010093739,-0.037380263
-0.015035237,-0.03754226
-0.021414774,-0.034966033
-0.01927464,-0.012543633
-0.017527098,-0.0051747463
-0.018994791,-0.001492306
-0.00085369224,-0.0017719881
0.0021082426,-0.019457817
0.004458303,-0.028000768
0.003943352,-0.029384406
-0.013292625,-0.033414133
-0.019293057,-0.04259557
-0.019629896,-0.048403043
-0.024467422,-0.044032793
-0.026921727,-0.04608997
-0.027462507,-0.05926608
-0.026516015,-0.05841101
-0.027579496,-0.07548765
-0.026534652,-0.07424097
-0.024814235,-0.0010293406
-0.020931412,0.023707634
-0.021696232,-0.00997867
0.011733249,-0.012700375
0.00788939,-0.010216537
-0.008930812,-0.025122821
-0.0073598446,0.006378857
-0.0047895485,0.0012236409
-0.017453013,-0.023650296
0.017180664,-0.037785638
0.0069527025,-0.032605134
-0.021133635,-0.038032018
-0.026659224,-0.06703258
-0.0220822,-0.0729958
-0.024364164,-0.08084743
-0.022198638,-0.07711316
-0.025843514,-0.017562639
-0.02368582,0.012906194
-0.02422295,-0.018352108
0.0041832663,-0.013669874
0.018714422,0.073492564
-0.013721198,0.08139953
-0.00441281,0.09476268
0.007711951,0.065505974
0.0037335895,-0.1297122
0.0026277062,-0.23347929
0.018970197,-0.22104432
-0.014665165,-0.26219591
-0.02485261,-0.4285229
-0.03316434,-0.4836962
-0.047029793,-0.47826755
-0.04332143,-0.42826328
-0.033835128,-0.33775643
-0.009230806,-0.24145436
0.0027985624,0.12727417
-0.011637661,0.2841844
-0.02389042,0.15626748
-0.021550043,0.12753007
-0.04181018,0.2754882
-0.01784414,0.275522
-0.00064725,-0.011102156
-0.025853626,-0.093605645
-0.044232402,-0.15672493
-0.09646243,-0.15618108
-0.09884602,0.11743697
0.009823395,0.21071786
0.10127583,0.24006747
0.07697621,0.2510369
0.03846507,0.12744369
0.006959911,0.0791766
-0.022986813,0.08272358
-0.023215652,0.066906385
-0.012013851,0.040985584
0.03380657,0.028815027
0.035666578,0.014044452
-0.0020844904,0.009489914
-0.026373165,0.040627528
-0.044522595,0.052616056
-0.04824433,0.039410148
0.032388013,0.036623843
0.045157608,0.068600506
0.03285569,0.07390345
0.039257515,0.031603586
0.08833536,0.016011992
0.103846215,0.02468865
0.054943718,0.025921555
-0.00031901358,0.0040502585
0.019206375,-0.003509423
0.026132992,0.04643375
0.010715489,0.06043113
0.014476626,-0.0059186458
0.06433911,-0.01951065
0.06146956,0.033012763
0.028804798,0.04911214
0.0023590808,0.052113026
0.028446613,0.056465752
0.056461357,0.042308126
0.08277035,0.043543287
0.08200553,0.046357635
0.07312098,0.053882763
0.052071493,0.08912998
0.026219245,0.11008236
0.030721381,0.09743857
0.042453997,0.10538835
0.02567194,0.15933722
0.020843586,0.16859151
0.0172569,0.18520468
0.003682013,0.17363606
-0.020533996,0.06813103
-0.049130794,0.021546545
-0.042708505,0.011872095
0.0003264647,-0.0032540283
-0.004727394,-0.016323725
-0.024022778,-0.023531362
-0.047509845,-0.0061510047
-0.04955566,-0.0021678498
-0.011582347,-0.012433713
0.032260165,-0.015727052
0.028942592,-0.008787829
0.010738018,-0.008000363
0.01016129,-0.018929752
0.013050188,-0.019182641
0.009306589,-0.021425107
0.0068456344,-0.016919896
-0.007120865,0.010953176
-0.013620432,0.02407996
-0.02914942,0.028266428
-0.007171822,0.033786207
-0.0076694386,0.035802323
-0.0020575433,0.037390027
0.011888752,0.042014424
0.031695794,0.04276909
0.06470872,0.033427402
0.058847398,0.029868403
0.0350942,0.03170424
0.032552235,0.03104372
0.024849717,0.028327273
0.013904336,0.028938467
0.015852371,0.024089724
0.019493585,0.024134293
0.03865275,0.04542319
0.03741203,0.052753516
0.046387948,0.037315413
0.0513369,0.03448654
0.046663076,0.047062974
0.015336451,0.048040483
0.037817154,0.048667952
0.04475573,0.044893373
0.04146144,0.022998288
0.041314013,0.012650047
0.030178051,0.009884775
0.023788307,0.0056589944
0.018150762,0.0032087083
0.026730528,0.15885046
0.050561033,-0.023168301
0.04230259,-0.026104838
0.02933984,0.00747455
-0.013961333,0.019313594
-0.029629663,0.024016863
0.020186612,0.027753886
0.038546473,0.016418371
0.05048573,0.015440359
0.042137448,0.018550415
0.023633944,0.020860735
0.014482585,0.037063774
0.014554304,0.048385266
0.014127086,0.023953013
0.016066156,0.022548093
0.03506081,0.09235621
0.03420986,0.102185905
0.028657492,0.07951562
0.09033758,0.05691645
0.04133645,-0.028730396
0.01483578,-0.06151831
0.017820233,-0.09203772
-0.016555095,-0.099843286
-0.015811162,-0.01805465
-0.0031898196,0.01230827
0.0025700082,-0.0012371617
0.035460893,0.003635117
0.024498992,0.019325612
0.011234147,0.012766978
0.014535919,0.046992116
0.022075288,0.035960317
0.015451305,-0.09934251
0.016894018,-0.1407227
0.022079961,-0.17577562
-0.0171494,-0.17499942
-0.007714682,-0.032113623
-0.015456755,0.023246171
-0.0084604,0.039058857
0.0032486194,0.05417797
0.0053447187,0.024833124
0.008134655,0.017802259
0.008948964,0.020982673
0.031270895,0.021695275
0.02448104,0.020942362
0.020804849,0.015631404
0.014514368,0.040600486
0.0120542785,0.037886545
0.013602059,-0.02627385
0.03268392,-0.048697248
0.0306601,-0.059328176
-0.01852546,-0.06284561
-0.0131443795,-0.026991209
-0.0059888833,-0.013866427
-0.0006425862,-0.01217306
0.0078541385,-0.006816283
0.004351324,-0.014583786
0.00076622947,-0.01735031
-0.0011365485,0.012189086
-0.00715243,0.024987863
-0.0064677633,-0.0378272
0.011068896,-0.044791464
0.016900616,0.04182563
-0.023230234,0.07524677
-0.021961898,0.07108259
0.028285656,0.07388041
0.027389044,0.10105491
0.034772128,0.10238822
0.019003067,0.046362393
0.0029207913,0.025456836
0.0029246178,0.022265406
0.020788299,0.01710418
0.02024651,0.024874687
0.019304935,0.02738707
0.014073221,0.02408046
0.02107769,0.025078252
0.02227097,0.033500515
0.015639678,0.03727585
0.021024205,0.03897798
0.02953655,0.0406065
0.013124351,0.040030356
0.015198265,0.04060174
0.022591827,0.04105419
0.028135154,0.041892987
0.031067291,0.043739587
0.030562505,0.044244118
0.021282613,0.04722748
0.025231618,0.047471106
0.028392974,0.041044425
0.028297177,0.040269226
0.032650102,0.036865715
0.029367369,0.038022254
0.026589917,0.053252038
0.019585181,0.05548449
0.017427547,0.065546535
0.017898243,0.06339346
0.019276293,0.024556195
0.010199539,0.01288491
0.011967142,0.0038552072
0.014858817,0.0037447866
0.009850615,0.04214813
0.002951557,0.05666281
0.0034216696,0.054907344
0.03237466,0.057023365
0.031714767,0.057231437
0.030830255,0.053607836
0.030956184,0.056506567
0.023847837,0.05066629
0.014666248,0.0200948
0.011621859,0.0049979733
0.018075513,0.0009239277
0.008095247,-0.0059762346
0.0020243127,-0.012187582
0.006854748,-0.015068284
0.0024008774,-0.0235564
-0.0035034688,-0.024650091
-0.0077272453,-0.0057636565
-0.02051474,-0.00011392604
-0.019527309,0.0010138166
-0.00046693903,0.00064524706
0.0030404904,-0.010461916
0.0026648608,-0.015696505
0.0014728691,-0.016725846
-0.009124067,-0.01907773
-0.010769623,-0.023377374
-0.00757593,-0.026233789
-0.004927027,-0.02424897
-0.008054484,-0.024930524
-0.01670361,-0.032071058
-0.013301414,0.14462924
-0.014934453,-0.013010104
-0.020022629,-0.0080824895
-0.012522828,0.028574405
-0.0223722,0.044055827
-0.0062491484,0.048145145
0.017577088,0.051366623
0.011216125,0.0491169
0.017663317,0.04797714
0.009560551,0.033825267
0.017909655,0.03156152
0.03227401,0.036383223
0.02679296,0.019865697
0.028314928,0.08848774
0.027937992,0.0999512
0.013258614,-0.1571671
-0.0032227933,-0.23091206
-0.004073556,0.024381425
0.0002773057,0.09011825
-0.019832982,-0.035673372
0.021842089,-0.060056802
-0.014123644,-0.03688925
-0.02167228,-0.027661243
-0.016944751,0.0068676122
-0.005197055,0.017519321
-0.0076093865,0.03176709
0.022808757,0.031074017
0.020542802,-0.020703742
0.01302891,-0.041284546
0.01973146,-0.041413743
-0.019796796,-0.046306804
-0.025480699,-0.047491387
-0.02462215,-0.04517781
-0.02394991,-0.050824538
-0.0176392,-0.046118263
-0.016468748,-0.013451035
-0.023696365,0.0016447916
-0.027911525,0.007168577
0.0029171424,0.013555196
0.012090702,0.0136866495
0.009496743,0.015284118
0.009654579,0.020309884
0.013670736,0.021705791
0.016483532,0.015665958
0.015932392,0.013980103
0.010530741,0.013872687
0.009072403,0.013812594
0.011989941,0.01630069
0.014225604,0.016997766
0.016047696,0.017313253
0.01885441,0.017158765
0.016574252,0.015187719
0.014862259,0.014376465
0.014597736,0.013314825
0.018688828,0.012880654
0.014502067,0.014171899
0.012957285,0.013864925
0.011837204,0.015158174
0.013847846,0.014370956
0.013655393,0.008356162
0.014281892,0.0067228884
0.016862055,0.0026776376
0.011964164,0.0023746695
0.007958271,0.013803329
0.003695256,0.016413363
0.0063380185,0.018128263
0.01660242,0.016776424
0.015552733,0.0030694932
0.015806071,-0.0030301823
0.015540961,-0.005173244
0.002383568,-0.007750226
-0.0013777894,-0.0075053475
-0.0015712826,-0.0082319705
-0.000171412,-0.010569833
0.00029186567,-0.011557359
-0.0020735143,-0.009854227
-0.0026459247,-0.009930595
-0.0023781406,-0.010477691
-0.0027761208,-0.011267661
-0.0046962253,-0.013910745
-0.0059652836,-0.01548643
-0.008040571,-0.015708024
-0.008948618,-0.016852291
-0.011160454,-0.018211642
-0.011710859,-0.018486816
-0.013092179,-0.024047159
-0.014103337,-0.024649339
-0.012349816,-0.014270802
-0.015878528,-0.014081259
-0.015063732,-0.006159518
-0.004523639,-0.008785325
-0.005936742,-0.044130694
0.0012469454,-0.055210564
-0.004582911,-0.061648764
-0.026881156,-0.05932868
-0.028647898,-0.033025283
-0.029287074,-0.022602677
-0.026315942,0.009168668
-0.019224416,0.017605705
-0.013845098,-0.023781499
0.018814314,-0.036631607
0.02241157,-0.035349373
-0.021736126,-0.036666658
-0.027962757,-0.028858595
-0.02329636,-0.026180705
-0.024789713,-0.02596387
-0.017552862,-0.025271552
-0.01366883,-0.026238045
-0.013357678,-0.026124619
-0.015188643,-0.02578209
-0.015209098,-0.025180912
-0.014683968,-0.023648793
-0.015324444,-0.022810247
-0.013684732,-0.021287395
-0.011398398,-0.02056578
-0.012413724,-0.022007506
-0.015312273,-0.02154354
-0.014265523,-0.02202203
-0.013090171,-0.020895788
-0.013725063,-0.014714237
-0.015897466,-0.012180822
-0.012905238,-0.010288398
-0.004117731,-0.009426066
-0.0029530122,-0.012993078
-0.002043374,-0.013890214
-0.0029780045,-0.013566213
-0.008902173,-0.013315075
-0.008194825,-0.0118265245
-0.007341732,-0.06653606
-0.008594565,0.023829322
-0.008139558,0.017960504
-0.016873527,-0.013562958
0.013846035,-0.031217238
0.013303088,-0.028262923
-0.018247899,-0.03556646
-0.026283838,-0.06788965
-0.021385094,-0.077725105
-0.026479393,-0.07647367
-0.029081663,-0.06662996
-0.02826429,-0.05067155
-0.028210532,-0.03534086
-0.02926442,0.03699166
-0.02530867,0.063566975
-0.019059427,0.021779655
0.015937436,0.01628266
0.009897234,0.022079868
0.012638125,0.026537508
0.013966135,0.050582163
0.020455316,0.05602858
0.0193901,0.06228825
0.020399787,0.058076244
0.017744953,0.018886434
0.018491365,0.00025664657
0.019345192,-0.006252161
0.0092238095,-0.015178955
-0.0024166715,-0.022385841
-0.00519779,-0.029350854
-0.012507625,-0.030601287
-0.01774917,-0.03463577
-0.022316692,-0.04709953
-0.023736179,-0.04951326
-0.025557775,-0.05529895
-0.023453843,-0.052284792
-0.022283664,-0.0229735
-0.020081481,-0.00989479
-0.02287786,-0.0026859003
-0.009891951,0.0034696115
-0.0036089849,-0.0010190747
-0.0002840867,0.0011282434
0.0043815174,0.0040382403
-0.00035062345,0.008400481
0.002639283,0.020373983
0.0061939307,0.026672466
0.010119652,0.031648405
0.019506782,0.035009097
0.021129178,0.03239706
0.022230746,0.033245873
0.02314735,0.033937942
0.023413293,0.035246715
0.024275549,0.042220242
0.02528334,0.045018815
0.026126351,0.042106066
0.028235275,0.041316595
0.029637458,0.044610433
0.029607844,0.042068005
0.028171983,0.042159148
0.028619336,0.036498148
0.025737582,0.013628559
0.026816372,0.001369366
0.021856882,-0.0052693924
0.0011213907,-0.012493806
-0.0071386877,-0.0164369
-0.008502936,-0.02146016
-0.013356561,-0.026685486
-0.015929077,-0.03149817
-0.01766122,-0.03583738
-0.01883334,-0.039374094
-0.021148467,-0.04553912
-0.023677591,-0.048773866
-0.022609787,-0.04513174
-0.019509679,-0.046819847
-0.019869782,-0.04658048
-0.02229947,-0.04951301
-0.02187339,-0.06632274
-0.023285959,-0.07383059
-0.023719618,-0.07142512
-0.016707316,-0.07244169
-0.014754055,-0.07745143
-0.017320884,-0.07468816
-0.018381828,-0.07965033
-0.017588966,-0.07204207
-0.021977507,-0.036464598
-0.022769261,-0.021632679
-0.027987523,0.009102566
-0.012918841,0.027978735
-0.004310109,-0.040494826
0.013308912,-0.053768586
0.011448991,0.06808721
-0.027167052,0.10027745
-0.027849665,0.017101677
0.0015274144,-0.0040585212
-0.005914526,0.008234224
-0.0025375322,0.009523216
-0.0089332145,0.01903141
0.0070394403,0.02220381
0.007686703,0.024304556
0.017203243,0.024344118
0.01611823,0.016315963
0.015034345,0.0129462555
0.01620647,0.011772692
0.014269402,0.010246583
0.012953838,0.010464921
0.009298056,0.009656422
0.007381286,0.008172378
0.00915815,0.0070639155
0.008080398,0.0052566226
0.013071716,0.0034643533
0.014641383,0.0051945266
0.0094563,0.0032367515
0.009084841,-0.0021913862
0.012897393,-0.0021237817
0.0059936517,-0.020834194
0.00081286416,-0.028654028
0.0022010596,0.029031612
-0.016337855,0.043640938
-0.019629152,-0.040968556
0.027996536,-0.061994046
0.020888446,-0.0021380538
-0.023832068,0.009636391
-0.024414625,0.011423652
0.009971751,0.0067912443
0.012279584,-0.040351354
0.010526201,-0.05461289
0.0052639246,-0.06964111
-0.024373522,-0.069274046
-0.021027774,-0.015394539
-0.01809177,-0.3045078
-0.024233341,0.0014354682
-0.00043791547,0.009512199
-0.0039370665,0.01445709
0.020800903,0.019617064
0.01025423,0.025379468
0.008592594,0.029475797
0.012117334,0.030686168
0.013229628,0.032559812
0.019241063,0.03525598
0.022898976,0.03683592
0.021310885,0.03612382
0.018991746,0.036133584
0.018783767,0.038230576
0.021835176,0.038727846
0.019271648,0.035134792
0.020372372,0.034513082
0.020219179,0.03574073
0.022023464,0.036113553
0.017827455,0.040321305
0.026577093,0.044158235
0.0287734,0.03263593
0.027310442,0.03351554
0.028825749,0.062020086
0.024783941,0.06422825
0.025084998,0.08166169
0.034279488,0.07580664
0.046875086,-0.008400731
0.047120653,-0.038003225
0.037951555,-0.03728161
-0.014639232,-0.030433778
-0.016180571,-0.0185086
-0.017033365,-0.0053527714
-0.019979948,0.09219046
-0.0118194865,0.12280076
0.0007641496,0.052914266
0.031510573,0.034451988
0.011916818,0.04647081
0.019769564,0.045191582
0.024965005,0.041362915
0.037294872,0.03715792
0.029263146,0.034928724
0.028642619,0.029773507
0.022416074,0.018188355
0.021545758,0.010300918
0.020057058,0.002967085
0.012967152,-0.0036138343
0.005595013,-0.0075977403
-0.002777185,-0.0143369045
-0.0052886447,-0.016517773
-0.004692879,-0.024065688
-0.014473082,-0.0429719
-0.016939392,-0.051438734
-0.01832397,-0.07142186
-0.021707254,-0.07665921
-0.024835292,-0.04720344
-0.016338088,-0.047972128
-0.015205759,-0.023319034
-0.024275431,-0.030903254
-0.025478771,-0.13840087
-0.01017607,-0.16978586
-0.018651115,-0.19315273
0.006152611,-0.1934036
0.0011081342,-0.064887516
-0.0059799426,-0.0056537366
-0.032323517,-0.067701615
-0.02071717,-0.087990716
0.009437005,0.11744949
-0.021682516,0.16273247
-0.022114577,-0.20028023
-0.015124438,-0.30007845
-0.015748719,-0.0674327
0.016842727,0.0010576344
0.00092478923,-0.04782515
-0.010399116,-0.03933503
0.0127056055,0.018501088
-0.016930325,0.045457743
-0.00908877,0.05137689
0.023720698,0.061781466
0.01935041,0.069329634
0.011366227,0.07190837
0.0063438807,0.08126458
0.01874247,0.079204895
0.032475684,0.051509846
0.024484506,0.040192608
0.024388785,0.025560247
0.021898799,0.017928705
0.018162599,0.039550364
0.011158991,0.037893806
-0.0031006944,0.030069465
0.008066252,0.020165911
0.009205545,-0.0308031
0.0063083502,-0.06586127
0.013717115,-0.0143051045
-0.013549658,-0.005883341
-0.020702386,-0.20504184
-0.005988819,-0.25732863
-0.011200722,-0.022873094
-0.06146033,0.044994026
-0.068899654,-0.057075948
0.032575607,-0.0739648
0.0010360314,-0.04112455
-0.020672766,-0.0303509
-0.03650934,-0.023367358
-0.024845751,-0.019733993
-0.016571593,-0.008110282
-0.0023296913,-0.006844827
-0.0071502146,-0.0328102
0.0014477541,-0.04142952
0.012549427,-0.04247163
-0.022983873,-0.042631626
-0.021024851,-0.034067642
-0.01786335,-0.030008871
-0.014378624,-0.022843048
-0.014463649,-0.018878672
-0.017409943,-0.023987567
-0.011454639,-0.019018387
-0.011443783,-0.023546385
-0.018502666,-0.015596351
-0.008788926,0.02955517
-0.010197498,0.047329634
-0.0034459028,0.059573054
0.013918618,0.063966095
0.01849831,0.037452124
0.01816515,0.029393671
0.018295713,0.02532914
0.01887879,0.023551393
0.017559834,0.037639413
