Predicted,Actual
-0.006666343,-0.008520894
-0.007107277,-0.008823737
-0.007146203,-0.009266009
-0.0074059307,-0.01067682
-0.009336594,-0.011348194
-0.010134131,-0.011210462
-0.010123126,-0.011289796
-0.010297804,-0.011662565
-0.010120607,-0.011363282
-0.009831981,-0.011567551
-0.009379218,-0.010845575
-0.008692747,-0.007741705
-0.0055416734,-0.0061812946
-0.0040276246,-0.0045950324
-0.0026583178,-0.0035583465
-0.0017119637,-0.0046688574
-0.0026102413,-0.0041212304
-0.002529568,-0.0037380354
-0.002413757,-0.0025959096
-0.0014116659,0.0017822246
0.002904507,0.0040824953
0.005509864,0.0044427207
0.005665945,0.0054200753
0.006177349,0.0071028774
0.00835398,0.007509127
0.008760448,0.008574461
0.010130868,0.008294672
0.0101325475,0.0037383744
0.0047103935,0.0016872099
0.0021408892,0.0020000548
0.0028878755,0.0013556333
0.002528895,-0.00044532306
0.00091612217,-0.0006919714
0.0005835686,-0.0017903615
-0.00089189055,-0.0014134388
-0.00088747405,0.004262608
0.0053119385,0.006733075
0.008074371,0.0054139723
0.006274991,0.005771146
0.006424501,0.008774916
0.009241712,0.00843783
0.008850027,0.009944673
0.010385782,0.008178468
0.008799461,-0.0042277724
-0.0042053317,-0.009870678
-0.010051106,-0.010599181
-0.009838587,-0.012497525
-0.01118637,-0.014115826
-0.012468463,-0.014095908
-0.012292614,-0.016374566
-0.014374648,-0.01533415
-0.013230619,-0.0053281966
-0.0026692837,-0.0010173606
0.0019800426,0.0010411779
0.0032808983,0.0027608506
0.0046395482,0.0008559798
0.0028300607,0.0009281943
0.0028736705,0.0017622216
0.0036537766,0.0023705359
0.0038195716,0.0042244666
0.005009632,0.0052526766
0.005809586,0.00438144
0.0053373906,0.0045176474
0.0055140955,0.006887929
0.0076304437,0.0067546032
0.0070245876,0.007661947
0.007894759,0.006407855
0.007133149,-0.0018352837
-0.00148923,-0.005630955
-0.0055198693,-0.006680778
-0.0058645634,-0.008181773
-0.0069838343,-0.00857836
-0.0071723983,-0.008769406
-0.0068338504,-0.010472805
-0.008845616,-0.010439156
-0.009078687,-0.0062273187
-0.004283417,-0.004836341
-0.0025591713,-0.0038127927
-0.0021846937,-0.0033293283
-0.002001768,-0.0070393933
-0.0058314586,-0.008286111
-0.0073246327,-0.004922625
-0.003483528,-0.002899516
-0.0010936446,-0.009910176
-0.008963214,-0.010556547
-0.010051485,0.0067995256
0.008845074,0.012028046
0.015021183,0.0025839587
0.0041972646,-0.002200086
-0.0018286641,0.00533591
0.006630649,0.0027921265
0.004657503,-0.021982804
-0.022315305,-0.029747989
-0.030719347,-0.03743918
-0.036859762,-0.037745327
-0.036091264,-0.010633169
-0.00613422,-0.0011517882
0.0040633767,0.0027670378
0.005550815,0.0046450403
0.00570193,-0.008257547
-0.008272737,-0.01239556
-0.011838018,-0.011377268
-0.009602482,-0.011493387
-0.009222338,-0.00976295
-0.0072167637,-0.0081460895
-0.006096062,-0.008483176
-0.0066709197,-0.0069784517
-0.0045931055,-7.102793e-05
0.002314239,0.0034335817
0.0052886712,0.0030798828
0.0047161146,0.0042665917
0.0059083914,0.007816378
0.009503268,0.00809337
0.009721998,0.010148603
0.011318575,0.008884763
0.009573017,-0.0028477283
-0.002842537,-0.008029886
-0.007997649,-0.008682105
-0.007989211,-0.010379486
-0.009176566,-0.0115588205
-0.010124087,-0.011562381
-0.010414528,-0.01341309
-0.011988257,-0.012670094
-0.0107891625,-0.004664111
-0.0022669234,-0.0011226311
0.0014652746,-0.00048592256
0.0013113103,0.0007517264
0.0018957836,0.0014420026
0.002773631,0.0016609346
0.00349956,0.0025690412
0.004167965,0.0024233407
0.0037761845,-0.0011449227
5.9765065e-05,-0.0029627462
-0.0020946988,-0.0015424418
-0.00041177453,-0.0020582844
-0.0006033658,-0.0065787286
-0.005394016,-0.007225778
-0.0061697452,-0.008902224
-0.007571095,-0.007828498
-0.006231343,0.002542003
0.0048816246,0.0070200684
0.009626334,0.007914274
0.009747048,0.009341105
0.010375547,0.0093158465
0.009999132,0.009107086
0.0097379675,0.010340158
0.010830061,0.0097706625
0.01037541,0.004897452
0.0054306583,0.002697366
0.0031361782,0.0014520041
0.0022012081,0.00037777025
0.0012155375,0.001044314
0.0019881534,0.0006120438
0.0015386305,6.424722e-05
0.00076769537,-0.00074435235
0.00023079179,-0.0028429818
-0.0016975048,-0.0039900234
-0.0029891913,-0.0049613602
-0.004025339,-0.005620869
-0.0048060603,-0.005252846
-0.0042148214,-0.005536534
-0.0042894795,-0.0054793213
-0.0041997284,-0.0058444627
-0.004588416,-0.007761369
-0.0069597526,-0.008377566
-0.0076086223,-0.008857895
-0.007667944,-0.008667187
-0.007331999,-0.006950227
-0.005383777,-0.006247576
-0.00473845,-0.0038824645
-0.0026225469,-0.0031075142
-0.0018753386,-0.0063931067
-0.005584309,-0.0057409722
-0.004858704,-0.0076979697
-0.006527768,-0.005724868
-0.0044937255,0.008262633
0.01065859,0.013521582
0.01618051,0.017120443
0.018699694,0.018290285
0.019188486,0.009274485
0.009231269,0.006385648
0.0060449447,0.005926594
0.0064102593,0.0055150897
0.0067105833,0.008473683
0.009703631,0.009312711
0.0099323355,0.009497655
0.009607034,0.009443833
0.009344505,0.007837652
0.007815474,0.0072733276
0.0074014277,0.0065598274
0.006964936,0.0063166544
0.0068401415,0.0078107836
0.008394934,0.007953348
0.0087896,0.008077944
0.008653687,0.0077233124
0.007941998,0.0048887217
0.005174602,0.003496388
0.003991469,0.004410936
0.0051212315,0.004111059
0.004862876,0.0014750585
0.002123883,0.0014022506
0.0020803227,0.00018621523
0.0008094015,0.0011564499
0.0017587217,0.009606231
0.010725455,0.013294343
0.014129569,0.013154745
0.013194378,0.014088449
0.01393183,0.0155059565
0.015463734,0.015117761
0.015349663,0.016470851
0.016927324,0.015100724
0.015510787,0.0060020294
0.005828626,0.00181723
0.0013707587,0.00015739721
0.00010185883,-0.0016450001
-0.0014577808,-0.0014675998
-0.0010073113,-0.0019359773
-0.0013761866,-0.003267878
-0.0024377448,-0.0037783806
-0.0026253604,-0.0028469656
-0.0015558117,-0.0027127075
-0.0013263805,-0.0027598334
-0.0015974438,-0.0028543395
-0.0019508924,-0.0035500403
-0.0026190737,-0.0037201513
-0.0024835444,-0.0039310316
-0.0024377292,-0.003824659
-0.0022093279,-0.0028113667
-0.0011576089,-0.0023968113
-0.0007787355,-0.0018084152
-0.00041582625,-0.0015608345
-0.00041716304,-0.0024136782
-0.0013618382,-0.0023419722
-0.0014491396,-0.0025865862
-0.0015129343,-0.002188474
-0.0007636811,0.00041430132
0.001902083,0.0014836192
0.0029481489,0.0019284337
0.0030773724,0.0022144949
0.0030903558,0.0013703813
0.0022483584,0.0010181235
0.0020434503,0.0011872174
0.0023944338,0.0008878491
0.0021373238,0.00040150274
0.0015931764,0.00022740803
0.0014084292,-0.0018875799
-0.0007582061,-0.002358585
-0.0012791859,0.0010166826
0.0023773292,0.0006995997
0.0019917153,0.0026830419
0.0036675462,0.0010989835
0.0019974236,-0.011413459
-0.011327412,-0.016057312
-0.01613546,-0.01922899
-0.018328195,-0.020237366
-0.018635131,-0.011893703
-0.009283247,-0.009137345
-0.006170593,-0.00866617
-0.00626858,-0.008324083
-0.006254291,-0.010646307
-0.008769966,-0.011192069
-0.009104956,-0.013083548
-0.010855895,-0.013416819
-0.011159598,-0.008860607
-0.0061379704,-0.008543778
-0.0059236838,-0.0073756315
-0.0053751334,-0.008706516
-0.00716103,-0.019675415
-0.018941551,-0.024623213
-0.023971336,-0.02410542
-0.02230195,-0.025375787
-0.022745296,-0.028452279
-0.025952382,-0.028151639
-0.02583919,-0.030033626
-0.027527029,-0.027979748
-0.025224054,-0.013526074
-0.009815007,-0.0064930376
-0.0024237947,-0.0055743363
-0.0025205875,-0.0025271703
-0.0002951634,0.0015556642
0.0039562155,0.0027206747
0.0054278704,0.008163126
0.01036661,0.008182366
0.009841314,-0.0063791214
-0.0059057795,-0.010483485
-0.010600358,-0.013508783
-0.012472554,-0.013125503
-0.011151628,0.0012240028
0.003917804,0.0065574544
0.009051782,0.0089172255
0.010680033,0.010269384
0.011738316,0.0046626697
0.005661952,0.0032201589
0.0043369094,0.0030856465
0.004483023,0.0032040547
0.0043212366,0.0062407954
0.007243912,0.0072144205
0.0082168495,0.0078368895
0.008485747,0.007918512
0.0084912935,0.0055071223
0.0063897846,0.0046346993
0.005544533,0.004641565
0.005663642,0.0045081545
0.005601508,0.0048058275
0.005418971,0.0050480682
0.005394184,0.004914743
0.0053313854,0.005165375
0.0056740507,0.0063240286
0.0071945363,0.0068854713
0.008031466,0.0072156917
0.0082828645,0.0075040413
0.008394196,0.007361053
0.008141501,0.007435641
0.0082169585,0.00774357
0.008543464,0.007881388
0.008913992,0.00795801
0.009127126,0.008187622
0.009227738,0.0076572853
0.008637785,0.007777304
0.008532137,0.00959606
0.0102964,0.009918397
0.01065192,0.010536798
0.01103595,0.010314306
0.010779325,0.0065844925
0.0068145427,0.0050044176
0.00505971,0.00608255
0.0065726847,0.0059605823
0.0065951124,0.003919504
0.004263904,0.0043232953
0.0047000498,0.0031935445
0.0038274734,0.004640039
0.0054761004,0.014073362
0.015653523,0.0182268
0.019956287,0.019631509
0.020543775,0.021052321
0.021360254,0.020188969
0.020126082,0.019939777
0.019646388,0.020718966
0.020187156,0.020326024
0.019704644,0.018106274
0.017363474,0.016956266
0.01623052,0.014984265
0.014506056,0.013865449
0.0135337375,0.015451626
0.0153877,0.014471644
0.0144382175,0.014349591
0.014382701,0.012289696
0.0125163505,0.0040065516
0.003709237,-0.00011315308
-0.00061126496,-0.0026667682
-0.002706256,-0.004790571
-0.004605816,-0.0039857854
-0.003312719,-0.004720306
-0.0038176428,-0.005899471
-0.0053300657,-0.0069200527
-0.0066166213,-0.009229986
-0.009139923,-0.010600791
-0.010275283,-0.009964252
-0.008915707,-0.010298626
-0.008783893,-0.012802233
-0.011331955,-0.012719508
-0.011302027,-0.013791539
-0.012400654,-0.012461502
-0.010926557,-0.0036847221
-0.0014439508,0.0003638698
0.0027636914,0.0020893908
0.0038920483,0.0038360166
0.0052158153,0.0034249362
0.004759351,0.003843221
0.0052663237,0.0049542403
0.006354624,0.00545703
0.0067254864,0.005197244
0.0060546305,0.0052409796
0.005925953,0.005285817
0.0061634528,0.005299887
0.0064304364,0.005481949
0.0067178793,0.0053348923
0.0064292327,0.0054300767
0.0064427415,0.0051178248
0.0060339137,0.0035776717
0.0042643268,0.0028075527
0.003356032,0.002533612
0.003075763,0.002162792
0.0026399666,0.001916737
0.0024672158,0.0017447612
0.0024963978,0.0013804677
0.0021825014,0.0012693488
0.0020558438,0.0018343513
0.0026468476,0.0019859
0.0027659782,0.0018695262
0.0027268413,0.0018146873
0.0028777441,0.001704416
0.002870363,0.0015534605
0.0028567815,0.0015148104
0.0027661317,0.0013400377
0.002379193,0.0007868165
0.0017615982,0.00047448013
0.0014688821,0.00032420264
0.001445668,0.00014222537
0.0015248597,-9.577751e-06
0.0015290033,-0.015017406
-0.0148634305,0.0013758059
0.0032086382,0.0009810838
0.0040344326,-0.00023579916
0.001839779,-0.0010346514
0.000612061,-0.001035499
-4.8334496e-05,-0.0015140476
-0.00036503337,-0.0030100415
-0.0012720373,-0.0035347836
-0.0017346316,-0.0042467583
-0.002470479,-0.0044044945
-0.0028596127,-0.0021025285
-0.00093230355,-0.0012052711
0.0004517776,-0.0026407472
-0.0016488197,-0.0028212836
-0.0021840692,-0.0005501698
0.0015152476,-0.0009229393
0.0012001441,-0.00014714139
0.0021591552,-0.0015832956
0.00036168823,-0.010689025
-0.010370082,-0.014960279
-0.01490075,-0.015186839
-0.014436131,-0.016600108
-0.014860813,-0.018852744
-0.016534854,-0.01898853
-0.016963098,-0.020628866
-0.01857648,-0.019598622
-0.017230116,-0.0103009995
-0.008159573,-0.0058831125
-0.0035503842,-0.0056842687
-0.0036851992,-0.0039545097
-0.0023357905,-0.00082351716
0.0015908307,-1.3137624e-05
0.0030338247,0.002382063
0.004720289,0.0022105111
0.004082538,-0.0066990014
-0.005652287,-0.010302271
-0.009555315,-0.008167194
-0.0067046336,-0.008404519
-0.0064663854,-0.012031775
-0.010292098,-0.011075102
-0.009700518,-0.01287716
-0.0111159785,-0.009899666
-0.0077360705,0.0084600365
0.01142519,0.017046364
0.020394232,0.01861008
0.020799417,0.021767601
0.022909887,0.024442507
0.025301319,0.024896815
0.02569471,0.028182238
0.028865606,0.027207002
0.027347764,0.014579457
0.013826436,0.009198032
0.007923469,0.0079733515
0.007563386,0.006082805
0.006536205,0.006128659
0.006978659,0.0059813485
0.0066092596,0.004195225
0.004647281,0.004132927
0.0047561536,0.008291197
0.00888941,0.009780918
0.010895219,0.009711162
0.010500562,0.009857541
0.010163433,0.009256431
0.009989181,0.008681088
0.0099039925,0.008759828
0.0096345395,0.008086335
0.009130091,0.0056922357
0.006445447,0.0043970356
0.0048969667,0.003366707
0.0039518857,0.0025019122
0.0031437401,0.0026655814
0.0034602766,0.0021438908
0.002738308,0.0013651262
0.0020929098,0.00058610755
0.0016109927,-0.00092421065
-0.00011521905,-0.002128719
-0.0013848318,-0.0019861544
-0.00091510225,-0.002748052
-0.001532431,-0.0058056433
-0.004731052,-0.006791304
-0.0054805377,-0.0078032403
-0.005963659,-0.00773645
-0.005870877,-0.0038772942
-0.002166935,-0.0022171224
-0.00040218965,-0.0020243807
-0.00023286814,-0.0014065733
0.00029393396,-0.0008230086
0.00094563176,-0.0005239793
0.0010662338,3.3903547e-05
0.0012006547,9.882884e-05
0.0011279631,-0.0010521117
-0.00012749557,-0.0014768385
-0.0008298984,-0.0018022277
-0.0009584117,-0.0019905618
-0.0010088361,-0.0014540383
-0.0004230139,-0.001503368
-0.00016360334,-0.0014567506
-0.0001368262,-0.001749084
-0.00021965212,-0.0031769318
-0.0014199553,-0.003828897
-0.0021866935,-0.0043215156
-0.0029882942,-0.0046114754
-0.0034539055,-0.0041475054
-0.0030922892,-0.0041938685
-0.0032422454,-0.0039713765
-0.003381494,-0.0041196197
-0.0036259436,-0.0054733036
-0.0047687357,-0.0058188657
-0.0047788173,-0.0063002957
-0.005022214,-0.006126964
-0.00500389,-0.004252861
-0.0033970426,-0.0036117446
-0.0026171035,-0.0020346364
-0.00074372825,-0.0015814309
3.4408567e-05,-0.0047264933
-0.0026049223,-0.0049190656
-0.0028034535,-0.005102399
-0.0033123302,-0.0040354542
-0.002268958,0.0024362241
0.004295636,0.0057572457
0.0075609307,0.0053279423
0.0066028894,0.0066849315
0.007422293,0.010704197
0.011690226,0.011433039
0.012678041,0.014515718
0.015663521,0.013869771
0.014748083,0.0024082537
0.0019422577,-0.001539899
-0.0023081184,-0.003839068
-0.0035036784,-0.0044529764
-0.0031074588,0.0030141948
0.005313684,0.0055644196
0.007587534,0.005935833
0.0070088836,0.0063669165
0.00673363,0.004364827
0.00448405,0.0036708217
0.0041920207,0.0037746513
0.004591683,0.0035792822
0.004381529,0.003422563
0.0043732673,0.0032881354
0.004335794,0.0029602034
0.003890275,0.0027978902
0.0039195484,0.0030930205
0.0041348026,0.003021145
0.003899447,0.0028795977
0.0039114254,0.0026741421
0.0037448665,0.0017979898
0.002955175,0.0012187477
0.0023558948,0.0018246041
0.003022317,0.001628472
0.0028410843,-0.00045879974
0.00046901952,-0.0007660506
4.2305696e-06,-0.0014970958
-0.0006059671,-0.0011220379
-8.307031e-05,0.003709387
0.004927856,0.005852854
0.0072325896,0.0046458878
0.005778557,0.004971277
0.0059557394,0.007822226
0.009367028,0.0075687123
0.009382458,0.009004528
0.010412619,0.0074350475
0.008345184,-0.0038987382
-0.0036940929,-0.008990627
-0.009274928,-0.009710654
-0.009225958,-0.011361841
-0.010092971,-0.012451755
-0.010963493,-0.01230953
-0.011208798,-0.014046917
-0.012498742,-0.0130360825
-0.011072653,-0.0046973363
-0.0023618988,-0.0008959012
0.0018315385,0.0008590311
0.0029884544,0.002592011
0.0040322645,0.0020714218
0.0032676386,0.002681516
0.004085328,0.0037343907
0.0051881024,0.0046508885
0.005931334,0.0058470904
0.0070329895,0.0066306014
0.0074985106,0.007865538
0.008419951,0.008474531
0.009232688,0.007488361
0.008035356,0.0077022924
0.008101032,0.00762406
0.008339743,0.008130155
0.008810472,0.01143787
0.01218543,0.012893264
0.013783277,0.012015247
0.012553315,0.012087716
0.012411762,0.013772638
0.014224094,0.013252218
0.013703011,0.013933679
0.014210529,0.012350977
0.012490127,0.0038814475
0.0036429444,-0.00019308069
-0.00064037903,-0.0019398761
-0.0019153024,-0.0038478829
-0.0034756006,-0.0040765624
-0.0034726688,-0.0047616684
-0.0039856452,-0.0062927525
-0.00532929,-0.0069514136
-0.0058229975,-0.005957701
-0.004621403,-0.005924814
-0.004397916,-0.006012963
-0.0045881975,-0.0062480844
-0.0047393176,-0.007509466
-0.005902045,-0.007957162
-0.006201485,-0.00816016
-0.006445634,-0.008208472
-0.006650744,-0.007188569
-0.005433596,-0.006614412
-0.00474265,-0.0073631722
-0.0055163656,-0.0072084023
-0.0054164873,-0.004931864
-0.003208376,-0.0045251064
-0.0029604316,-0.004011044
-0.0025860423,-0.004286849
-0.0028478072,-0.00883323
-0.007739739,-0.0110958675
-0.010060503,-0.008252123
-0.0067714904,-0.008677443
-0.0070013083,-0.014907813
-0.013702418,-0.014684388
-0.013538321,-0.020749563
-0.019286634,-0.01880884
-0.017045222,0.007913511
0.01171391,0.016628757
0.020871557,0.019552175
0.021830186,0.019533103
0.020483963,0.0010666903
0.00064467796,-0.008634047
-0.009238031,-0.0037718543
-0.0029068743,-0.005730208
-0.004072893,-0.034088064
-0.03417765,-0.040129595
-0.04075712,-0.021804303
-0.019528186,-0.01249388
-0.007986984,0.0044804383
0.00865063,0.012351062
0.0152378,0.0211264
0.0233348,0.02348541
0.025598055,0.005951852
0.0064484174,-0.00063806475
-0.00038196886,0.00053169235
0.0014944145,-0.0013035913
-0.00048583682,-0.0046392763
-0.003641734,-0.0057819956
-0.0046273284,-0.008430286
-0.00783108,-0.008396637
-0.007946012,-0.0013424109
8.130401e-05,0.0008947993
0.002672801,0.0037126925
0.005346509,0.004080885
0.005795401,-0.0027005023
-0.0014502031,-0.0036069134
-0.0026398476,-0.008810938
-0.007542946,-0.008185841
-0.0064896895,0.009516386
0.012287077,0.0135715045
0.016145907,0.01964753
0.021142606,0.018170096
0.01906144,-0.0093172025
-0.0106800385,-0.019123126
-0.021007676,-0.023696883
-0.023468751,-0.025396807
-0.023530021,-0.010933809
-0.007330297,-0.0056491783
-0.0021801477,-0.004830153
-0.0028381653,-0.0032193111
-0.0018667799,-0.0046143574
-0.0033671737,-0.0041900543
-0.0024182857,-0.003308308
-0.00092597195,-0.002235854
-0.0003283681,0.00042209914
0.002361854,0.0019586927
0.0036642062,0.0030465727
0.004105088,0.003982819
0.0046642274,0.0041105505
0.004939572,0.0045992704
0.0055479757,0.0051928367
0.006471893,0.005676979
0.0068893065,0.0064126016
0.0074013597,0.006912085
0.0075828503,0.0067577395
0.007042328,0.0069200527
0.0074935737,0.007835279
0.008628108,0.0078328205
0.008312625,0.008258564
0.00857694,0.007802816
0.007826307,0.0047463267
0.0047725122,0.0033828958
0.0039220755,0.002558531
0.003243169,0.0019621677
0.0027348571,0.0026291353
0.0039563007,0.0025025054
0.003958596,0.002552259
0.0039666635,0.002235176
0.0035727958,0.0005455928
0.0011505188,9.323475e-07
0.00024041868,-0.0006396751
-0.0002918728,-0.0006630686
-2.2551518e-05,0.0014064886
0.0029812537,0.0021221924
0.003978723,0.002419357
0.0037623665,0.0025375108
0.0034422842,0.0015949924
0.0019743892,0.0013185089
0.001777446,0.0010482129
0.002130751,0.00096853956
0.0025004528,0.0018066352
0.0035765292,0.0019478435
0.0035386556,0.0018764765
0.0031929489,0.0017207745
0.0029262458,0.0006084839
0.0013786021,-0.000107643755
0.00036805109,0.00073307945
0.0013843603,0.00039802762
0.001093403,-0.002144823
-0.0015455158,-0.0024262224
-0.0017238763,-0.0048937225
-0.0040862095,-0.004513494
-0.0038129482,0.0038514428
0.005434151,0.0060511897
0.008166215,0.00880492
0.01062079,0.008454696
0.010315005,-0.0026500707
-0.0017412239,-0.006396921
-0.006103479,-0.008726688
-0.007815038,-0.009287707
-0.008098817,-0.0018135854
0.0001505991,0.0005088075
0.0025120373,0.0016853453
0.0028483039,0.0019714911
0.003002116,-0.0027844983
-0.002223399,-0.004155812
-0.0036633345,-0.0045179017
-0.0035528934,-0.004420429
-0.0030412902,-0.0010931351
0.0009203245,0.00044006802
0.0025452739,4.382033e-05
0.0017702954,0.0005511869
0.0020030108,0.0024712295
0.0040253084,0.0028628155
0.004723015,0.0036556497
0.0051068217,0.0032638942
0.004057362,-0.00079741137
-0.00043920518,-0.002582094
-0.0023236286,-0.0033768779
-0.0028793586,-0.0041475054
-0.0034870207,-0.0037232027
-0.0027986844,-0.0039284886
-0.0029204004,-0.0044078
-0.0032083555,-0.004807862
-0.0030737773,-0.005412362
-0.0034777373,-0.005828613
-0.003829983,-0.006207061
-0.004518067,-0.006503802
-0.0051978254,-0.0065555894
-0.005087005,-0.006729176
-0.00519261,-0.006898778
-0.005174998,-0.007063973
-0.0052251457,-0.0074330135
-0.0056877285,-0.0076484703
-0.005813702,-0.007514636
-0.005950659,-0.007543115
-0.0060749445,-0.0079842005
-0.0061946805,-0.007959196
-0.0062169884,-0.008003356
-0.0060412986,-0.0077391625
-0.0057355003,-0.0063369116
-0.0047009056,-0.0055530616
-0.0038007582,-0.0055882367
-0.003862577,-0.005181818
-0.0035435269,-0.004048592
-0.002057185,-0.0037020128
-0.0016814201,-0.0028758682
-0.0012168026,-0.0028002635
-0.0014396422,-0.0052698823
-0.004446277,-0.0060500028
-0.005556851,-0.005632311
-0.00478827,-0.0054455027
-0.004129197,-0.0049801767
-0.0034129655,-0.0041661523
-0.0025722794,-0.004267863
-0.002795333,-0.003262284
-0.002071658,0.00053533696
0.0017416595,0.00238486
0.003785603,0.0040500327
0.0054190736,0.005049001
0.0064398297,0.0036644647
0.0048935045,0.003953323
0.005033714,0.0038249132
0.0048867417,0.004543838
0.005600369,0.008741775
0.010186379,0.010397709
0.01184465,0.010605792
0.011425014,0.010770563
0.011265188,0.009650051
0.009900714,0.008608534
0.008845038,0.008930194
0.009601419,0.007611346
0.008310642,0.0037429514
0.0041364017,0.0019964103
0.0022603266,-0.003332888
-0.0034116604,-0.0051051113
-0.0050373627,0.002714318
0.00400526,0.0020602336
0.0036111735,0.0042898157
0.0052948324,0.0005350827
0.0012838193,-0.024165176
-0.02454007,-0.034912515
-0.035193052,-0.03766057
-0.036350217,-0.040018898
-0.037435833,-0.039631635
-0.03638034,-0.039069004
-0.035959844,-0.028438378
-0.024313685,-0.02027144
-0.015746575,-0.037012924
-0.035075728,-0.03393516
-0.031680718,0.01212145
0.017065067,0.030015996
0.035702538,0.03147529
0.031609517,0.041809004
0.038123693,0.017392859
0.014912821,0.03184314
0.030133195,0.072726324
0.06281056,0.07806393
0.068359226,0.026992222
0.02281792,0.0018280792
-0.0054011783,-0.02807061
-0.030255511,-0.039730124
-0.039543122,-0.07175033
-0.06336226,-0.073841244
-0.06639314,0.007918173
0.014234265,0.03524316
0.043957714,0.045953546
0.04847557,0.04936051
0.04905799,0.0068207155
0.0045578904,-0.007914952
-0.010913256,-0.009740997
-0.009678145,-0.012599829
-0.010220874,-0.003516391
-0.0028637352,-0.00061594264
-0.0010554934,-0.0014297125
-0.0009095746,-0.00084572396
-0.0006194209,0.00029038388
0.0010182455,0.0013577522
0.0025239945,0.00023656199
0.0019190675,0.00083377294
0.0015124121,0.005438129
0.0048436094,0.0062916507
0.0066650724,0.008829924
0.009449556,0.0082090655
0.008060554,-0.0021360929
-0.00089677895,-0.0056470595
-0.0037824695,-0.007871641
-0.005630415,-0.008391043
-0.006123869,-0.00091810804
0.0011344895,0.0016766998
0.0033192884,0.001658731
0.002506137,0.0019875953
0.0025319287,0.0006728159
0.0019393443,-0.00014137778
0.001249805,6.585764e-05
0.0009615244,-0.0006141627
-0.00044913622,-0.0032641487
-0.0035138803,-0.0046509732
-0.003981413,-0.0053064134
-0.004097312,-0.006033221
-0.005054931,-0.0063927677
-0.005453289,-0.006770538
-0.0056759724,-0.0073032477
-0.0053666662,-0.0076014292
-0.005144881,-0.0073059597
-0.006018575,-0.007259851
-0.006017638,-0.007714921
-0.0055667083,-0.0077844234
-0.004909909,-0.007246374
-0.003454527,-0.007299857
-0.004004695,-0.0066378056
-0.0036690852,-0.0067998646
-0.0055400813,-0.009307116
-0.010408457,-0.00994391
-0.011606451,-0.010728947
-0.010820432,-0.010554004
-0.00925409,-0.0070243063
-0.003964782,-0.005700881
-0.0020633484,-0.005031032
-0.0016322315,-0.004696828
-0.0016610892,-0.0062385066
-0.003818767,-0.0066371276
-0.0049158707,-0.006850042
-0.005094304,-0.0068664006
-0.0047155847,-0.0056941854
-0.0036678608,-0.0054048183
-0.0036674468,-0.005332265
-0.0040579056,-0.005422957
-0.0045795883,-0.006706884
-0.006229795,-0.007414621
-0.006803252,-0.0067145973
-0.0061617307,-0.006909712
-0.005684524,-0.009094371
-0.0072388467,-0.009400944
-0.0074671195,-0.010136991
-0.008668118,-0.009736251
-0.008621522,-0.0045415494
-0.002537185,-0.002169827
0.00022566368,-0.0038305921
-0.0019912238,-0.003496049
-0.0018414148,0.00048677015
0.002035934,0.00030767467
0.0015359586,0.002071337
0.0032918274,0.0001596857
0.0010583067,-0.014207535
-0.013928929,-0.020753717
-0.02053532,-0.020974683
-0.019746704,-0.023014406
-0.02076344,-0.025949858
-0.024166793,-0.025870016
-0.024315791,-0.028605184
-0.026113836,-0.02688051
-0.024261676,-0.012062712
-0.008181569,-0.005339978
-0.0008472132,-0.0035375808
-0.00086984364,-0.00090895407
-0.00053464726,-0.00020579452
0.00052040187,0.0003084375
0.0019761191,0.0028013652
0.00501946,0.0029480828
0.0050872206,-0.002739237
-0.0019531494,-0.004795233
-0.00449808,-0.005013741
-0.004391715,-0.0053805774
-0.004689194,-0.0042016665
-0.003765982,-0.0035850457
-0.003633765,-0.0039617987
-0.0033944782,-0.0034959642
-0.0013385355,-0.0016386431
0.0009814536,-0.00088225503
0.0017296616,0.0007506245
0.0030577607,0.0011554329
0.002387395,-0.0013527515
-0.000899383,-0.0012573977
-0.0010455888,-0.0035380893
-0.0032648912,-0.0027590706
-0.0022859946,0.0064989706
0.007925735,0.008918837
0.010852139,0.012965394
0.01451509,0.012786383
0.013988432,-0.0016555949
-0.0017318343,-0.006118488
-0.006472657,-0.007941736
-0.007707245,-0.007938346
-0.007079473,0.002692789
0.0043162466,0.007464374
0.008991564,0.006073142
0.0074035577,0.007590326
0.008869812,0.013489627
0.014891953,0.014652435
0.016282674,0.017209949
0.018282324,0.016046548
0.01662415,0.0032215149
0.003266555,-0.0022700967
-0.0022362284,-0.0041980217
-0.003637679,-0.006251729
-0.005468544,-0.0050717164
-0.0043999255,-0.0052263164
-0.0049773096,-0.006463457
-0.0062366636,-0.0068877595
-0.0063084224,-0.0062266407
-0.005275075,-0.006025423
-0.0049572573,-0.006251051
-0.0049867886,-0.0060977223
-0.0048628733,-0.0057539404
-0.0050266115,-0.0056128167
-0.0045728884,-0.004235824
-0.0031928925,-0.0039022134
-0.0029403127,-0.005886164
-0.0042505716,-0.005529329
-0.0037732858,-0.0071369507
-0.0054333196,-0.0060976376
-0.0041754087,0.0029498627
0.005041671,0.006078482
0.007849433,0.0081304945
0.009245613,0.008571494
0.009097336,0.00140954
0.0012597473,-0.0014227623
-0.0015062848,-0.00013925882
0.0003608498,-0.0010680464
-0.000121468554,-0.0027024515
-0.0014818895,-0.00192267
-0.00079260493,-0.010346768
-0.009371888,-0.012629241
-0.011606823,0.0151090305
0.017872695,0.022482203
0.025895754,-0.007833075
-0.008113522,-0.015793797
-0.01821872,0.00092463446
0.0017723971,0.004162847
0.0075541846,0.0006933275
0.0026125296,-0.0009562495
-0.00086756895,-0.006021524
-0.0065113525,-0.008647862
-0.009029234,-0.010205899
-0.009614998,-0.011502541
-0.009757229,-0.011116294
-0.0097869085,-0.011359807
-0.010847998,-0.01220231
-0.010954944,-0.012478878
-0.010474797,-0.012132808
-0.01018885,-0.012112466
-0.010070161,-0.011447024
-0.009263397,-0.011272081
-0.0093324715,-0.01261
-0.010654503,-0.012453366
-0.0101296315,-0.012689758
-0.010556641,-0.011851663
-0.010352986,-0.007383175
-0.0056971028,-0.005178428
-0.0028909158,-0.0044297525
-0.002379108,-0.0034022208
-0.0019510199,-0.002767631
-0.0014728914,-0.0023372257
-0.0007562634,-0.0013296971
0.00045215662,-0.0010766919
0.00068610854,-0.0028087392
-0.0012385156,-0.0033235645
-0.0020229742,-0.003117855
-0.0015912296,-0.0030346217
-0.0012948386,-0.0026797364
-0.0014193759,-0.0023224778
-0.0015879134,-0.0021405003
-0.0011070744,-0.0017457784
-0.000574077,-0.00070104055
0.0002441972,2.2715376e-05
0.001218093,6.678999e-05
0.0013912768,0.0005082989
0.001556264,0.0019422494
0.0030526458,0.0024958942
0.0037082264,0.0028077222
0.0038966408,0.0029882586
0.004385212,0.0015421028
0.0027999086,0.00068417354
0.0015136568,0.0031226862
0.0042786426,0.003034113
0.0043838494,-0.002201442
-0.0013706316,-0.002357568
-0.0016182312,-0.0064093806
-0.0053417394,-0.0049724635
-0.0038583693,0.012872668
0.015081276,0.018541595
0.021305079,0.022720715
0.024457779,0.022885486
0.023812106,0.006909797
0.0064465636,0.00095184206
-1.2186427e-05,-0.00049355085
-0.00046400324,-0.0018627456
-0.0010190456,0.0012435821
0.0024452915,0.0019723389
0.0029380159,0.0035105427
0.0043649506,0.0040223165
0.004685793,0.0006406075
0.0009361711,0.0011922182
0.0017191806,-3.0258914e-05
0.0008528345,0.0021138014
0.003195575,0.015050971
0.017028766,0.020713542
0.0227717,0.023136796
0.024176989,0.02498115
0.025343573,0.022962702
0.022762327,0.02266274
0.022554856,0.02143628
0.021787727,0.020996297
0.020961814,0.023122726
0.023649247,0.021858463
0.022056242,0.024144664
0.0236493,0.021865498
0.02172565,0.0059813485
0.004947375,-0.00011976428
-0.0019654327,-0.003017924
-0.003712437,-0.004368133
-0.003943338,0.0036398
0.004887525,0.007076433
0.008447462,0.0047369185
0.005054473,0.0057007964
0.005260552,0.013075072
0.0132822,0.015005794
0.016386943,0.015737263
0.01700048,0.01472414
0.014944512,0.006404041
0.005663573,0.0016298282
0.0008706534,0.001390893
0.0015012661,-0.001496333
-0.0008396211,-0.009528083
-0.00954843,-0.013258998
-0.01385365,-0.016190384
-0.015650896,-0.01754856
-0.016170854,-0.013162882
-0.011843764,-0.011777753
-0.010509658,-0.012006093
-0.0107821375,-0.011663074
-0.010304777,-0.011629001
-0.009790092,-0.011249027
-0.008975588,-0.011071288
-0.008856832,-0.010549512
-0.008532732,-0.008959944
-0.00675309,-0.00808803
-0.0061228983,-0.007501583
-0.006193758,-0.0069865882
-0.005591972,-0.0069711623
-0.0053961277,-0.006714682
-0.005134611,-0.006349456
-0.0045695985,-0.006061869
-0.0046465015,-0.0056507885
-0.0047568623,-0.005325569
-0.0043158056,-0.005436518
-0.004137424,-0.0052776802
-0.0036071592,-0.004486795
-0.0028151728,-0.004375422
-0.0028466936,-0.003913995
-0.001825831,-0.004091141
-0.0020602604,-0.006228505
-0.0050844518,-0.007045157
-0.006040181,-0.007428606
-0.006329145,-0.0076080402
-0.006446567,-0.0067426525
-0.0051581278,-0.0064751534
-0.004847442,-0.00617053
-0.0048923353,-0.006007793
-0.004957777,-0.0067341765
-0.005760821,-0.0067405333
-0.005705652,-0.006339709
-0.005141672,-0.0058899783
-0.004343954,-0.0049331356
-0.003239527,-0.0040089246
-0.0023222822,-0.003787365
-0.001964658,-0.0027636476
-0.0008690028,-0.00059399015
0.0016038866,0.00047888758
0.0027650911,0.0038472896
0.0058979685,0.004966022
0.0068840156,0.0002709741
0.001663826,0.0007134154
0.001699565,-0.0008359767
0.000352113,0.0013150338
0.002719171,0.016888203
0.01903816,0.023392852
0.02565547,0.023482783
0.024453878,0.024278244
0.024380188,0.02514465
0.025017021,0.023801984
0.023923526,0.01910075
0.019795498,0.015397719
0.015946798,0.008947655
0.008645999,0.0048949937
0.004346861,0.00213533
0.002011233,-0.00028597642
2.5294925e-05,-0.0010386351
-0.00022128117,-0.0019446226
-0.0012683485,-0.0040785116
-0.0034822163,-0.004741241
-0.0038053892,-0.002385284
-0.0010051047,-0.0019394524
-0.00026211436,-0.0012149336
6.0289865e-05,-0.0012870634
-0.0004953729,-0.0044289897
-0.0036606553,-0.0050723944
-0.003967781,-0.0058653983
-0.0044777216,-0.005524498
-0.0039967443,-0.00028156894
0.0013592961,0.002004547
0.0035786603,0.0008777628
0.0020535195,0.0014270003
0.002509362,0.0036370875
0.0051302854,0.0030472507
0.004545656,0.007398008
0.009000278,0.0062999567
0.0077396124,-0.00979448
-0.009693182,-0.014336962
-0.014373596,-0.018493876
-0.017519128,-0.018014057
-0.016316405,0.0009513335
0.0041634585,0.008437406
0.01184421,0.0088612
0.010834572,0.010660546
0.011649206,0.009591313
0.01027971,0.008149904
0.009192694,0.011612388
0.012815625,0.010145636
0.0110151945,-0.003676331
-0.0038453368,-0.00855361
-0.00918589,-0.011807334
-0.011839143,-0.012546262
-0.011666766,-0.0026575294
-0.00080045825,0.0008141936
0.0024094998,0.0019602182
0.003044939,0.0028452703
0.003805828,-0.00031920188
0.00045173537,-0.00084877526
0.00038323048,-0.0007938515
0.00094876904,-0.0002668209
0.0011864477,0.0029064661
0.0044928947,0.0043439767
0.0062540593,0.005095449
0.0066007497,0.005708086
0.006832697,0.0051785973
0.005723504,0.005240556
0.005378351,0.0055213617
0.005832644,0.0057029156
0.0063143265,0.0062618153
0.0071753236,0.0065479614
0.007388421,0.006118573
0.0069402964,0.006063649
0.0068909526,0.0068892003
0.0074457754,0.006727396
0.007400379,0.006915984
0.0075411163,0.006294532
0.006961055,0.003019365
0.004010061,0.0013955547
0.002203941,0.0009137853
0.0018001199,0.00015900763
0.0011961295,-0.00047804
0.00042639405,-0.0008201268
0.00021201515,-0.0016374565
-0.00046939976,-0.0018048553
-0.0006695296,-0.00014400532
0.0013068072,0.00037429514
0.002042261,0.00015561728
0.0014671803,9.764221e-05
0.0012058654,-0.00019960712
0.0008076419,-0.00059517677
0.00019093149,-0.00042481144
0.00062090665,-0.0008766609
0.00051576266,-0.0027021973
-0.001332476,-0.0034624843
-0.0019327927,-0.0047028456
-0.0031136118,-0.0051312167
-0.0038148914,-0.003039114
-0.0016554813,-0.0028943457
-0.0013844903,-0.0025929431
-0.0011756378,-0.0030806456
-0.001690856,-0.007570577
-0.00644726,-0.009639964
-0.008775591,-0.008037089
-0.006810692,-0.008243817
-0.0066763116,-0.01187014
-0.010631713,-0.011542547
-0.010339777,-0.013130759
-0.0118394215,-0.011099597
-0.009695914,0.0028451008
0.0054860176,0.009200066
0.012364197,0.010289811
0.012572053,0.012493202
0.014140561,0.013847734
0.015277139,0.013832223
0.015049778,0.01642169
0.017633375,0.015463831
0.01652535,0.0055637415
0.005527085,0.001565242
0.0011262745,-0.0012716373
-0.0012796998,-0.0027140635
-0.0022609876,0.0013929271
0.0026060215,0.0015189636
0.0027263542,0.003708963
0.0047387523,0.0028220464
0.0037432446,-0.0074463207
-0.007588693,-0.009985272
-0.009917161,-0.01438502
-0.013552559,-0.013852565
-0.012311433,0.003034537
0.0059157796,0.008581242
0.011706703,0.0117044365
0.013059868,0.012215956
0.012399482,0.00035039315
-0.00033588335,-0.0039566285
-0.0044368333,-0.0047597187
-0.0039468985,-0.005746651
-0.0042841774,-0.0032661827
-0.0015434285,-0.0025073367
-0.001221573,-0.00296317
-0.0021768983,-0.002823318
-0.0017530543,-0.0021503323
-0.0008926214,-0.0017962946
-0.00041223047,-0.0017423033
-0.00034304787,-0.0015617668
-0.00022404548,-0.0012877415
0.00036522278,-0.0012014569
0.0006271246,-0.00079088495
0.0009654993,-0.0007649487
0.00066424906,-0.001694923
-0.00077373267,-0.0018726623
-0.00097242085,-0.0022866246
-0.0014079037,-0.0021799132
-0.0012737543,-0.0005030439
0.0006369127,-1.07643755e-05
0.001074798,0.0007132458
0.0019773524,0.00084513065
0.0023998476,-0.0015404924
-0.0002584818,-0.0022344133
-0.0011062733,-0.0014447148
-0.00025210294,-0.0011033909
-2.3576398e-05,-0.00085318275
0.0001521379,0.00022766231
0.001386239,-0.0003974343
0.0007983527,0.001562784
0.0027413853,0.006616701
0.008207065,0.00826382
0.009762146,0.020571655
0.022245975,0.022381933
0.023977078,0.002511151
0.00188225,-0.0040501175
-0.0054992116,-0.005686133
-0.0057084914,-0.006772996
-0.005653888,0.00053457415
0.0025068158,0.0028539158
0.0046355207,0.002728727
0.0035656486,0.0029220618
0.0033576805,0.0011686552
0.0017316341,0.00034971506
0.0014651062,0.000547288
0.0021607485,0.0001922331
0.0018755147,-0.0013001162
0.0003066609,-0.00195615
-0.0003205917,-0.0017928195
-0.0004790425,-0.0018591856
-0.0008209172,-0.00204396
-0.0007799459,-0.0016579682
-0.00041973082,-0.002204663
-0.00092439505,-0.0014951464
8.918171e-05,0.0019987836
0.0035119397,0.0033408555
0.004474904,0.00608806
0.007135467,0.0068109683
0.0078030135,0.0019920028
0.002582274,0.0018132464
0.0024081722,-0.00047354779
0.0005831623,0.0007729161
0.0021764073,0.014064631
0.01627333,0.018697806
0.020858236,0.019938337
0.020657603,0.020089207
0.020136487,0.01327434
0.0134928515,0.009469938
0.009892692,0.009590889
0.01053033,0.007123559
0.007994611,-0.000661882
-0.00073051656,-0.0046525835
-0.0051373662,-0.0063920897
-0.006575401,-0.008127612
-0.007636549,-0.0083723115
-0.006971491,-0.008539117
-0.0070749237,-0.009731589
-0.0081382,-0.009342885
-0.007728766,-0.0061117075
-0.004790498,-0.004601728
-0.0031133592,-0.0015456626
0.00010029413,-5.7720787e-05
0.001388101,-0.0034852845
-0.002304948,-0.0023724006
-0.0010674478,-0.0025342053
-0.00097013125,0.00046219007
0.0020533032,0.014271189
0.016344933,0.021012146
0.022858586,0.023626534
0.024456915,0.026569108
0.027264025,0.027446784
0.028177096,0.028339297
0.029035775,0.030092534
0.0306047,0.03039809
0.030122729,0.027411357
0.026083926,0.025884425
0.024434704,0.026254058
0.025196547,0.02550818
0.025330963,0.021924406
0.02288892,0.020260675
0.020381952,0.021410089
0.020493649,0.02173836
0.020541625,0.018299608
0.01722137,0.018152636
0.016949493,0.023867758
0.022781236,0.0256382
0.024211751,0.02784371
0.027262444,0.024247563
0.02428053,0.028313953
0.029192604,0.022171987
0.022440728,-0.014775081
-0.018041028,-0.03230423
-0.035698757,-0.03411595
-0.034280006,-0.039990675
-0.037795577,-0.050060872
-0.04673339,-0.048140492
-0.04466126,-0.057631027
-0.05156731,-0.054544955
-0.04841182,-0.0197995
-0.014018882,-0.004545618
0.002260188,-0.00013697032
0.003539116,0.0055074613
0.0070451507,0.004483829
