time,open,high,low,close,tick_volume,spread,real_volume,EMA 9,trend,signal,magnitude
2022-01-03,1.05836,1.06254,1.05791,1.0587,203291,30,20329100000,1.0595399181685312,-0.0008399181685312,1,0.041557457
2022-01-04,1.05836,1.06377,1.05836,1.06202,223037,30,22303700000,1.060035934534825,0.001984065465175,0,-0.008325803
2022-01-05,1.0613,1.06493,1.0613,1.06219,273454,30,27345400000,1.06046674762786,0.0017232523721399,1,0.027185693
2022-01-06,1.06207,1.06301,1.05845,1.061,302960,30,30296000000,1.060573398102288,0.0004266018977119,1,0.018900398
2022-01-07,1.06091,1.06317,1.05715,1.05815,246570,30,24657000000,1.0600887184818304,-0.0019387184818304,1,0.011185808
2022-01-10,1.05747,1.06309,1.05696,1.05926,272472,30,27247200000,1.0599229747854644,-0.0006629747854642,0,-0.030426158
2022-01-11,1.06028,1.06289,1.05946,1.06217,280193,30,28019300000,1.0603723798283715,0.0017976201716285,0,-0.011262585
2022-01-12,1.06204,1.06475,1.06145,1.06275,255141,30,25514100000,1.0608479038626972,0.0019020961373028,1,0.028030727
2022-01-13,1.06264,1.06378,1.05978,1.06063,270585,30,27058500000,1.0608043230901578,-0.0001743230901578,1,0.024425084
2022-01-14,1.06042,1.06148,1.05748,1.05825,317472,30,31747200000,1.0602934584721262,-0.0020434584721262,1,0.007036399
2022-01-17,1.05846,1.06129,1.05775,1.05946,199149,30,19914900000,1.060126766777701,-0.0006667667777009,0,-0.022907764
2022-01-18,1.06043,1.0623,1.05573,1.06052,335658,30,33565800000,1.0602054134221608,0.0003145865778391,0,-0.007726456
2022-01-19,1.06051,1.06381,1.05833,1.0625,319740,30,31974000000,1.0606643307377288,0.0018356692622711,1,0.011431596
2022-01-20,1.06239,1.07028,1.06204,1.06936,318061,30,31806100000,1.0624034645901832,0.0069565354098168,1,0.030204002
2022-01-21,1.06922,1.07127,1.06718,1.06872,413081,30,41308100000,1.0636667716721466,0.0050532283278532,1,0.097702116
2022-01-24,1.06687,1.07017,1.06332,1.06605,455334,30,45533400000,1.0641434173377171,0.0019065826622826,1,0.075837284
2022-01-25,1.06605,1.07103,1.06446,1.06818,436614,30,43661400000,1.0649507338701738,0.0032292661298261,1,0.031380646
2022-01-26,1.06768,1.0726,1.06744,1.06918,399749,30,39974900000,1.065796587096139,0.003383412903861,1,0.049676053
2022-01-27,1.06909,1.07195,1.06776,1.06807,479821,30,47982100000,1.0662512696769113,0.0018187303230887,1,0.048041757
2022-01-28,1.06801,1.07047,1.06549,1.06738,435638,30,43563800000,1.066477015741529,0.0009029842584709,1,0.030815661
2022-01-31,1.06764,1.07509,1.06502,1.0742,331179,30,33117900000,1.0680216125932234,0.0061783874067766,1,0.021590443
2022-02-01,1.07405,1.07558,1.06977,1.07367,341988,30,34198800000,1.0691512900745788,0.0045187099254211,1,0.08388122
2022-02-02,1.07357,1.07641,1.07255,1.07544,295250,30,29525000000,1.070409032059663,0.0050309679403368,1,0.06937435
2022-02-03,1.07544,1.07696,1.06956,1.07138,387902,30,38790200000,1.0706032256477305,0.0007767743522695,1,0.072199896
2022-02-04,1.0712,1.07166,1.06667,1.06782,383442,30,38344200000,1.0700465805181845,-0.0022265805181844,1,0.022358699
2022-02-07,1.06907,1.07432,1.06806,1.07415,315147,30,31514700000,1.0708672644145476,0.0032827355854523,0,-0.023625439
2022-02-08,1.07346,1.07528,1.0715,1.07407,296092,30,29609200000,1.071507811531638,0.0025621884683619,1,0.03909884
2022-02-09,1.07394,1.07655,1.0727,1.07296,251593,30,25159300000,1.0717982492253104,0.0011617507746894,1,0.034777634
2022-02-10,1.07285,1.07686,1.07194,1.07347,402968,30,40296800000,1.0721325993802484,0.0013374006197515,1,0.017269114
2022-02-11,1.07348,1.07494,1.07118,1.07246,471303,30,47130300000,1.0721980795041988,0.0002619204958012,1,0.024281299
2022-02-14,1.07253,1.07798,1.07143,1.07595,443808,30,44380800000,1.072948463603359,0.0030015363966409,1,0.015361491
2022-02-15,1.07588,1.0789,1.07302,1.07689,346324,30,34632400000,1.0737367708826873,0.0031532291173126,1,0.05088614
2022-02-16,1.07648,1.0795,1.07533,1.07696,319490,30,31949000000,1.0743814167061498,0.00257858329385,1,0.056078035
2022-02-17,1.07707,1.0774,1.07268,1.07357,395203,30,39520300000,1.07421913336492,-0.0006491333649201,1,0.046808854
2022-02-18,1.07344,1.07432,1.07029,1.07061,369314,30,36931400000,1.073497306691936,-0.0028873066919359,0,-0.0019527671
2022-02-21,1.071,1.07415,1.06963,1.07268,302035,30,30203500000,1.0733338453535488,-0.0006538453535487,0,-0.035141543
2022-02-22,1.07251,1.07374,1.06987,1.07176,464633,30,46463300000,1.073019076282839,-0.001259076282839,0,-0.0055828835
2022-02-23,1.07173,1.07319,1.06674,1.06731,374360,30,37436000000,1.0718772610262712,-0.0045672610262712,0,-0.010242809
2022-02-24,1.06723,1.07244,1.06644,1.07001,637990,30,63799000000,1.071503808821017,-0.001493808821017,0,-0.05085154
2022-02-25,1.0699,1.07346,1.06746,1.07196,513092,30,51309200000,1.0715950470568136,0.0003649529431863,0,-0.012761343
2022-02-28,1.07112,1.07477,1.07062,1.07189,509696,30,50969600000,1.0716540376454509,0.0002359623545491,1,0.012302978
2022-03-01,1.07189,1.07495,1.0714,1.07284,461509,30,46150900000,1.0718912301163608,0.0009487698836392,1,0.009871218
2022-03-02,1.07255,1.07543,1.07174,1.07483,461968,30,46196800000,1.0724789840930886,0.0023510159069113,1,0.022232883
2022-03-03,1.07469,1.07942,1.07425,1.07751,386277,30,38627700000,1.073485187274471,0.0040248127255289,1,0.032632258
2022-03-04,1.07751,1.0791,1.07303,1.07368,478888,30,47888800000,1.073524149819577,0.000155850180423,1,0.05935406
2022-03-07,1.07597,1.0766,1.07107,1.0715,529594,30,52959400000,1.0731193198556614,-0.0016193198556615,1,0.0034204468
2022-03-08,1.07141,1.0731,1.06412,1.06723,577814,30,57781400000,1.0719414558845293,-0.0047114558845293,0,-0.013759738
2022-03-09,1.06566,1.07166,1.0656,1.06993,440956,30,44095600000,1.0715391647076236,-0.0016091647076235,0,-0.055570528
2022-03-10,1.06972,1.07236,1.06854,1.07054,411484,30,41148400000,1.0713393317660989,-0.0007993317660988,0,-0.018530833
2022-03-11,1.07057,1.07291,1.06839,1.06959,402164,30,40216400000,1.070989465412879,-0.001399465412879,0,-0.010847995
2022-03-14,1.07082,1.07154,1.06396,1.06487,382221,30,38222100000,1.0697655723303034,-0.0048955723303034,0,-0.017805511
2022-03-15,1.06487,1.06731,1.05969,1.06253,393962,30,39396200000,1.0683184578642428,-0.0057884578642428,0,-0.06410016
2022-03-16,1.06253,1.06669,1.06239,1.06624,425925,30,42592500000,1.0679027662913945,-0.0016627662913943,0,-0.07993661
2022-03-17,1.06624,1.07208,1.0658,1.07131,353145,30,35314500000,1.0685842130331156,0.0027257869668844,0,-0.02619317
2022-03-18,1.07131,1.07395,1.07023,1.07294,326570,30,32657000000,1.0694553704264926,0.0034846295735073,1,0.034871113
2022-03-21,1.07192,1.0749,1.07048,1.07396,316174,30,31617400000,1.070356296341194,0.0036037036588059,1,0.043553997
2022-03-22,1.07396,1.0753,1.06921,1.07196,288277,30,28827700000,1.0706770370729553,0.0012829629270447,1,0.049620867
2022-03-23,1.07196,1.07624,1.07047,1.0749,310528,30,31052800000,1.0715216296583645,0.0033783703416356,1,0.019143863
2022-03-24,1.07506,1.08045,1.07403,1.07858,328169,30,32816900000,1.0729333037266915,0.0056466962733086,1,0.03866209
2022-03-25,1.07874,1.08073,1.07693,1.07742,315317,30,31531700000,1.0738306429813531,0.0035893570186469,1,0.067075774
2022-03-28,1.07883,1.08732,1.07536,1.08587,361007,30,36100700000,1.0762385143850826,0.0096314856149173,1,0.056770552
2022-03-29,1.08583,1.08839,1.08152,1.08236,384692,30,38469200000,1.0774628115080662,0.0048971884919337,1,0.11809664
2022-03-30,1.08241,1.08329,1.07539,1.07572,360975,30,36097500000,1.0771142492064532,-0.0013942492064531,1,0.07257777
2022-03-31,1.07571,1.0812,1.0752,1.07831,359861,30,35986100000,1.0773533993651627,0.0009566006348373,0,-0.012953122
2022-04-01,1.07723,1.0859,1.07723,1.08103,327656,30,32765600000,1.0780887194921305,0.0029412805078696,1,0.025094645
2022-04-04,1.07936,1.08606,1.07761,1.08521,253392,30,25339200000,1.0795129755937043,0.0056970244062957,1,0.046036765
2022-04-05,1.08507,1.09239,1.08322,1.08917,319525,30,31952500000,1.0814443804749636,0.0077256195250363,1,0.07504054
2022-04-06,1.08903,1.09205,1.08411,1.08414,375613,30,37561300000,1.0819835043799708,0.0021564956200292,1,0.09507979
2022-04-07,1.08414,1.0865,1.08264,1.08379,325669,30,32566900000,1.0823448035039769,0.0014451964960233,1,0.030646753
2022-04-08,1.08381,1.09012,1.08259,1.08708,299560,30,29956000000,1.0832918428031817,0.0037881571968185,1,0.02182762
2022-04-11,1.0866,1.09048,1.08561,1.08606,288619,30,28861900000,1.0838454742425452,0.0022145257574548,1,0.059461482
2022-04-12,1.08612,1.08871,1.08285,1.08745,372199,30,37219900000,1.084566379394036,0.0028836206059639,1,0.037938353
2022-04-13,1.08729,1.09729,1.08226,1.0953,342230,30,34223000000,1.0867131035152289,0.008586896484771,1,0.04923386
2022-04-14,1.09538,1.09674,1.09079,1.09234,319565,30,31956500000,1.0878384828121832,0.0045015171878168,1,0.11455607
2022-04-15,1.09239,1.09364,1.08475,1.09236,246111,30,24611100000,1.0887427862497463,0.0036172137502534,1,0.076072015
2022-04-18,1.09086,1.0949,1.09046,1.09046,214586,30,21458600000,1.0890862289997971,0.0013737710002026,1,0.06213189
2022-04-19,1.08916,1.09648,1.08782,1.0929,316495,30,31649500000,1.089848983199838,0.003051016800162,1,0.02662162
2022-04-20,1.09288,1.09748,1.09241,1.09362,341869,30,34186900000,1.0906031865598704,0.0030168134401296,1,0.045741063
2022-04-21,1.09349,1.09954,1.09271,1.09271,374766,30,37476600000,1.0910245492478965,0.0016854507521035,1,0.037371326
2022-04-22,1.09402,1.09674,1.08942,1.09071,397497,30,39749700000,1.0909616393983173,-0.0002516393983171,1,0.023173127
2022-04-25,1.09329,1.09329,1.08212,1.08385,401308,30,40130800000,1.0895393115186538,-0.0056893115186538,1,0.000893072
2022-04-26,1.08375,1.08822,1.08318,1.08503,362718,30,36271800000,1.0886374492149231,-0.0036074492149231,0,-0.07152767
2022-04-27,1.08486,1.09155,1.08444,1.08774,386073,30,38607300000,1.0884579593719386,-0.0007179593719386,0,-0.046660263
2022-04-28,1.08764,1.09612,1.0872,1.09239,395552,30,39555200000,1.089244367497551,0.003145632502449,0,-0.013315329
2022-04-29,1.09237,1.09768,1.09023,1.09273,340919,30,34091900000,1.0899414939980407,0.0027885060019592,1,0.036239043
2022-05-02,1.09179,1.09747,1.09124,1.0948,366747,30,36674700000,1.0909131951984326,0.0038868048015674,1,0.041939106
2022-05-03,1.09468,1.10636,1.09393,1.09975,381956,30,38195600000,1.092680556158746,0.0070694438412539,1,0.05710458
2022-05-04,1.09983,1.11101,1.09965,1.10882,355039,30,35503900000,1.095908444926997,0.012911555073003,1,0.10036524
2022-05-05,1.10882,1.1094,1.10368,1.10481,452085,30,45208500000,1.0976887559415975,0.0071212440584025,1,0.16844837
2022-05-06,1.10484,1.10781,1.10157,1.10245,497006,30,49700600000,1.0986410047532782,0.0038089952467217,1,0.11021692
2022-05-09,1.10238,1.10515,1.09603,1.09751,501200,30,50120000000,1.098414803802623,-0.0009048038026227,1,0.060295913
2022-05-10,1.09634,1.10377,1.09634,1.10263,533500,30,53350000000,1.099257843042098,0.0033721569579019,0,-0.0070067667
2022-05-11,1.10259,1.10614,1.09852,1.10053,506858,30,50685800000,1.0995122744336785,0.0010177255663215,1,0.04377176
2022-05-12,1.10044,1.10521,1.09805,1.09931,582598,30,58259800000,1.0994718195469428,-0.0001618195469428,1,0.016787883
2022-05-13,1.09964,1.10579,1.09881,1.10338,394254,30,39425400000,1.1002534556375545,0.0031265443624457,1,0.008027376
2022-05-16,1.10206,1.10665,1.10136,1.10391,479865,30,47986500000,1.1009847645100437,0.0029252354899564,1,0.0482305
2022-05-17,1.10363,1.10792,1.10215,1.10387,454055,30,45405500000,1.1015618116080348,0.0023081883919651,1,0.038636975
2022-05-18,1.10373,1.10627,1.10057,1.10287,394642,30,39464200000,1.1018234492864278,0.0010465507135721,1,0.030212281
2022-05-19,1.1028,1.10689,1.09888,1.1041,544788,30,54478800000,1.1022787594291423,0.0018212405708577,1,0.011041892
2022-05-20,1.10392,1.10418,1.09795,1.09851,459213,30,45921300000,1.1015250075433138,-0.0030150075433137,1,0.011821756
2022-05-23,1.10044,1.10105,1.09713,1.09781,370938,30,37093800000,1.1007820060346512,-0.0029720060346511,0,-0.039117593
2022-05-24,1.09784,1.10078,1.09582,1.09582,421354,30,42135400000,1.0997896048277211,-0.0039696048277211,0,-0.045575526
2022-05-25,1.09582,1.10241,1.09203,1.09433,445923,30,44592300000,1.098697683862177,-0.0043676838621768,0,-0.05492611
2022-05-26,1.09451,1.09669,1.09281,1.09521,358017,30,35801700000,1.0980001470897416,-0.0027901470897415,0,-0.05214718
2022-05-27,1.09517,1.09651,1.09247,1.09515,312852,30,31285200000,1.097430117671793,-0.0022801176717932,0,-0.030063823
2022-05-30,1.09404,1.09841,1.09286,1.09688,224864,30,22486400000,1.0973200941374346,-0.0004400941374345,0,-0.02816671
2022-05-31,1.09688,1.10354,1.09641,1.10024,404617,30,40461700000,1.0979040753099478,0.0023359246900522,0,-0.004125115
2022-06-01,1.1002,1.10759,1.09932,1.10582,386723,30,38672300000,1.0994872602479582,0.0063327397520418,1,0.033223666
2022-06-02,1.10546,1.10778,1.10448,1.10738,292386,30,29238600000,1.1010658081983666,0.0063141918016333,1,0.084917046
2022-06-03,1.10735,1.10945,1.10595,1.10774,287260,30,28726000000,1.1024006465586933,0.0053393534413066,1,0.08716923
2022-06-06,1.10604,1.10894,1.10513,1.10768,284403,30,28440300000,1.1034565172469546,0.0042234827530454,1,0.07253712
2022-06-07,1.10766,1.11606,1.10543,1.11239,366046,30,36604600000,1.1052432137975636,0.0071467862024363,1,0.06677542
2022-06-08,1.11268,1.11617,1.11198,1.11198,339452,30,33945200000,1.106590571038051,0.0053894289619489,1,0.10033403
2022-06-09,1.1151,1.11565,1.10778,1.10857,387339,30,38733900000,1.1069864568304408,0.0015835431695592,1,0.078340836
2022-06-10,1.10857,1.11176,1.10634,1.10684,395758,30,39575800000,1.1069571654643529,-0.0001171654643528,1,0.0322268
2022-06-13,1.10801,1.10974,1.1053,1.1053,510225,30,51022500000,1.1066257323714823,-0.0013257323714823,1,0.005905308
2022-06-14,1.10523,1.1096,1.10312,1.10468,519260,30,51926000000,1.106236585897186,-0.0015565858971857,0,-0.014767979
2022-06-15,1.10458,1.11477,1.10273,1.11065,540883,30,54088300000,1.107119268717749,0.0035307312822512,0,-0.025076212
2022-06-16,1.10952,1.11652,1.10342,1.10614,565943,30,56594300000,1.106923414974199,-0.0007834149741992,1,0.04325913
2022-06-17,1.10606,1.10875,1.09728,1.09797,513306,30,51330600000,1.1051327319793594,-0.0071627319793594,1,0.0012595908
2022-06-20,1.09685,1.10053,1.09361,1.09361,337444,30,33744400000,1.1028281855834876,-0.0092181855834876,0,-0.09034745
2022-06-21,1.0935,1.10143,1.0935,1.0993,379634,30,37963400000,1.10212254846679,-0.00282254846679,0,-0.123138174
2022-06-22,1.09763,1.10497,1.09763,1.10147,408368,30,40836800000,1.101992038773432,-0.0005220387734321,0,-0.041775312
2022-06-23,1.10147,1.10293,1.09547,1.09645,451623,30,45162300000,1.1008836310187458,-0.0044336310187458,0,-0.0069255256
2022-06-24,1.09616,1.09974,1.09512,1.09862,397580,30,39758000000,1.1004309048149967,-0.0018109048149967,0,-0.051069327
2022-06-27,1.09732,1.10014,1.09541,1.09755,423543,30,42354300000,1.0998547238519976,-0.0023047238519975,0,-0.019347364
2022-06-28,1.09612,1.10789,1.09612,1.10607,448382,30,44838200000,1.101097779081598,0.0049722209184019,0,-0.029006572
2022-06-29,1.10613,1.1075,1.10268,1.10552,464779,30,46477900000,1.1019822232652785,0.0035377767347215,1,0.07534882
2022-06-30,1.10545,1.10893,1.10435,1.1047,456594,30,45659400000,1.102525778612223,0.0021742213877771,1,0.050251868
2022-07-01,1.10441,1.1063,1.09574,1.09696,485804,30,48580400000,1.1014126228897785,-0.0044526228897783,1,0.035653904
2022-07-04,1.09743,1.10608,1.09606,1.10512,299144,30,29914400000,1.1021540983118228,0.0029659016881773,0,-0.052567437
2022-07-05,1.10512,1.10765,1.09791,1.10078,477912,30,47791200000,1.1018792786494582,-0.0010992786494581,1,0.039665848
2022-07-06,1.10082,1.10425,1.09958,1.10107,446476,30,44647600000,1.1017174229195668,-0.0006474229195667,0,-0.012713893
2022-07-07,1.10049,1.10786,1.10016,1.10557,297300,30,29730000000,1.1024879383356534,0.0030820616643465,0,-0.011605883
2022-07-08,1.10525,1.1093,1.10521,1.10695,319157,30,31915700000,1.1033803506685227,0.0035696493314774,1,0.049504023
2022-07-11,1.10586,1.10742,1.09931,1.10147,303986,28,40862450000,1.1029982805348182,-0.0015282805348182,1,0.055802945
2022-07-12,1.10122,1.10331,1.09926,1.09965,335327,34,50299050000,1.1023286244278545,-0.0026786244278544,0,-0.013386288
2022-07-13,1.09853,1.10643,1.09824,1.10046,354800,34,53220000000,1.1019548995422837,-0.0014948995422836,0,-0.034596827
2022-07-14,1.10154,1.10677,1.10007,1.10051,356896,34,53534400000,1.101665919633827,-0.0011559196338268,0,-0.013814961
2022-07-15,1.10051,1.10385,1.09733,1.10264,300922,34,45138300000,1.1018607357070616,0.0007792642929385,0,-0.01863389
2022-07-18,1.10142,1.10815,1.0991,1.10584,276890,34,41533500000,1.1026565885656492,0.0031834114343507,1,0.0038874533
2022-07-19,1.10574,1.10977,1.10505,1.10546,278837,34,41825550000,1.1032172708525194,0.0022427291474806,1,0.041828927
2022-07-20,1.10547,1.10852,1.10122,1.10272,297658,34,44648700000,1.1031178166820157,-0.0003978166820157,1,0.035566565
2022-07-21,1.10158,1.11037,1.10156,1.10797,329804,34,49470600000,1.104088253345613,0.0038817466543872,1,0.0014913689
2022-07-22,1.10799,1.11088,1.10584,1.10726,321731,34,48259650000,1.1047226026764905,0.0025373973235096,1,0.054220974
2022-07-25,1.10555,1.11103,1.10354,1.10691,282131,34,42319650000,1.1051600821411922,0.0017499178588078,1,0.034369584
2022-07-26,1.10824,1.11413,1.10824,1.11062,245684,34,36852600000,1.1062520657129538,0.0043679342870461,1,0.020668127
2022-07-27,1.11117,1.11763,1.1091,1.116,263280,34,39492000000,1.108201652570363,0.007798347429637,1,0.06827128
2022-07-28,1.11578,1.11775,1.10949,1.10961,300552,34,45082800000,1.1084833220562904,0.0011266779437095,1,0.10720195
2022-07-29,1.10971,1.11334,1.10908,1.1112,287522,34,43128300000,1.1090266576450325,0.0021733423549676,1,0.012969156
2022-08-01,1.11012,1.11254,1.10723,1.1078,263324,34,39498600000,1.1087813261160258,-0.0009813261160258,1,0.022165857
2022-08-02,1.10727,1.10976,1.1006,1.10452,312115,34,46817250000,1.1079290608928205,-0.0034090608928205,0,-0.018993083
2022-08-03,1.10547,1.11081,1.10369,1.10711,294421,34,44163150000,1.1077652487142564,-0.0006552487142563,0,-0.048121817
2022-08-04,1.10529,1.10831,1.10476,1.10484,258638,34,38795700000,1.1071801989714052,-0.0023401989714051,0,-0.014021833
2022-08-05,1.10469,1.10779,1.10227,1.10697,259678,34,38951700000,1.1071381591771243,-0.0001681591771243,0,-0.03394893
2022-08-08,1.1037,1.11246,1.10356,1.10968,229606,34,34440900000,1.1076465273416995,0.0020334726583004,0,-0.0040157638
2022-08-09,1.10939,1.11209,1.10507,1.10574,218836,34,32825400000,1.1072652218733596,-0.0015252218733596,1,0.03466165
2022-08-10,1.10503,1.11223,1.10105,1.10565,256026,34,38403900000,1.1069421774986878,-0.0012921774986878,0,-0.020386806
2022-08-11,1.10508,1.10649,1.1023,1.10335,280197,34,42029550000,1.1062237419989502,-0.0028737419989501,0,-0.010855192
2022-08-12,1.10334,1.10495,1.10096,1.10234,244064,34,36609600000,1.1054469935991602,-0.0031069935991601,0,-0.03580984
2022-08-15,1.10212,1.1059,1.10104,1.10173,248146,34,37221900000,1.1047035948793282,-0.0029735948793281,0,-0.036842942
2022-08-16,1.10174,1.10806,1.10098,1.10558,253494,34,38024100000,1.104878875903463,0.0007011240965373,0,-0.033831842
2022-08-17,1.10538,1.10684,1.09881,1.10243,309209,34,46381350000,1.1043891007227702,-0.0019591007227701,1,0.01570641
2022-08-18,1.10051,1.10738,1.10051,1.10353,293103,34,43965450000,1.1042172805782162,-0.0006872805782163,0,-0.022596259
2022-08-19,1.10346,1.11449,1.10271,1.11335,271226,34,40683900000,1.106043824462573,0.007306175537427,0,-0.0032908698
2022-08-22,1.11084,1.11495,1.11033,1.11411,274895,34,41234250000,1.1076570595700586,0.0064529404299413,1,0.10569622
2022-08-23,1.11396,1.11544,1.11201,1.115,304712,34,45706800000,1.109125647656047,0.005874352343953,1,0.10065201
2022-08-24,1.11461,1.11699,1.11161,1.11482,262770,34,39415500000,1.1102645181248376,0.0045554818751623,1,0.090772346
2022-08-25,1.11482,1.12144,1.11402,1.11869,283412,34,42511800000,1.1119496144998702,0.0067403855001297,1,0.075733215
2022-08-26,1.1184,1.12535,1.11691,1.12311,294757,34,44213550000,1.1141816915998963,0.0089283084001037,1,0.10349826
2022-08-29,1.12238,1.12392,1.12039,1.12047,270774,34,40616100000,1.1154393532799172,0.0050306467200829,1,0.116935015
2022-08-30,1.12021,1.12481,1.1167,1.11797,339229,34,50884350000,1.115945482623934,0.002024517376066,1,0.08308175
2022-08-31,1.11796,1.12188,1.11686,1.1177,316606,34,47490900000,1.1162963860991473,0.0014036139008526,1,0.03061628
2022-09-01,1.11762,1.12078,1.11565,1.11593,319524,34,47928600000,1.116223108879318,-0.0002931088793178,1,0.023036418
2022-09-02,1.11582,1.12061,1.11314,1.11391,310624,34,46593600000,1.1157604871034543,-0.0018504871034543,0,-0.0006670152
2022-09-05,1.11227,1.11601,1.11172,1.11292,245936,34,36890400000,1.1151923896827634,-0.0022723896827634,0,-0.022516979
2022-09-06,1.11392,1.11642,1.11256,1.11487,337010,34,50551500000,1.1151279117462107,-0.0002579117462107,0,-0.027688537
2022-09-07,1.11488,1.11792,1.11234,1.11368,344987,34,51748050000,1.1148383293969686,-0.0011583293969685,0,-0.005139341
2022-09-08,1.11358,1.11541,1.11129,1.11472,346935,34,52040250000,1.1148146635175749,-9.46635175749222e-05,0,-0.016417436
2022-09-09,1.11473,1.12117,1.11248,1.12045,312030,34,46804500000,1.1159417308140598,0.0045082691859401,0,-0.0054995255
2022-09-12,1.12068,1.12255,1.11806,1.12201,281130,34,42169500000,1.117155384651248,0.004854615348752,1,0.05973985
2022-09-13,1.12168,1.12561,1.1194,1.12168,289345,34,43401750000,1.1180603077209983,0.0036196922790017,1,0.072660394
2022-09-14,1.12155,1.12374,1.1204,1.12373,337025,34,50553750000,1.1191942461767987,0.0045357538232011,1,0.05698361
2022-09-15,1.12373,1.12558,1.12046,1.12312,308173,34,46225950000,1.119979396941439,0.0031406030585607,1,0.07211805
2022-09-16,1.12306,1.12532,1.11973,1.12122,322423,34,48363450000,1.1202275175531513,0.0009924824468487,1,0.05669376
2022-09-19,1.11968,1.12925,1.11968,1.12783,276289,34,41443350000,1.1217480140425211,0.0060819859574789,1,0.028021991
2022-09-20,1.12778,1.13627,1.12674,1.13384,298159,34,44723850000,1.124166411234017,0.0096735887659828,1,0.09796339
2022-09-21,1.13381,1.13491,1.13073,1.13197,341319,34,51197850000,1.1257271289872135,0.0062428710127862,1,0.13198031
2022-09-22,1.13197,1.1369,1.12858,1.13424,368901,34,55335150000,1.127429703189771,0.0068102968102288,1,0.096506715
2022-09-23,1.13501,1.1371,1.13281,1.1347,336467,34,50470050000,1.1288837625518169,0.0058162374481831,1,0.10267465
2022-09-26,1.13279,1.14594,1.13252,1.14456,401624,34,60243600000,1.1320190100414536,0.0125409899585464,1,0.08153257
2022-09-27,1.1445,1.14528,1.13701,1.13761,383347,34,57502050000,1.1331372080331628,0.0044727919668372,1,0.13629892
2022-09-28,1.14055,1.1489,1.13633,1.13705,430516,34,64577400000,1.1339197664265304,0.0031302335734695,1,0.06779568
2022-09-29,1.13696,1.14115,1.13415,1.13454,410353,34,61552950000,1.1340438131412245,0.0004961868587756,1,0.04892293
2022-09-30,1.13449,1.1438,1.13159,1.14294,407077,34,61061550000,1.1358230505129796,0.0071169494870204,1,0.011312287
2022-10-03,1.14204,1.14409,1.13606,1.13741,350113,34,52516950000,1.1361404404103836,0.0012695595896163,1,0.082169
2022-10-04,1.13705,1.1418,1.13055,1.13194,353484,34,53022600000,1.135300352328307,-0.003360352328307,1,0.021764562
2022-10-05,1.13234,1.13589,1.12386,1.12892,367449,34,55117350000,1.1340242818626456,-0.0051042818626456,0,-0.044321053
2022-10-06,1.12911,1.13476,1.12434,1.12852,423719,34,63557850000,1.1329234254901164,-0.0044034254901164,0,-0.06687088
2022-10-07,1.1293,1.13682,1.12877,1.13455,389205,34,58380750000,1.1332487403920932,0.0013012596079067,0,-0.066094115
2022-10-10,1.13405,1.13526,1.12673,1.13144,361854,34,54278100000,1.1328869923136746,-0.0014469923136746,1,0.005219709
2022-10-11,1.1299,1.1316,1.11948,1.12054,426978,34,64046700000,1.1304175938509398,-0.0098775938509396,0,-0.022673102
2022-10-12,1.11952,1.12354,1.11113,1.11853,393138,34,58970700000,1.1280400750807518,-0.0095100750807517,0,-0.1326912
2022-10-13,1.11865,1.12042,1.11407,1.11613,387208,34,58081200000,1.1256580600646011,-0.0095280600646012,0,-0.14456157
2022-10-14,1.11614,1.11878,1.11314,1.11314,430939,34,64640850000,1.123154448051681,-0.010014448051681,0,-0.13619137
2022-10-17,1.11334,1.11876,1.11288,1.1146,368458,34,55268700000,1.121443558441345,-0.0068435584413448,0,-0.1375662
2022-10-18,1.11498,1.11649,1.10696,1.10863,392538,34,58880700000,1.118880846753076,-0.0102508467530759,0,-0.096059725
2022-10-19,1.10725,1.10962,1.10486,1.10487,369612,34,55441800000,1.1160786774024607,-0.0112086774024606,0,-0.13740297
2022-10-20,1.10489,1.10869,1.103,1.10577,385132,34,57769800000,1.1140169419219683,-0.0082469419219686,0,-0.15184565
2022-10-21,1.10573,1.10991,1.10189,1.10834,390573,34,58585950000,1.112881553537575,-0.0045415535375747,0,-0.11773117
2022-10-24,1.1058,1.10995,1.10206,1.10772,428769,34,64315350000,1.11184924283006,-0.0041292428300598,0,-0.06794531
2022-10-25,1.10716,1.11201,1.10511,1.11107,360590,34,54088500000,1.111693394264048,-0.0006233942640478,0,-0.05675237
2022-10-26,1.10799,1.11742,1.10632,1.11313,404947,34,60742050000,1.1119807154112382,0.0011492845887617,0,-0.017560545
2022-10-27,1.11316,1.11446,1.10569,1.10683,399049,34,59857350000,1.1109505723289903,-0.0041205723289905,1,0.0068138754
2022-10-28,1.10683,1.10796,1.10113,1.10245,362858,34,54428700000,1.1092504578631923,-0.0068004578631926,0,-0.051205385
2022-10-31,1.10241,1.10547,1.09758,1.09931,322930,34,48439500000,1.107262366290554,-0.007952366290554,0,-0.08631232
2022-11-01,1.09932,1.10177,1.09152,1.09311,354274,34,53141100000,1.1044318930324433,-0.0113218930324432,0,-0.092331536
2022-11-02,1.09311,1.09551,1.088,1.09019,371319,34,55697850000,1.1015835144259547,-0.0113935144259547,0,-0.14056781
2022-11-03,1.09037,1.09341,1.08521,1.08834,358888,34,53833200000,1.0989348115407638,-0.0105948115407636,0,-0.14749269
2022-11-04,1.08834,1.09597,1.08784,1.09061,394800,34,59220000000,1.0972698492326112,-0.006659849232611,0,-0.14039187
2022-11-07,1.09191,1.09422,1.08894,1.09045,349709,34,52456350000,1.095905879386089,-0.005455879386089,0,-0.09104664
2022-11-08,1.09047,1.09257,1.08793,1.09117,325362,34,47048700000,1.0949587035088713,-0.0037887035088712,0,-0.069974214
2022-11-09,1.09117,1.0969,1.08937,1.09249,379262,34,56889300000,1.094464962807097,-0.001974962807097,0,-0.045281637
2022-11-10,1.09142,1.09878,1.08933,1.09812,408240,34,61236000000,1.0951959702456775,0.0029240297543222,0,-0.03006111
2022-11-11,1.09806,1.10436,1.09369,1.09524,409227,34,61384050000,1.0952047761965422,3.522380345777343e-05,1,0.027199136
2022-11-14,1.09816,1.10035,1.09419,1.09887,390277,34,58541550000,1.095937820957234,0.0029321790427661,0,-0.0068956167
2022-11-15,1.09858,1.0999,1.09465,1.09611,466718,34,70007700000,1.0959722567657872,0.0001377432342126,1,0.029144963
2022-11-16,1.09509,1.09904,1.09421,1.09486,441027,34,66154050000,1.0957498054126298,-0.0008898054126298,1,0.005950085
2022-11-17,1.09212,1.09787,1.08731,1.08886,401092,34,60163800000,1.0943718443301038,-0.0055118443301038,0,-0.0064133042
2022-11-18,1.08874,1.09204,1.08322,1.08426,369118,34,55367700000,1.092349475464083,-0.008089475464083,0,-0.069223516
2022-11-21,1.07995,1.0852,1.07995,1.08236,364571,34,54685650000,1.0903515803712664,-0.0079915803712664,0,-0.100586765
2022-11-22,1.08237,1.08352,1.07804,1.07828,325690,34,48853500000,1.087937264297013,-0.0096572642970134,0,-0.106411956
2022-11-23,1.07824,1.08236,1.07445,1.07811,367017,34,55052550000,1.085971811437611,-0.0078618114376107,0,-0.1484678
2022-11-24,1.07803,1.08097,1.07634,1.07946,271900,34,40785000000,1.0846694491500886,-0.0052094491500884,0,-0.12361978
2022-11-25,1.07937,1.08198,1.07774,1.0789,290001,34,43500150000,1.083515559320071,-0.0046155593200709,0,-0.07831599
2022-11-28,1.07893,1.08084,1.07507,1.07866,331630,34,49744500000,1.0825444474560568,-0.0038844474560568,0,-0.067758925
2022-11-29,1.07849,1.08168,1.0761,1.07694,375230,34,56284500000,1.0814235579648457,-0.0044835579648454,0,-0.05175862
2022-11-30,1.07814,1.0795,1.07544,1.07598,382291,34,57343650000,1.0803348463718765,-0.0043548463718765,0,-0.05477546
2022-12-01,1.0759,1.07876,1.06659,1.06887,423015,34,63452250000,1.078041877097501,-0.0091718770975011,0,-0.054928705
2022-12-02,1.0687,1.06939,1.05747,1.05898,386822,34,58023300000,1.074229501678001,-0.0152495016780009,0,-0.10213152
2022-12-05,1.06065,1.06564,1.05897,1.05907,351950,34,52792500000,1.071197601342401,-0.0121276013424009,0,-0.18091853
2022-12-06,1.05888,1.06575,1.05608,1.05667,345133,34,51769950000,1.068292081073921,-0.0116220810739209,0,-0.16897932
2022-12-07,1.05834,1.06067,1.05302,1.05793,353371,34,53005650000,1.0662196648591369,-0.0082896648591368,0,-0.17563711
2022-12-08,1.05793,1.06219,1.05618,1.06044,323968,34,48595200000,1.0650637318873095,-0.0046237318873094,0,-0.12197544
2022-12-09,1.06035,1.06238,1.05737,1.05895,301933,34,45289950000,1.0638409855098478,-0.0048909855098477,0,-0.06429329
2022-12-12,1.05901,1.06131,1.05636,1.05641,320594,34,48089100000,1.0623547884078783,-0.0059447884078782,0,-0.06753586
2022-12-13,1.0565,1.06071,1.05138,1.05964,378488,34,56773200000,1.0618118307263027,-0.0021718307263027,0,-0.0798126
2022-12-14,1.05974,1.0663,1.05869,1.06295,390092,34,58513800000,1.0620394645810425,0.0009105354189578,0,-0.032075085
2022-12-15,1.06295,1.06401,1.05267,1.0552,372376,34,55856400000,1.0606715716648338,-0.0054715716648339,1,0.0071294247
2022-12-16,1.05511,1.05757,1.04688,1.04766,355621,34,53343150000,1.058069257331867,-0.010409257331867,0,-0.07557593
2022-12-19,1.04726,1.0559,1.04726,1.0513,330340,34,49551000000,1.0567154058654935,-0.0054154058654938,0,-0.1411537
2022-12-20,1.0516,1.05646,1.04996,1.05014,420059,34,63008850000,1.055400324692395,-0.005260324692395,0,-0.081743866
2022-12-21,1.04987,1.06693,1.04955,1.06435,359682,34,53952300000,1.057190259753916,0.0071597402460839,0,-0.06477252
2022-12-22,1.06431,1.07173,1.06207,1.06713,359000,34,53850000000,1.0591782078031329,0.007951792196867,1,0.079695515
2022-12-23,1.06572,1.06882,1.0634,1.06781,367916,34,55187400000,1.0609045662425065,0.0069054337574936,1,0.09903772
2022-12-26,1.0659,1.07365,1.06299,1.0665,25038,140,3755700000,1.062023652994005,0.0044763470059949,1,0.08029823
2022-12-27,1.06665,1.07415,1.06646,1.07194,281269,34,42190350000,1.064006922395204,0.0079330776047958,1,0.06438255
2022-12-28,1.07194,1.07634,1.06567,1.06746,313214,34,46982100000,1.0646975379161634,0.0027624620838366,1,0.10525772
2022-12-29,1.06754,1.06875,1.06223,1.06655,283257,34,42488550000,1.0650680303329307,0.0014819696670693,1,0.041093852
2022-12-30,1.06447,1.07536,1.06379,1.07265,315411,34,47311650000,1.0665844242663447,0.0060655757336554,1,0.02826064
