Predicted,Actual
0.009762288,0.013962392
0.019123262,0.018101677
0.019358117,0.023186253
0.024027726,0.025840497
0.025001314,0.02800463
0.02734777,0.031824134
0.031616405,0.033171285
0.032371745,0.027490485
0.024616975,0.025290107
0.021719664,0.02905774
0.026954982,0.028748726
0.026884517,0.022505457
0.018577777,0.022848219
0.018814733,0.014398527
0.009275651,0.016275449
0.013434576,0.04532426
0.04749039,0.0522369
0.050818305,0.06461628
0.060215216,0.06297207
0.057172973,0.016042475
0.0022545955,0.0014694144
-0.008598317,-0.008168258
-0.015225867,-0.008825679
-0.012230728,0.030380854
0.03702619,0.044534985
0.046134073,0.04668467
0.045514386,0.048813347
0.04636616,0.040893164
0.03752998,0.037606582
0.03530381,0.032215226
0.02924581,0.026306575
0.022460999,0.035440873
0.03529468,0.0343376
0.03335047,-0.001859192
-0.012945539,-0.013833166
-0.022728072,0.008891606
0.012068191,0.011148717
0.013385214,0.006508945
0.0054016453,0.0015415128
-0.002057914,-0.017922549
-0.024440393,-0.027825369
-0.031101711,-0.029254204
-0.030683793,-0.032999117
-0.034236927,-0.03892891
-0.03994849,-0.039741952
-0.04023672,-0.043237083
-0.04293753,-0.04035354
-0.03813667,-0.02137447
-0.016634475,-0.012071681
-0.008355381,-0.0023083293
0.002020505,0.003456256
0.0062225643,-0.0011330867
-0.0006463468,-0.0012347336
0.0007228568,0.0022908628
0.0039382786,-0.009921601
-0.013735474,0.00096091744
0.0025028829,0.002048959
0.0038979067,0.0056343093
0.0068709482,0.007905079
0.008282019,0.00834463
0.0078225685,0.0099059725
0.009646462,0.012967986
0.013323485,0.014254856
0.014933393,0.017959451
0.018813092,0.018805327
0.018797226,0.012118171
0.010307334,0.011464952
0.009904274,0.009491637
0.00758082,0.010851131
0.009994734,0.025478167
0.027838688,0.031266917
0.031975523,0.029783582
0.028359987,0.030212888
0.02864738,0.031233953
0.029697625,0.028604005
0.027133057,0.030637205
0.030093772,0.02619508
0.02303109,0.0038633686
-0.0031672316,-0.0065722447
-0.012379564,-0.012582674
-0.01682429,-0.017108323
-0.02032197,-0.014224126
-0.014649376,-0.01562735
-0.015653668,-0.013184806
-0.013206102,-0.014433198
-0.015346057,-0.02784323
-0.031465463,-0.029899543
-0.030851977,-0.03452474
-0.035279766,-0.03159799
-0.030964794,-0.0021731942
0.005430775,0.0106746275
0.017472055,0.01208744
0.015110774,0.015961183
0.017047727,0.018503537
0.018517628,0.018146329
0.018098928,0.021326011
0.021952001,0.018948603
0.017972812,0.00018412003
-0.004540608,-0.00930581
-0.013628848,-0.008736115
-0.010653884,-0.012802777
-0.014959561,-0.024167659
-0.027934847,-0.027458968
-0.030261219,-0.03321462
-0.035585284,-0.03275091
-0.033024136,-0.010563657
-0.004836633,-0.0013151056
0.0039730268,-0.0041676527
-0.0030986478,-0.0023647998
-0.0016221562,0.004514618
0.006629141,0.0036377495
0.0045658383,0.008364723
0.010175969,0.004223729
0.0038153995,-0.028406752
-0.03629587,-0.04301514
-0.047817506,-0.04375359
-0.043942723,-0.04810024
-0.046658397,-0.05303852
-0.051313527,-0.052262247
-0.050242156,-0.057793595
-0.05579893,-0.053626206
-0.04992862,-0.022060258
-0.013007968,-0.007472095
-0.0006800445,-0.0015177426
0.002821121,0.0049128
0.008298249,0.00427035
0.005572945,0.0062135914
0.007798341,0.010873719
0.012738086,0.013180473
0.014139798,0.011550315
0.010364239,0.011895178
0.010292225,0.0136686135
0.01260542,0.014698215
0.013870505,0.015229695
0.014743877,0.0161675
0.014838834,0.01657343
0.014888762,0.017345892
0.016283149,0.020362599
0.019663276,0.02188323
0.020444607,0.020256748
0.018102435,0.020249657
0.018126778,0.023801388
0.022563327,0.023329794
0.021736197,0.024401944
0.02265506,0.15210718
0.07762984,0.009385788
-0.01633192,0.009087282
-0.004460806,0.010615793
0.0076831426,0.011397582
0.008869429,0.0044291243
0.0029381458,-0.00048551479
-0.0057163704,0.019113287
0.018900868,0.023446936
0.024431625,-0.026479796
-0.03773185,-0.038323887
-0.043851312,0.007150476
0.016524494,0.020527938
0.026565121,0.015112551
0.014818778,0.015213935
0.015462267,0.011312219
0.009355145,0.008100099
0.008311951,0.008681877
0.00834598,0.005385839
0.0033240032,-0.005491557
-0.008817424,-0.01066793
-0.014849642,-0.019045392
-0.022045849,-0.02263061
-0.024163233,-0.012262236
-0.011272144,-0.013349884
-0.013993663,-0.010557485
-0.010076746,-0.016788017
-0.018928112,-0.046081226
-0.051678143,-0.052152984
-0.052856807,-0.09003036
-0.08722372,-0.035854816
-0.02559399,-0.074057356
-0.071726404,-0.07155361
-0.06621913,-0.031912386
-0.019913634,-0.017505586
-0.00820188,-0.03511886
-0.03495618,-0.035793617
-0.036447257,-0.032377414
-0.030836666,-0.028589427
-0.025365742,-0.0136215985
-0.008454826,-0.00881885
-0.0064921957,-0.0032511237
-0.0013140927,-0.004686262
-0.003667141,-0.021917112
-0.026355611,-0.02809275
-0.031177465,-0.04865142
-0.051894896,-0.052440062
-0.05185015,-0.02347189
-0.015413069,-0.009343763
-0.0046818727,-0.008027081
-0.00726945,-5.9097015e-06
0.005060884,0.022916246
0.028967923,0.026355429
0.028194938,0.04544022
0.046755914,0.04068488
0.039540596,-0.031042742
-0.04840672,-0.055754486
-0.065166764,-0.07455049
-0.076286964,-0.080278434
-0.07716289,-0.022957746
-0.009644337,-0.0075554876
-0.0011297106,-0.009764271
-0.01015156,-0.039677605
-0.045524776,-0.014771627
-0.0118984785,-0.0063441303
-0.0019914983,-0.026972272
-0.031540878,0.00086938275
0.003443952,0.011092509
0.014153791,0.022890244
0.025845341,0.026203616
0.02720897,0.030755006
0.030677764,0.034012694
0.033548504,0.034560986
0.03319061,0.037367303
0.035951436,0.035531096
0.032669082,0.020845223
0.015178379,0.013197151
0.008127907,0.011619261
0.007287484,0.0073978957
0.0039957087,-9.376726e-05
-0.0041245,-0.0042029796
-0.006873287,-0.008396897
-0.011307863,-0.01044625
-0.0133944135,-0.0064083487
-0.008014177,-0.0058915783
-0.007368679,-0.0053344904
-0.006306388,-0.005681981
-0.007179422,-0.010441129
-0.011747271,-0.011398895
-0.011586866,-0.012677229
-0.013955273,-0.08496049
-0.08623412,-0.016958479
-0.00792992,-0.013806507
-0.008890967,0.008870725
0.012756823,0.018702103
0.022410199,0.022206426
0.021639487,0.025127131
0.025546825,0.02299885
0.022772014,0.022784
0.02224349,0.018536894
0.015869446,0.01750204
0.015827158,0.0219812
0.022109544,0.017762724
0.015575068,0.030525578
0.031732734,0.025464904
0.02281365,-0.028802965
-0.042327564,-0.04438619
-0.051932227,-0.05914153
-0.061958827,-0.05779005
-0.056097597,0.008243114
0.023454465,0.03476323
0.044408128,0.033506036
0.03464453,0.03941272
0.040179968,0.043452457
0.04405445,0.039966524
0.038059812,0.048580766
0.04622548,0.041226864
0.037569027,-0.011236049
-0.026631793,-0.034752198
-0.04561245,-0.040510215
-0.043680746,-0.04895544
-0.049950045,-0.050236925
-0.049669724,-0.050196346
-0.05028132,-0.05817602
-0.057028115,-0.056020685
-0.052401513,-0.02993881
-0.022527413,-0.018890033
-0.012360385,-0.010065666
-0.0062331157,-0.004652117
-0.0020866902,-0.0154863065
-0.017574642,-0.014436087
-0.0130441645,-0.013589424
-0.011923279,-0.008257954
-0.0062879617,0.017602373
0.025173496,0.030237447
0.035654105,0.030491827
0.032251187,0.0347455
0.036317725,0.043337286
0.043789003,0.043789703
0.042868663,0.04942756
0.047558796,0.04565008
0.041586522,0.0136261955
0.0034737543,-0.0008651803
-0.009039658,-0.0036695306
-0.007842951,-0.009189848
-0.012965371,-0.013068845
-0.01760836,-0.014511731
-0.018664042,-0.020170337
-0.023679797,-0.020131858
-0.021281011,-0.003251649
0.0010322045,0.003584956
0.006365727,0.0008253883
0.0015902899,0.001762667
0.0018551016,0.0072990065
0.007550909,0.006385104
0.0059215412,0.008615556
0.008840018,0.0048702504
0.0031742281,-0.020178216
-0.028033817,-0.032750383
-0.038493343,-0.029894816
-0.029706184,-0.034192875
-0.032874107,-0.05084234
-0.0525217,-0.053286858
-0.054149885,-0.061429113
-0.061253,-0.05719028
-0.053561285,-0.012110816
0.00011320546,0.007831799
0.016976837,0.010129885
0.012873875,0.016660498
0.01782668,0.021554125
0.023182133,0.021704888
0.02321212,0.029099237
0.030858072,0.02643554
0.025365334,-0.004427548
-0.012686297,-0.017682351
-0.024432678,-0.019443706
-0.021821156,-0.023606367
-0.02424628,-0.025246376
-0.026158368,-0.024922919
-0.02612947,-0.02918355
-0.031022381,-0.1493723
-0.114364035,-0.032018106
-0.014400622,-0.026225021
-0.015094605,0.01621228
0.026298957,0.034991078
0.041333307,0.03950005
0.040569484,0.045735836
0.046812113,0.0453957
0.044539616,0.04452461
0.041538652,0.049915045
0.047679152,0.047414977
0.042936813,0.027641775
0.019866168,0.019075334
0.013968249,0.010482628
0.0053667743,0.0056576855
0.0017631196,0.015658608
0.01467262,0.014014791
0.01078883,0.013965018
0.011884048,0.008090119
0.0056411815,-0.02092599
-0.030252667,-0.03484189
-0.040975496,-0.03749771
-0.040248968,-0.04258452
-0.043977093,-0.04720446
-0.04610632,-0.04757835
-0.04516307,-0.052534748
-0.050349206,-0.049894296
-0.04610781,-0.026517881
-0.020411305,-0.015454395
-0.011337834,-0.010649544
-0.008325204,-0.004877999
-0.0019497771,-0.004306071
-0.003786338,-0.001648938
-5.7378682e-05,0.006297772
0.007497604,0.01010165
0.010388839,0.006824523
0.0054301303,0.010391488
0.011649319,0.0068029854
0.005356616,0.011657214
0.011423473,0.04236691
0.047428712,0.053117972
0.053780288,0.059795935
0.05726506,0.06056879
0.056277774,0.037570335
0.029661352,0.027990185
0.021692732,0.02612784
0.022705082,0.021983169
0.018272353,0.01952132
0.015334207,0.016664438
0.013980111,0.012289815
0.009761932,0.009696376
0.0064766565,0.0087741995
0.006530091,0.005907469
0.0037438958,0.010077091
0.009851851,0.0078122313
0.006192831,-0.009441207
-0.014837234,-0.012555357
-0.016060028,-0.025202643
-0.029759651,-0.023737038
-0.024269043,0.020540547
0.029221583,0.033209894
0.038698643,0.042148516
0.045087103,0.040604506
0.04004692,-0.0028017238
-0.015097529,-0.02004203
-0.028533071,-0.0265297
-0.02981521,-0.03262168
-0.035316642,-0.022612225
-0.020742454,-0.021096846
-0.019889943,-0.028492378
-0.029654892,-0.031300012
-0.031705685,-0.027719257
-0.026913453,-0.030798212
-0.031715747,-0.030074865
-0.030513851,-0.03529129
-0.03556639,-0.062196586
-0.06392367,-0.07523483
-0.07294474,-0.075255975
-0.06834711,-0.07786452
-0.07042997,-0.08973934
-0.0822337,-0.092090614
-0.083771735,-0.07379037
-0.06310637,-0.05602423
-0.04603769,-0.081976354
-0.077086195,-0.07600703
-0.06820074,0.045853768
0.0639515,0.08655651
0.086361535,0.023437088
0.013635493,0.008745701
0.00030415057,0.032679334
0.033829328,0.102902345
0.09538014,0.004609961
-0.0142866485,0.004991728
-0.006015741,0.0057196715
0.0026717805,0.005477899
0.0037642866,0.008730861
0.009707484,0.00853873
0.0068854033,0.0005953039
-0.0037929825,-0.00035930984
-0.0034615225,-0.006142675
-0.008907708,-0.0052211555
-0.006706143,0.017353904
0.02111093,0.02397789
0.025862334,0.025695512
0.02492706,0.025324646
0.024679989,0.005531612
-0.0018990649,-0.0056110644
-0.011479136,0.0094384495
0.010613144,0.010407115
0.008529019,-0.04096907
-0.053021464,-0.052888677
-0.05826632,-0.009322488
-0.0015318961,0.0067311497
0.011664995,0.010156281
0.010992766,0.014730259
0.015611676,0.027941724
0.0298095,0.0307378
0.031635903,0.010846403
0.005670712,0.004527225
-0.00020944508,0.0021805484
0.0001954551,0.00082184246
0.001053827,0.0094555225
0.01045502,0.010864657
0.010909167,0.011205451
0.011265844,0.009681141
0.009715032,-0.0018739006
-0.00474693,-0.007608281
-0.011220645,-0.0059246724
-0.0064279637,-0.0073994715
-0.007614658,-0.0164618
-0.019412803,-0.018225912
-0.021667732,-0.015667537
-0.017308738,-0.012837185
-0.011567942,-0.0014687577
0.0022785394,0.002215744
0.0029951937,0.008869674
0.010824786,0.009465371
0.0113899065,-0.008677806
-0.013943236,-0.013670059
-0.019384777,-0.016677834
-0.019866196,-0.01585494
-0.015497998,0.000560765
0.0034714614,0.006839757
0.007751488,0.011989996
0.012574935,0.01440772
0.014972248,0.005099416
0.0016965738,0.0043592583
0.0023389894,0.0033015532
0.0016212915,0.005491032
0.005387905,0.022858461
0.02795754,0.030394645
0.033589046,0.028057685
0.027249726,0.029184995
0.029185085,0.034656063
0.03599903,0.032889325
0.03224078,0.0358753
0.03445788,0.030510474
0.02714888,0.00032555888
-0.010071979,-0.014085313
-0.020949606,-0.020015895
-0.024701534,-0.026662866
-0.031298425,-0.027711116
-0.029814426,-0.030149326
-0.031500373,-0.03512963
-0.037761558,-0.037277214
-0.03918344,-0.03397146
-0.032573637,-0.033488177
-0.03165705,-0.034073763
-0.03368553,-0.034375288
-0.03365288,-0.03585928
-0.03486558,-0.03618628
-0.034121778,-0.036397062
-0.03443132,-0.03585232
-0.03438372,-0.033942435
-0.032618355,-0.032893267
-0.030968841,-0.029494662
-0.027397797,-0.027965363
-0.027151572,-0.03180168
-0.031858232,-0.030564975
-0.02811816,-0.030674107
-0.029655576,-0.06776103
-0.06756156,0.004056419
0.018283088,0.0033410825
0.009176701,1.313267e-07
0.00093104545,-0.0017613537
-0.0027899698,-0.0028004104
-0.005406002,-0.0038327696
-0.0024993038,-0.004338903
-0.0037570163,-0.0051874043
-0.0066991006,-0.005289314
-0.0070601352,-0.006178527
-0.006641195,-0.008320728
-0.008948654,-0.008895939
-0.009969572,-0.012747883
-0.014910823,-0.013114809
-0.0150125595,-0.0051996177
-0.0039776852,-0.0045316904
-0.0047021434,0.00057967607
0.00087953947,-0.0006867073
-0.0012219347,-0.023579447
-0.030915517,-0.030929932
-0.03526544,-0.031383928
-0.033538315,-0.030567339
-0.030706923,-0.017308727
-0.01371845,-0.008253226
-0.0058451914,-0.011445647
-0.012821241,-0.005344734
-0.0052192993,0.022613276
0.029362641,0.033321653
0.037333235,0.04089973
0.042287797,0.042812504
0.041377876,0.022729237
0.017104378,0.014963758
0.010781415,0.014421116
0.012318951,0.011668639
0.008529764,0.010175587
0.0070150173,0.008521658
0.0059521184,0.0056360164
0.0027192924,0.0039943014
0.0017610842,0.00513448
0.004178903,0.004314476
0.003153577,0.0034617716
0.0011259046,0.001418197
-0.0014186191,-0.0019281385
-0.004022933,-0.0036131914
-0.0049289786,-0.01299609
-0.016611613,-0.01618063
-0.019543072,-0.0017641116
-0.0010002735,-0.0027847826
-0.0029516926,-0.0034183026
-0.0038903498,-0.00995719
-0.013278515,-0.051606927
-0.05929834,-0.075361036
-0.07659116,-0.05251886
-0.048377708,-0.05173786
-0.048551533,-0.13878421
-0.11420604,-0.15842085
-0.11953713,-0.0769799
-0.054647833,-0.045151036
-0.02708451,-0.034258276
-0.02437948,-0.009027397
-0.0007686602,-0.019683113
-0.018654468,-0.05151513
-0.053002536,0.17253911
0.05977214,-0.10603672
-0.09762473,0.06026346
0.067038566,0.049117368
0.053888373,-0.0041842
-0.018824516,-0.027909681
-0.035300832,-0.019934736
-0.024627618,-0.018825026
-0.019393375,-0.0428062
-0.04786644,-0.012732517
-0.0114723155,-0.030674502
-0.03394208,-0.023071868
-0.023010869,0.015786126
0.02553253,0.036110245
0.04008563,0.03509141
0.03699251,0.043540183
0.040896427,0.06668704
0.06644723,0.07264257
0.067482404,0.08370566
0.07548908,0.08078194
0.07174436,0.035676867
0.02123824,0.017103989
0.006296063,0.010839311
0.003834076,0.0042032422
-0.002532909,0.0097711
0.0070886505,0.009623621
0.0066140722,0.005276969
-0.00028152994,-0.20871975
-0.08838843,0.004797233
0.033622548,0.0030081694
0.01771943,-0.014681011
-0.016886745,-0.022555754
-0.025105838,-0.01877394
-0.02310676,-0.019911885
-0.016860288,-0.029134301
-0.027835717,-0.02797981
-0.02999654,-0.031815074
-0.033165656,-0.026019495
-0.02166822,0.012743286
0.021260211,0.031430285
0.038756043,0.030738063
0.032727767,0.03583262
0.035244558,0.054701246
0.054136768,0.05924712
0.056271683,0.045706682
0.04032427,0.039163064
0.03410252,0.029274296
0.024451287,0.022761542
0.017578961,0.018732835
0.012554265,0.014836634
0.009761645,0.012823264
0.012067116,0.01172209
0.008923701,0.006356475
0.0011195512,0.00480091
0.0025501223,0.017753005
0.01995123,0.021727083
0.02232319,0.009969667
0.0063973265,0.0073130582
0.0074178055,0.017511101
0.018885368,0.017298222
0.018083906,0.018395325
0.01891357,0.014197992
0.011291827,-0.010793216
-0.019175224,-0.022476563
-0.0257197,-0.023562241
-0.025160678,-0.02748589
-0.030084178,-0.032490883
-0.0317799,-0.032596864
-0.03073674,-0.03735023
-0.037115175,-0.034621656
-0.033235647,-0.010324642
-0.0030249741,0.0007190137
0.0059991893,0.003985109
0.0072735767,0.008479371
0.010931649,0.0095752925
0.009304174,0.010830906
0.012931218,0.014692306
0.01958937,0.015733989
0.0149289565,0.008676361
0.007726352,0.006141099
0.006197811,0.0103798
0.011768073,0.010133824
0.009166744,0.005981931
0.006416001,0.0084410235
0.0075248634,-0.0070468592
-0.013607325,-0.009604578
-0.011362693,0.048766986
0.0583554,0.06543037
0.061591856,0.010752899
-0.00021649746,-0.0030641144
-0.010930224,0.027148774
0.02804263,0.034304764
0.04058333,0.020938465
0.017617313,0.018319549
0.011570076,0.026028164
0.026299838,0.022206163
0.020566873,0.03254118
0.033870656,0.026334023
0.023732165,-0.02778282
-0.041976262,-0.045204617
-0.054329857,-0.05916189
-0.061289173,-0.0596608
-0.05508995,-0.0066841347
0.004909055,0.014050906
0.022400314,0.01843643
0.022582082,0.024164638
0.027762273,0.018934026
0.017719964,0.015591631
0.016951732,0.020817777
0.02360163,0.017662652
0.014686868,-0.0062892353
-0.012589649,-0.017156256
-0.022073442,-0.018383374
-0.01856786,-0.022048833
-0.021514608,-0.025673974
-0.027646663,-0.025887512
-0.027100438,-0.030091543
-0.032035653,-0.26843163
-0.0504691,-0.008812284
0.026679844,-0.002759568
0.018849773,-0.021088835
-0.02198844,-0.022890111
-0.020340266,0.029586986
0.03780836,0.04441889
0.050860785,0.008934155
0.0065237447,-0.00012699292
-0.005261059,0.005273555
0.0042886804,0.0049365703
0.0037384133,0.008145144
0.008553134,0.008677937
0.0098467395,0.0025758417
0.0012694742,-1.0243482e-05
-0.002894597,0.0046125874
0.0019730623,0.00034276268
-0.0020216687,0.0026558198
0.0016968728,-0.005215377
-0.00870864,-0.043169186
-0.050568886,-0.060537666
-0.063538164,-0.07268342
-0.07439475,-0.07867507
-0.076858014,-0.07070997
-0.060937803,-0.07360402
-0.06599632,-0.04451069
-0.034935985,-0.044619165
-0.038651932,-0.11086127
-0.093788266,-0.13675088
-0.11605321,-0.13892053
-0.115999945,-0.14339103
-0.11284444,-0.13954355
-0.10647732,-0.135752
-0.10875256,-0.12058667
-0.09257276,-0.11145263
-0.08112036,-0.10738072
-0.08836641,-0.07710808
-0.056177787,-0.12657097
-0.09619873,-0.029043425
-0.01005925,0.048212133
0.06772976,0.09149597
0.09134351,0.13980554
0.10880379,0.14703429
0.11371942,0.018344764
-0.0125442,-0.023846958
-0.042773984,-0.026632791
-0.03407003,-0.029105542
-0.03419971,0.010128178
0.012539538,0.030667279
0.030503066,0.039073106
0.038712993,0.052521616
0.052025154,0.080920756
0.078586966,0.08555803
0.07739732,0.11063998
0.09709879,0.10486817
0.086648025,0.013190059
-0.014672454,-0.018726662
-0.037228107,-0.035857048
-0.04612934,-0.041631218
-0.045443784,0.014151765
0.020878308,0.033804543
0.03546366,0.029729344
0.028718652,0.032651626
0.030784188,0.031998143
0.029890431,0.027684981
0.025693491,0.03776772
0.038396444,0.033076335
0.030410888,-0.011022906
-0.02348705,-0.026109718
-0.033162188,-0.03448744
-0.03768834,-0.035548165
-0.03639167,-0.0036615196
0.0027146847,0.00990571
0.012955823,0.012328951
0.014803209,0.017973896
0.020006806,0.022904558
0.026749957,0.027361786
0.029892856,0.029858438
0.031509575,0.03283049
0.032734994,0.03765202
0.037840933,0.039390262
0.03963004,0.042281024
0.04277327,0.041956514
0.03961504,0.03351733
0.03110146,0.030117678
0.02739246,0.026308414
0.024628231,0.024291893
0.02215488,0.02946065
0.028905863,0.028654171
0.02765524,0.028497498
0.026539043,0.4565838
0.06947864,0.1446335
0.09295885,0.14330329
0.10604541,0.031117205
0.0031102698,-0.019126026
-0.048490766,-0.047874097
-0.055864938,-0.06556932
-0.07638937,-0.098478734
-0.107951745,-0.10544299
-0.10089446,-0.017911911
0.0026835967,0.012334729
0.028709583,-0.019197468
-0.02230689,-0.021067955
-0.022934228,-0.0034885623
-0.00028800493,0.003680168
0.01356627,0.0035819355
0.0060150456,0.005989154
0.012243895,0.011366194
0.015345923,0.013939935
0.01644186,0.012111079
0.01286076,0.012698503
0.013444912,0.012975077
0.016970232,0.014049986
0.015819572,0.018127812
0.018651405,0.01915715
0.021849873,0.02233565
0.025484128,0.022321993
0.02190559,0.012788725
0.009805084,0.01019476
0.008183376,0.008731124
0.0066447025,0.008256509
0.007861064,0.019811945
0.0244086,0.025410403
0.0273554,0.0105652325
0.008631014,0.0040836036
0.0035051797,0.044905588
0.052918814,0.05227814
0.055699043,-0.017657531
-0.031148413,-0.038241416
-0.048123784,-0.0015675154
0.007844567,0.007863843
0.015672684,-0.0034970986
-0.0068451217,-0.003369449
-0.004151611,0.010228511
0.012809075,0.016049305
0.017525505,0.014632158
0.013064333,0.016166974
0.015951935,0.021345053
0.02533386,0.021869572
0.022669017,0.024293337
0.02477378,0.022768373
0.025347933,0.0070803477
0.005534373,-0.00024229776
-0.0002546781,0.0025476066
0.002252385,0.0006545323
0.0018084844,-0.008951096
-0.011598542,-0.009432672
-0.009411,-0.014265887
-0.010501116,-0.010967224
-0.007639558,0.020524262
0.027247312,0.03444489
0.03892813,0.032019418
0.032475542,0.03560109
0.036736194,0.044453956
0.046342872,0.042948034
0.04451131,0.053268604
0.05085494,0.04732042
0.043642767,-0.002100045
-0.014665517,-0.020484207
-0.03136552,-0.036877457
-0.044152945,-0.042545386
-0.04673703,-0.0053979214
-0.0013481943,0.0030226153
0.0070551443,0.005447563
0.011041,0.002402622
0.005944826,-0.033646163
-0.041419823,-0.0498218
-0.05107269,-0.046493195
-0.04505897,-0.05071246
-0.0472605,-0.06430201
-0.061346635,-0.06426354
-0.059190776,-0.07286504
-0.06532592,-0.06631801
-0.054341223,-0.012378198
0.004005363,0.011831616
0.019949015,0.017676705
0.020128375,0.026323648
0.032322533,0.02780567
0.032674562,0.028083427
0.030947845,0.035928488
0.037919085,0.051532466
0.04916426,-0.0060041253
-0.018847134,0.016051143
0.015006783,0.005004204
0.0025248572,0.002238201
-0.0009670697,-0.039398927
-0.05075692,-0.053446025
-0.05887042,-0.029436879
-0.025030533,-0.022798577
-0.017674962,-0.03344615
-0.034847338,-0.032676578
-0.032391835,-0.01751189
-0.011908432,-0.013314032
-0.008782815,-0.00091061933
0.0031802119,0.001088567
0.00085960055,-0.028992863
-0.036124952,-0.033172205
-0.035092328,-0.038795087
-0.038018387,-0.032156393
-0.02994105,0.023299458
0.034514688,0.04838233
0.05414136,0.0486199
0.047719046,0.05811771
0.056613322,0.06621978
0.06214941,0.058438804
0.05112498,0.10830368
0.09670808,0.05170739
0.038143855,0.02141203
0.009016153,-0.0042687743
-0.016325977,-0.008089199
-0.0129833575,-0.015682114
-0.021124566,-0.012364145
-0.014789458,-0.009349673
-0.009462145,-0.021657085
-0.023805395,-0.021309333
-0.01941178,0.022718731
0.033451766,0.037976924
0.044344157,0.013731388
0.010984952,0.010328319
0.0071483334,0.024954041
0.026483715,0.029134434
0.029625604,0.029382378
0.029937655,0.02929544
0.027431736,0.025056608
0.021009017,0.024531564
0.0228569,0.017318314
0.01631237,0.015295489
0.015283413,0.0359583
0.03851731,0.04001078
0.039670024,0.023224339
0.017661104,0.016774228
0.012795007,0.013081846
0.010219302,0.008869937
0.006036411,0.009206921
0.007420504,0.0071172505
0.0055129062,-0.0021555964
-0.0055272765,-0.0027438086
-0.004078189,-0.007568226
-0.008258876,-0.00443963
-0.0032871556,0.025441002
0.032685675,0.038505383
0.043387547,0.03755904
0.03862023,0.040922448
0.041770913,0.047131576
0.04692194,0.04611931
0.04396591,0.051462337
0.04719,0.04682926
0.0427713,0.013175613
0.0035466887,-0.0018707488
-0.01174544,-0.006387993
-0.011423085,-0.0120942695
-0.015048437,-0.011890976
-0.0138089005,-0.012377016
-0.015222387,-0.017244114
-0.02096202,-0.0171317
-0.018672774,-0.00626297
-0.0030851378,-0.0021449588
0.0008449009,0.0012556146
0.0027765667,0.0029966126
0.0037003641,-0.0029213624
-0.0037992396,-0.003033384
-0.0027268173,-0.003345679
-0.0022511096,-0.0012720304
0.0017156951,0.011148323
0.014619005,0.016986977
0.019350989,0.016876532
0.018196903,0.018680565
0.020392707,0.022357056
0.02348367,0.022365592
0.022125907,0.024892056
0.024636636,0.09466751
0.08898872,0.013866786
-0.0009105398,0.015645606
0.0069665653,0.026713295
0.026683586,0.032864638
0.032896593,0.023945453
0.021083418,0.026633186
0.023100983,0.04358405
0.043183893,0.040580343
0.041080553,0.081667475
0.077274226,0.0892466
0.08148316,-0.057673037
-0.077868156,-0.100230634
-0.09153538,0.03880113
0.05729792,0.07293609
0.0775419,0.0010219844
-0.0106340265,-0.013454946
-0.025502456,-0.002917554
-0.0037218467,0.0015147221
0.003881648,0.026355298
0.033251658,0.034394987
0.037483305,0.036869183
0.038762894,0.036124166
0.03633794,0.014660262
0.010005079,0.0013091959
-0.0020665606,0.0131266285
0.014240539,0.0062392
0.0039624386,-0.039679572
-0.050823845,-0.050378628
-0.05621062,-0.0771765
-0.077801995,-0.07598445
-0.068543404,0.022337489
0.04217408,0.054159787
0.059647884,0.051482297
0.051718086,0.050240077
0.04967288,0.005685527
-0.002268591,-0.011331786
-0.016319003,-0.01503428
-0.017142162,-0.019318026
-0.021366704,-0.009991466
-0.008623825,-0.005939644
-0.004368343,-0.011735222
-0.012376277,-0.009983324
-0.008240179,0.006071233
0.008366211,0.01058874
0.010893564,0.018848008
0.0211069,0.0191343
0.01968568,-0.005965121
-0.011121259,-0.012561136
-0.0152012035,-0.017813284
-0.021713842,-0.016622808
-0.017846582,0.011048909
0.01712339,0.021675603
0.026636045,0.02449755
0.026031643,0.02693366
0.027554806,0.020367326
0.018424068,0.017776119
0.0171889,0.018171676
0.018195877,0.016652882
0.014494792,0.012534477
0.010593825,0.009493082
0.009110976,0.008768158
0.0071797743,0.00644906
0.0037306957,0.0005050825
-0.0029803026,-0.0024724877
-0.003837716,-0.0050081434
-0.006114364,-0.0063367756
-0.0065744002,-0.003922203
-0.0030500612,-0.0037111612
-0.0042418283,-0.0028852476
-0.003746885,-0.003059124
-0.0025134375,-0.0070859944
-0.007653372,-0.0076957443
-0.006746291,-0.008826336
-0.007374851,-0.007944477
-0.008857748,0.0001874032
0.00093849225,0.0037949476
0.0052373745,0.0042150617
0.0038734348,0.005395951
0.0046627237,0.006314319
0.0061978353,0.0063270577
0.0064200205,0.0076612057
0.007818528,0.0071267057
0.0066403863,0.0013626458
-0.00046953553,-0.0011429363
-0.0038244065,-0.0016140051
-0.0019193491,-0.0024656588
-0.0017021156,-0.0026849743
-0.00389622,-0.002710583
-0.0035597212,-0.0035329508
-0.0032368838,-0.1595383
-0.116473965,-0.023924835
-0.0039690747,-0.03421638
-0.02540497,0.0070624873
0.015730845,0.018438006
0.02317005,0.014252098
0.013415416,0.013051247
0.016123494,0.0032097558
0.002515253,-0.0026566077
-0.0040790727,-0.0048039304
-0.006386899,-0.008667956
-0.010376524,-0.01797823
-0.01962223,-0.024559142
-0.02562408,-0.019991338
-0.018950323,-0.019871173
-0.020223586,-0.046334423
-0.050251376,-0.054098982
-0.055365667,-0.017835347
-0.010121918,-0.008691595
-0.004643409,-0.033857334
-0.038525924,-0.039074156
-0.03973484,-0.03557128
-0.034506243,-0.032899044
-0.031479564,-0.020608835
-0.01677459,-0.014129965
-0.010711419,-0.011623989
-0.009166757,-0.0081972815
-0.0071345647,-0.0049494407
-0.004414004,-0.0026610729
-0.0018075847,-0.00014051957
0.0015503383,0.0010246108
0.0029927676,-0.0005021933
-0.0020332388,-0.00078572764
-0.00082900864,-0.0020375338
-0.0030027642,-0.0027912175
-0.004724763,2.626534e-05
-0.000775296,-0.00037506904
-0.00047630956,-0.0037007863
-0.0062686647,-0.005885012
-0.00785376,-0.0113334935
-0.0149098085,-0.018082373
-0.02103982,-0.00696281
-0.005198808,-0.010761698
-0.011266234,-0.05286254
-0.060440384,-0.062314913
-0.06477362,-0.07650476
-0.074065275,-0.07124986
-0.06549466,0.00031111293
0.015727116,0.029150456
0.04037934,0.042692866
0.047202747,0.05136975
0.050939936,0.031012405
0.026798995,0.027995043
0.026380848,0.020910231
0.019388065,0.021326799
0.019141853,0.05039058
0.051473845,0.054078493
0.051096573,0.061930124
0.056777112,0.054848727
0.048646074,-0.004914114
-0.022985667,-0.031083321
-0.044074837,-0.03570274
-0.04085485,-0.044249743
-0.048738007,-0.046790913
-0.048524596,-0.04606875
-0.046563093,-0.053984202
-0.053897846,-0.050194245
-0.048720364,-0.015923362
-0.006947345,-2.0355637e-05
0.0075065424,0.006191791
0.0104200505,0.013702365
0.015863039,0.014447118
0.015646022,0.017498625
0.018935908,0.025556833
0.026668983,0.029438062
0.029183365,0.025155103
0.022358755,0.027128156
0.024252461,0.027713347
0.026178598,0.03164028
0.03009492,0.048800737
0.047867753,0.056765966
0.05183928,0.058319952
0.052424543,0.060577855
0.053059597,0.06205751
0.055356763,0.061531287
0.05579671,0.060563143
0.05501026,0.05763535
0.052016817,0.04948718
0.044267084,0.042549063
0.03802043,0.040278554
0.037141975,0.10810932
0.087650456,0.0010735957
-0.021976229,-0.0009016891
-0.012280835,-0.0043930095
-0.009258852,-0.008284351
-0.011350401,-0.006907259
-0.006750115,-0.010095477
-0.014986239,-0.025436142
-0.03296892,-0.031075837
-0.03507235,-0.035753693
-0.037235234,-0.03679104
-0.037001118,-0.022818802
-0.021106632,-0.017340902
-0.015595923,-0.019320259
-0.019555325,-0.018172726
-0.016086722,-0.014257877
-0.012897228,-0.0144614335
-0.01296443,-0.010350776
-0.008130749,-0.012389755
-0.012019931,-0.030126212
-0.033911787,-0.03626836
-0.039027218,-0.045501944
-0.045946408,-0.047094673
-0.04636979,-0.027310174
-0.021194445,-0.024906764
-0.019117955,-0.010330027
-0.0028304802,-0.01051152
-0.0073906165,-0.06765636
-0.07535763,-0.07180103
-0.070815034,-0.08629609
-0.08166853,-0.0795191
-0.07048778,-0.02232567
-0.006207665,0.002223361
0.012739347,0.041037623
0.05108098,0.05549144
0.058387097,0.009549289
-0.0012785768,-0.0023020257
-0.011611211,0.003997322
0.0038354718,0.0056553218
0.0047333436,0.015027189
0.016235163,0.02057469
0.02114091,0.021599695
0.020029394,0.024819694
0.023892736,0.03378642
0.03360841,0.038506825
0.037133653,0.036767274
0.034700423,0.037686296
0.036116265,0.043777097
0.042857032,0.04281185
0.040434588,0.04559571
0.043326527,0.041118912
0.039039988,0.0154114505
0.006992752,0.0034789755
-0.0036821403,-0.0032345764
-0.007410519,-0.008910516
-0.012257169,-0.005578758
-0.007090136,-0.007281934
-0.009508997,-0.01016403
-0.012427479,-0.013157097
-0.01511915,-0.020713635
-0.021950759,-0.024875116
-0.02580734,-0.02541907
-0.027084045,-0.02694732
-0.02757566,-0.029744314
-0.03048436,-0.029632162
-0.029428836,-0.031714085
-0.03170831,-0.029784238
-0.028027179,-0.017405909
-0.0131802205,-0.011749668
-0.0077483733,-0.0062889727
-0.0032751372,-0.0029960873
-0.0007050611,-0.008473593
-0.00858804,-0.0072649927
-0.0055029867,-0.0066678505
-0.0045366543,-0.003099704
-0.0015287694,0.013343317
0.016981136,0.021468762
0.024355225,0.021754267
0.021521525,0.024588166
0.025273362,0.030184127
0.03112924,0.030568259
0.030382855,0.034481663
0.03392552,0.032158624
0.029995482,0.011408744
0.005001449,0.002244242
-0.0029762257,-0.00020578894
-0.0035887135,-0.003632759
-0.007470948,-0.003898827
-0.006783686,-0.0043490147
-0.006652651,-0.0073412936
-0.009385746,0.096605755
0.07628167,0.019683639
0.010515959,0.02098535
0.014513841,0.011713816
0.0074289637,0.0090803215
0.0048262984,0.015283144
0.01605854,0.017622598
0.017367875,0.012574137
0.010196757,0.016311433
0.016333006,0.017648732
0.017018689,0.02551008
0.027758442,0.05719238
0.059293352,0.075007506
0.06987919,0.07530509
0.06736733,0.08354899
0.07505518,0.10810761
0.0956045,0.115694486
0.09958408,0.120209895
0.1006892,0.117726505
0.09503894,0.089451075
0.069566846,0.07332259
0.059067115,0.07526162
0.06491955,0.06559401
0.05622149,0.033312462
0.021500202,0.020304551
0.010105358,0.0067107943
-0.0010040196,0.0027675787
-0.0014215184,0.0319137
0.036816563,0.040191486
0.04041139,0.040855866
0.03913915,0.04020698
0.03918321,0.025756579
0.02354517,0.019587507
0.020227501,0.016530486
0.017730884,0.012053427
0.012023836,0.017609203
0.020309513,0.018908417
0.021040527,-0.0079094125
-0.015229607,-0.023719177
-0.030748637,0.035879374
0.050615128,0.04422584
0.052818924,-0.080841035
-0.098118484,-0.11345536
-0.109368056,-0.05069355
-0.039064012,-0.03024559
-0.017519051,0.006280568
0.01881654,0.022920711
0.030622883,0.0033079882
0.0031852417,-0.0058064787
-0.006572151,0.0134868575
0.020394167,0.009038035
0.012893852,-0.05214786
-0.061446518,-0.07454169
-0.07727854,-0.07631565
-0.07280611,-0.07540674
-0.067494005,-0.061150964
-0.05243771,-0.0494642
-0.04372418,-0.016134536
-0.0062150196,0.0017030446
0.010065442,-0.0009913852
0.004048366,0.004370684
0.009609536,0.021169994
0.02755312,0.029162537
0.03233016,0.021134274
0.019862814,0.024514623
0.025652654,0.028013824
0.030022034,0.034355458
0.03587828,0.062351156
0.061729874,0.0774947
0.072310574,0.064233854
0.056074433,0.06775932
0.06053085,0.10400641
0.095447496,0.10379458
0.09328562,0.12657858
0.10290709,0.11244244
0.09509987,-0.010871749
-0.045498464,-0.057385694
-0.073800504,-0.08283458
-0.08452801,-0.09398093
-0.09046003,-0.029673135
-0.0141521385,-0.007552992
0.001653807,-0.0074516083
-0.0051131756,-0.00247866
0.0019405809,-0.00801106
-0.0059769666,-0.007610382
-0.00481037,-0.006357263
-0.004197424,-0.0043283966
-0.0026203068,0.0033145545
0.0068634343,0.006153181
0.008746963,0.009046833
0.010527326,-0.10074202
-0.10884187,-0.02859954
-0.019506386,-0.025111109
-0.018699702,0.0006448141
0.00693452,0.011493056
0.017096188,0.018602427
0.021007927,0.0226989
0.026732208,0.012947499
0.012365185,0.012040294
0.01085514,0.010881599
0.00946574,0.012210494
0.011123047,0.027649522
0.030396823,0.032998852
0.03604914,0.029195633
0.030168071,0.028125582
0.026578575,0.027011406
0.027363574,0.020465426
0.019247953,0.02782143
0.029689565,0.020726241
0.020743405,-0.02752056
-0.0420638,-0.045666493
-0.054239053,-0.05364223
-0.05687979,-0.05637422
-0.05480843,-0.030017212
-0.023722716,-0.017068006
-0.0134322895,-0.019819956
-0.019186575,-0.013019072
-0.01110224,0.0110202795
0.01874966,0.021555964
0.029032577,0.028828442
0.03398122,0.03219277
0.033816967,0.019858567
0.019619621,0.015735434
0.015872786,0.01697647
0.017562801,0.016121928
0.015857056,0.013636964
0.011836824,0.0121032
0.010670676,0.0137879895
0.012810282,0.013695011
0.013741069,0.00841791
0.0066893315,0.007967196
0.0068872133,0.009084262
0.009816808,0.010976417
0.01194112,0.021135192
0.023874855,0.02856894
0.031371478,0.019700581
0.018065087,0.022788595
0.023149312,0.054826137
0.05617052,0.060873207
0.057567045,0.070354864
0.06477032,0.06438108
0.05735582,0.007702048
-0.008873963,-0.016388258
-0.03032568,-0.027703105
-0.035937194,-0.037010226
-0.04245116,-0.026558328
-0.025041997,-0.027155602
-0.026454259,-0.028130835
-0.029408762,-0.031383928
-0.03300234,-0.047046345
-0.04985309,-0.051634636
-0.050464254,-0.058389686
-0.052678853,-0.05785742
-0.050301127,-0.033517066
-0.025021363,-0.02448271
-0.01753264,-0.019944848
-0.012861583,-0.017105564
-0.012946023,-0.028993914
-0.029652126,-0.032425612
-0.03212043,-0.025619738
-0.022265349,-0.02369961
-0.020636108,-0.029507402
-0.02769265,-0.026189432
-0.0239977,-0.02825717
-0.028585576,-0.02136357
-0.018321658,0.015419856
0.025131967,0.032792013
0.037806626,0.035864927
0.037438314,0.042040434
0.04198793,0.04727958
0.044813592,0.047479197
0.044916302,0.054186314
0.05233934,0.051223714
0.046651825,0.02197726
0.012427356,0.009285585
0.0027443653,0.0053176805
0.0015359003,0.0005050825
-0.0033970573,0.0016519586
-0.0011310349,0.0010332784
-0.0026018526,-0.0027623258
