Predicted,Actual
-0.023758138,-0.031210456
-0.0312671,-0.02825507
-0.029073866,-0.028206874
-0.028371003,-0.03092328
-0.031137645,-0.02795913
-0.028431581,-0.03075403
-0.030749256,-0.024984965
-0.024759505,0.0040164622
0.0024864865,0.017082985
0.014475117,0.028273346
0.02545681,0.034311686
0.030395452,0.02200379
0.01685686,0.022732746
0.016898533,0.019034507
0.013656968,0.023059858
0.017756812,0.055358555
0.05416697,0.0659126
0.06332246,0.07010056
0.06579128,0.069341436
0.064979084,0.046418533
0.038475268,0.034677602
0.02496964,0.032462567
0.022359023,0.025479075
0.016779196,0.011166827
0.005244825,0.002149566
-0.0018162099,-0.001736578
-0.0039159684,-0.00684053
-0.008484813,-0.013911651
-0.015171718,-0.017243348
-0.018597627,-0.020707741
-0.02144305,-0.021488274
-0.021657854,-0.012400408
-0.011509907,-0.0075199134
-0.006355592,-0.01239127
-0.012286878,-0.010598108
-0.011379585,0.0058029895
0.0040266574,0.009451531
0.0073244204,0.014528442
0.012221624,0.012414805
0.009731835,-0.014982867
-0.018953245,-0.026601866
-0.030883953,-0.02897927
-0.032597702,-0.032746736
-0.034266517,-0.0322331
-0.031913828,-0.031867433
-0.030603167,-0.035087463
-0.033633363,-0.034114644
-0.032471962,-0.023406122
-0.021071343,-0.01868261
-0.016612876,-0.015829248
-0.013136117,-0.013539224
-0.011402714,-0.015773416
-0.014799105,-0.015014163
-0.013771891,-0.013845053
-0.014072288,-0.124041766
-0.102395296,0.0026643302
-0.0018379353,0.0039688917
0.0006782795,0.0030691812
0.0030155533,0.004715375
0.005167704,0.0042011114
0.003949337,0.00726854
0.004454993,0.017437136
0.013818162,0.021529084
0.018266043,0.033848874
0.031834412,0.03707817
0.0325956,0.016936392
0.012699387,0.017300183
0.013025614,0.008253752
0.005471745,0.015337894
0.009191041,0.07625683
0.06655666,0.0985518
0.082407735,0.10517163
0.08436187,0.10736638
0.08443151,0.08231044
0.06969848,0.0693487
0.057860054,0.06732745
0.054538596,0.05810338
0.04385963,0.037333548
0.025342528,0.023336768
0.011865253,0.01560767
0.0057570026,0.0058670845
-0.00074253476,-0.009293295
-0.014971389,-0.020020595
-0.025686314,-0.021607202
-0.025504204,-0.027256338
-0.029208308,-0.04226925
-0.04421082,-0.045597315
-0.04540144,-0.054009177
-0.05402298,-0.051328197
-0.052166328,-0.014752651
-0.01405531,0.0007390972
0.0011777222,0.0066194516
0.007143312,0.012337064
0.011195126,0.0072303587
0.004634836,0.0072977087
0.003543735,0.010599861
0.006033196,0.012047259
0.008407734,0.0127816
0.008383584,0.01363086
0.008744549,0.01326056
0.007396358,0.013230516
0.007304259,0.016080497
0.009906744,0.016417122
0.009864184,0.012692342
0.008394808,0.008904093
0.0055113863,0.013411284
0.010205739,0.012191598
0.009014015,-0.013516941
-0.014719683,-0.021709353
-0.024025818,-0.0046313754
-0.00757985,-0.0014312497
-0.0035943647,-0.004462875
-0.0048434897,-0.0059291767
-0.0065100803,-0.013032722
-0.014452069,-0.016264394
-0.018988574,-0.014655005
-0.017951338,-0.014712841
-0.0148957055,-0.018354999
-0.017601075,-0.017336987
-0.016800083,-0.016308835
-0.016041325,-0.012665427
-0.011525664,0.002399437
0.0032551552,0.01234395
0.012440018,0.008974197
0.009981163,0.0143827265
0.013963815,0.039787564
0.04040556,0.046980742
0.04883001,0.055904616
0.057124376,0.054350432
0.054145608,0.01776024
0.014235109,0.002984806
-0.0011232056,-0.00069202733
-0.00506279,-0.0054001417
-0.009600224,-0.0017619907
-0.0050014793,-0.0011883891
-0.0047482797,-0.0046524066
-0.0071041817,-0.004844066
-0.006599412,0.0012209375
-0.0010550257,0.0034707773
0.0016470959,0.0036404042
0.00076975964,0.0041088494
0.0011828518,0.0033833976
0.0012553652,0.0029797985
0.0009622611,0.0033230581
0.002490084,0.0415284
0.036987085,0.009146328
0.0074830493,0.008718317
0.0063871806,0.005003803
0.0025957914,0.0029752918
-0.0010958251,0.0031301468
0.001771509,0.0008520148
-0.00024100611,0.00047871066
0.0001905783,0.0013339802
-0.00022825313,-0.019581445
-0.02044619,-0.021689197
-0.022310512,0.013560881
0.01065482,0.026405198
0.022850277,0.02677212
0.023088416,0.029249296
0.027009904,0.026125534
0.021618444,0.024378816
0.019351637,0.024785044
0.01770995,0.02292328
0.016273515,0.015245257
0.008816704,0.009996214
0.003465684,0.011604727
0.00650987,0.011100729
0.0075335084,-0.009212676
-0.010295633,-0.018143184
-0.020530937,0.018612005
0.013735096,0.021684315
0.017931476,-0.02467488
-0.025504364,-0.03849114
-0.039212674,-0.059525993
-0.06259677,-0.031155376
-0.03372896,-0.056932643
-0.057360895,-0.056722704
-0.056199707,-0.061102457
-0.05976498,-0.057635684
-0.05758069,-0.028909791
-0.025785683,-0.015391724
-0.009842583,-0.015005901
-0.011024163,-0.010003225
-0.008338412,-0.0019455131
-0.0022264586,-0.0004782099
-0.0003766943,0.008166999
0.006303161,0.006740882
0.0045368215,-0.023223601
-0.024427427,-0.03384837
-0.037378136,-0.038375843
-0.042635996,-0.03971621
-0.04276763,-0.024838747
-0.025179142,-0.017031534
-0.016399588,-0.016915986
-0.01527669,-0.012001691
-0.009704998,0.0025710668
0.0026086394,0.010930726
0.01045028,0.0121173635
0.01159857,0.01607624
0.013550667,0.024466446
0.019403554,0.026624525
0.020489192,0.031796325
0.025539385,0.030878214
0.023719708,0.010787639
0.0067724753,0.0025176124
-0.0014061437,0.0029412413
-0.0011239189,0.0008855646
-0.0025002537,-0.0012944216
-0.003572661,-0.00046431427
-0.0014720861,-0.004118364
-0.0047354167,-0.0018611378
-0.0023881814,0.016879933
0.014524822,0.024588753
0.02178041,0.027767722
0.025805298,0.0298582
0.02650355,0.025435133
0.02056313,0.024313468
0.019603679,0.021659903
0.016659448,0.020665178
0.014713165,0.025189519
0.01886516,0.023606043
0.018077314,0.026571821
0.021014988,0.02280911
0.018059095,-0.0009858385
-0.005179305,-0.010494454
-0.015754681,-0.016765388
-0.022424795,-0.01955553
-0.024288036,-0.0070926542
-0.010216718,-0.0036765828
-0.006104205,-0.0027708632
-0.0039843163,-0.002623144
-0.0036499004,-0.009382178
-0.010381603,-0.011041516
-0.012520096,-0.012317786
-0.014207275,-0.22647132
-0.10695178,-0.023398735
-0.025681835,-0.021138005
-0.020083286,0.0019776858
0.006037719,0.011945983
0.01859208,0.011440358
0.012512632,0.013578908
0.010768871,0.017845867
0.012497548,0.0171432
0.011393002,0.01619717
0.011202923,0.0123245455
0.0026788914,-0.0058973795
-0.009875201,-0.018960271
-0.019657593,-0.009296927
-0.008825913,-0.01607624
-0.019775692,-0.06251668
-0.06665393,-0.074457906
-0.075101376,-0.09032196
-0.089834616,-0.08644558
-0.08127226,-0.011516096
-0.0063541983,0.019886646
0.025635513,0.02473447
0.02993477,0.034221176
0.03513355,0.03364332
0.0321222,0.0320994
0.025275689,0.041446403
0.0324091,0.038238015
0.029864155,0.003805274
-0.004136573,-0.010680981
-0.017413639,-0.015463831
-0.020939324,-0.020462126
-0.022108415,-0.016165122
-0.017701674,-0.015461578
-0.016963454,-0.018935109
-0.019434605,-0.018834334
-0.019012868,-0.013974495
-0.011475988,-0.012360349
-0.008902898,-0.006974103
-0.0045850202,-0.0054110326
-0.003283467,-0.01510943
-0.0137295965,-0.014767798
-0.01507129,-0.017075224
-0.017721593,-0.012840437
-0.013710625,0.015387092
0.013425635,0.028136645
0.024910206,0.028958488
0.025684536,0.03259977
0.029488016,0.037034977
0.03281394,0.03642432
0.031944275,0.039038204
0.033133574,0.035196375
0.027964726,0.011474283
0.0037779848,-0.0012864097
-0.008401539,-0.001263
-0.0063203964,-0.0075678593
-0.0103618,-0.024835244
-0.026714513,-0.030953951
-0.03228233,-0.03909078
-0.039067306,-0.039839767
-0.038352042,-0.014300729
-0.010514434,-0.0041000866
-0.00077137345,-0.007949801
-0.005116417,-0.006260669
-0.003998861,0.0013178313
-0.00020890334,0.0002668962
-0.0046202736,0.005303498
0.001597782,0.00084888516
-0.005719601,-0.035474036
-0.040698588,-0.05190067
-0.057150587,-0.049922734
-0.055063512,-0.054203715
-0.057094157,-0.06480721
-0.06393676,-0.06368266
-0.061670396,-0.07168429
-0.06873634,-0.06467764
-0.06040369,-0.012374746
-0.006463261,0.011430218
0.015930409,0.019209767
0.023643073,0.028436715
0.02998392,0.028094456
0.02601308,0.029338554
0.025780797,0.03579426
0.029239582,0.03618597
0.02929976,0.023158379
0.015059958,0.017505487
0.0102674775,0.01744402
0.00983113,0.014531322
0.007991769,0.011766467
0.0067898124,0.010748456
0.0046362667,-0.0011363119
-0.0046078316,-0.026279261
-0.029660553,-0.00235099
-0.004322038,0.0017895316
-2.4791201e-05,0.028024102
0.025141165,0.040034555
0.03798069,0.040499747
0.034393527,0.04411912
0.03934153,0.04938719
0.046340127,0.049018893
0.04233996,0.053301
0.048864134,0.04977464
0.04194638,0.023707569
0.017357353,0.011625257
0.0054149907,0.008540804
0.0015094884,0.0034745329
-0.002353955,0.00018239577
-0.004765716,-0.0017214305
-0.005204365,-0.006711964
-0.012165855,-0.007714953
-0.010070854,0.0030691812
0.00016525164,0.0068927323
0.003470643,0.003311541
-0.0005171933,0.0030443943
-0.0015917596,0.006879087
0.0031758784,0.005019201
0.0016835384,0.008578359
0.005819313,0.004602958
0.0033374717,-0.021251548
-0.022669623,-0.03174813
-0.032877397,-0.03850604
-0.041336957,-0.04120492
-0.042054832,-0.029940948
-0.029760776,-0.027596217
-0.028836919,-0.01761828
-0.01733686,-0.016115924
-0.016376406,-0.039329384
-0.03976812,-0.039881077
-0.03972277,-0.05091358
-0.051571283,-0.043360494
-0.044886738,0.02639606
0.024669249,0.053224012
0.054020986,0.060951732
0.06105386,0.065660596
0.06337376,0.041914098
0.038361758,0.02930926
0.02144729,0.034465037
0.02399824,0.02664205
0.017146528,-0.009169237
-0.014386756,-0.02528729
-0.029761644,-0.031377956
-0.035387725,-0.03689239
-0.039870903,-0.030734375
-0.032029968,-0.027343968
-0.028284064,-0.034675475
-0.035161737,-0.032486603
-0.03253294,-0.00819767
-0.007524182,0.00026977548
0.001247609,0.005688069
0.005596659,0.0068712
0.0056016175,-0.010618012
-0.010886334,-0.016976327
-0.0180916,-0.017805558
-0.018756988,-0.019321308
-0.020388935,-0.01669278
-0.01730516,-0.015987359
-0.015367025,-0.016826479
-0.014531814,-0.016936516
-0.012748752,-0.015280809
-0.010566864,-0.014419406
-0.011204764,-0.017231831
-0.016104952,-0.017552307
-0.016857412,-0.012034365
-0.011359372,-0.01215229
-0.011864209,-0.010316815
-0.009220944,-0.012787483
-0.012221008,-0.029653395
-0.031718466,-0.037191086
-0.040196236,-0.039656494
-0.042358644,-0.041312452
-0.04332749,-0.042773873
-0.042258598,-0.04427936
-0.042173557,-0.029166298
-0.026369123,-0.019780613
-0.015989583,-0.058546662
-0.055754397,-0.064111926
-0.063583456,0.018242832
0.015798097,0.04301323
0.043692626,-0.0034427356
-0.000961542,-0.01400166
-0.012985121,-0.0010778501
-0.0047831917,0.06914765
0.060692117,0.0051272362
0.0023622098,0.008720445
0.0068488945,0.032712936
0.027430153,0.043814417
0.036243875,0.040892456
0.03872362,0.043541264
0.043096725,0.054123722
0.051221754,0.053347446
0.047829352,0.059547897
0.056357764,0.0536037
0.050872672,0.01054578
0.005779667,-0.008525281
-0.013517157,-0.013585919
-0.020404115,-0.020383634
-0.0263413,-0.020088822
-0.02509154,-0.019880638
-0.023756845,-0.026009612
-0.028161991,-0.024550946
-0.027482638,-0.0066058063
-0.009404192,0.00068126136
-0.0016079089,0.008648213
0.0059013586,0.012319788
0.008713672,0.0008980832
-0.00042945927,0.001694891
0.000807467,-0.0017811441
-0.0029099495,0.0018424852
-0.00064650655,0.038245026
0.035317667,0.053217
0.05161194,0.03951779
0.03754142,0.039858922
0.038061325,0.05680483
0.05487119,0.05859373
0.05398864,0.06165152
0.05262201,0.056666497
0.048103098,0.021405026
0.011844861,0.0042536897
-0.0040780525,0.00476595
-0.0028993764,-0.0022417028
-0.008652222,-0.017475568
-0.02365989,-0.021251423
-0.027544502,-0.035075944
-0.04063853,-0.030106068
-0.03284031,0.0035612867
0.0009436877,0.038550604
0.037153393,0.043878887
0.044129647,0.042662457
0.040547594,-0.02533148
-0.026903883,-0.047441926
-0.053139977,-0.060521346
-0.067724645,-0.06274377
-0.068637945,-0.013807623
-0.017529923,0.00407555
0.0023347356,0.008581865
0.008506054,0.012993414
0.013288548,0.00084901036
0.0024951813,-0.002165715
-0.0012935883,-0.0002588843
-0.0023357533,8.888195e-05
-0.0025095853,0.0026116269
0.0018036853,0.0040771775
0.0051303417,0.0022285583
0.004624941,0.0024859405
0.0030816412,0.0078029586
0.0054577976,0.008348018
0.0047800196,0.009461295
0.005788482,0.007847149
0.00480508,-0.0041572964
-0.005913238,-0.0100976145
-0.011011277,-0.009437259
-0.010801898,-0.011730539
-0.013895366,-0.01829804
-0.020881942,-0.019579692
-0.021620952,-0.023960695
-0.024654696,-0.023148114
-0.023096966,-0.004687709
-0.0052203084,0.0026083721
0.0029373574,0.00040159616
0.001127117,0.001291417
0.0027565195,0.0033905332
0.0045665405,0.0005246538
0.0022012088,0.0061943205
0.0055765756,0.0019356235
0.00048818561,-0.031224728
-0.03248353,-0.04420262
-0.046342034,-0.048679516
-0.04965002,-0.05114693
-0.050511066,-0.038676165
-0.036993723,-0.032186657
-0.030119346,-0.033165358
-0.030883584,-0.13243222
-0.10737061,0.0005798608
0.0033114343,-0.0019033254
0.0014602534,-0.017181506
-0.012250968,-0.024437027
-0.01953769,-0.02442601
-0.02436399,-0.026807921
-0.027135715,-0.03156849
-0.031302188,-0.03184953
-0.02983072,-0.035199754
-0.03347844,-0.033192523
-0.035097376,-0.01456074
-0.013747655,-0.006056616
-0.0025441227,-0.005110086
0.00032281497,-0.0019796889
-0.0004445976,0.0012399658
0.0016479783,0.0017922856
0.0015169192,0.0066073085
0.00594214,0.0059160325
0.005534535,-0.009703655
-0.009369192,-0.015132589
-0.015425336,-0.017775763
-0.018852133,-0.01857833
-0.019393343,-0.0095324
-0.008026611,-0.006204711
-0.0056963195,-0.0057606767
-0.0056620734,-0.004887756
-0.0034388965,-0.0056883194
-0.0052091386,-0.0055934284
-0.0059736725,-0.005851311
-0.0064399666,-0.005743276
-0.006634646,-0.003869995
-0.0070172506,-0.003605978
-0.006712557,-0.0036897275
-0.006410889,-0.0042707147
-0.007401554,-0.007476599
-0.010064602,-0.009562946
-0.011607007,-0.008587623
-0.01048642,-0.009685253
-0.010916041,-0.015589893
-0.01591214,-0.017264254
-0.01887393,-0.019190364
-0.01991436,-0.019334076
-0.019335272,-0.009725062
-0.009659096,-0.0053226515
-0.0049588005,-0.012695721
-0.012793467,-0.012936579
-0.014265238,0.0017137941
-0.0015444092,0.0011093969
-0.0012664892,0.0074444264
0.0054522217,0.0010069949
-0.0006518935,-0.049193904
-0.050979797,-0.07120758
-0.0732619,-0.073039055
-0.07542171,-0.07900641
-0.08011867,-0.08220516
-0.082045786,-0.07910568
-0.07683601,-0.08570736
-0.0812775,-0.078541346
-0.0729834,-0.031533435
-0.02754805,-0.008234099
-0.004603595,-0.0032908854
-0.000661412,0.007047587
0.00753583,0.019966515
0.018114278,0.025035415
0.0203464,0.035690732
0.0309464,0.03646939
0.03099233,0.009618904
0.0033126862,-0.00060064165
-0.0056365225,-0.0005962601
-0.006056407,-0.0024214697
-0.0057518063,-0.0033430879
-0.0050172433,-0.0032210315
-0.0047360775,0.0024759255
-9.6958654e-05,0.0045098197
0.0023395836,0.00467181
0.004721605,0.01279174
0.0105720125,-0.007768407
-0.0073957164,-0.0061437455
-0.0074926666,0.08189332
0.07235909,0.1073302
0.085330985,0.05779655
0.055005465,0.04340243
0.036571562,0.04426196
0.031069819,0.04024249
0.02656968,0.027372008
0.016192524,0.022349052
0.01340613,0.032829735
0.02389068,0.03299398
0.023902884,0.03131624
0.024406109,-0.054714724
-0.056503296,0.00095767167
-0.00452954,-0.00141798
-0.0071364087,-0.028320918
-0.03170641,-0.039598785
-0.038931508,-0.03395641
-0.03632046,-0.034188002
-0.034275137,-0.045016453
-0.043516,-0.04190383
-0.04140862,-0.03904221
-0.038015272,-0.028381383
-0.02992346,0.018672844
0.017657153,0.04939608
0.052065067,0.033502735
0.0325005,0.046127353
0.04372253,0.13693829
0.09767486,0.16012996
0.10897093,0.15099853
0.10552563,0.13700238
0.098354,0.05726063
0.043312546,0.022082657
0.004023507,0.006906127
-0.008796196,-0.0067865746
-0.018862821,0.0039254525
-0.0025044072,0.004439215
0.0007793817,-0.00487023
-0.004815211,-0.0070745023
-0.0044138758,0.0016845006
0.00011452071,0.0040947036
0.0015993754,0.0036708242
-6.141779e-05,0.003601221
0.00055260834,0.0007647603
-0.0022642221,-0.00037280342
-0.003496371,-0.0004242548
-0.0030432013,-0.0006602301
-0.0057645054,-0.0008061968
-0.0062127723,-0.0007750255
-0.0061009834,-0.000291683
-0.004453187,9.388938e-05
-0.0036428461,0.0002582584
-0.002358637,0.0010485565
5.7844674e-05,0.0010843597
-0.00023077018,0.0022929038
0.0018187691,0.005930053
0.006124872,0.007691543
0.0074571674,0.011267727
0.0109519325,0.012685081
0.011553869,0.0082016755
0.006549909,0.008812457
0.0069621536,0.007409875
0.006782149,0.00972356
0.009762704,0.02495855
0.022668693,0.031206576
0.027731473,0.032802194
0.028470393,0.033766124
0.028396046,0.03148111
0.02398835,0.030000785
0.021503586,0.024579613
0.015713314,0.021862078
0.013752126,0.023483235
0.01523443,0.017644443
0.010379698,0.02649333
0.018859481,0.019798515
0.015531826,-0.029678809
-0.029846124,-0.04580838
-0.04658974,-0.061031602
-0.062012047,-0.06200905
-0.061259832,-0.010061311
-0.005914649,0.008729208
0.013273069,0.015652612
0.02108969,0.020080559
0.024752313,0.0011800018
0.0033433817,-0.0038001414
-0.004063332,-0.0033380804
-0.0069112713,-0.002863626
-0.007969657,0.005724373
0.0014722219,0.009238339
0.0060209692,0.0096005015
0.008776469,0.010531634
0.009083266,0.0104097035
0.007556263,0.010018873
0.006414352,0.010953385
0.007859118,0.010274001
0.008176404,0.005532338
0.0050876304,0.0033727568
0.004577582,0.0023489872
0.0034111117,0.001384305
0.0015594913,0.0018219547
0.0017244206,0.0015762149
0.0010387523,0.00093388633
0.0004181787,-0.12063483
-0.105291754,0.0033397079
0.0008791474,0.0033092876
0.0035836012,0.0013334795
0.0042138584,-0.0002394805
0.0038391044,0.0037334173
0.002859558,0.003409186
0.002953884,-0.007155247
-0.0074423547,-0.008428262
-0.00982533,-0.012616605
-0.0147738755,-0.010611628
-0.016084516,0.015332011
0.011885611,0.02599847
0.023463253,0.021556
0.021422602,0.022461468
0.018977022,0.029857323
0.025158873,0.02646629
0.023325551,0.03030987
0.024942363,0.021716364
0.017418789,-0.024648841
-0.02609563,-0.047285445
-0.051384654,-0.05534729
-0.059525397,-0.06526927
-0.06802027,-0.072117805
-0.07183185,-0.0775182
-0.074281156,-0.07701245
-0.07508311,-0.07846473
-0.07456222,-0.08054319
-0.07490294,-0.08307583
-0.075126715,-0.07957726
-0.07189316,-0.079652
-0.07174247,-0.096557215
-0.08642495,-0.10157204
-0.08714459,-0.08675316
-0.074545726,-0.08781073
-0.07443296,-0.080212824
-0.065461576,-0.035070814
-0.024749773,-0.20611674
-0.109810926,0.01906768
0.019492438,0.040737726
0.0514802,0.09610104
0.08685039,0.13887842
0.09619631,0.14991993
0.10664355,0.0477589
0.03777829,0.013813381
0.0029471829,0.0051145926
-0.008312533,-0.0023723969
-0.013810618,0.027260968
0.011238397,0.033821333
0.025160365,0.03274098
0.029515611,0.030035088
0.02792816,0.010630907
0.0065670977,0.0018547534
-0.0021583808,-0.0020886005
-0.007503659,-0.0058494336
-0.012628484,-0.0044631255
-0.009521738,-0.0055279564
-0.008041178,-0.0068782107
-0.009172453,-0.008337627
-0.010605118,-0.011206135
-0.014108514,-0.012008076
-0.015379364,-0.015413006
-0.019474786,-0.015684534
-0.017958466,-0.0065161735
-0.0058478294,-0.0041295053
-0.0046609296,-0.004156295
-0.004599835,-0.0057562953
-0.005337609,-0.011647415
-0.010518217,-0.0150989145
-0.017917262,-0.024685144
-0.028203327,-0.028296506
-0.03289556,-0.022243645
-0.026916688,-0.019758707
-0.021013374,-0.022139492
-0.020555465,-0.02052472
-0.018167421,-0.011755075
-0.008263407,-0.0076179337
-0.006098998,-0.0038346925
-0.0063596996,-0.0014123466
-0.005303095,-0.0046510296
-0.007978339,-0.0036794622
-0.008497245,-0.003027244
-0.0070289294,-0.00063369074
-0.004135557,0.009692513
0.0026686771,0.014885472
0.007960495,0.014874706
0.007529403,0.016673502
0.011328688,0.020837935
0.014615152,0.021132622
0.013958057,0.023702687
0.015952263,0.2967191
0.11691877,0.074664086
0.06860034,0.09354249
0.07695442,0.020604838
0.008976228,-0.008203679
-0.029735107,-0.043039143
-0.055405702,-0.05910036
-0.07080613,-0.06297023
-0.06943605,-0.06467864
-0.07032404,-0.020622239
-0.02179916,-0.00690788
0.00093005906,-0.033650953
-0.02888497,-0.037880484
-0.03639713,-0.033243474
-0.039255876,-0.031132966
-0.033896435,-0.012915548
-0.0138181085,-0.0041290047
-0.0044081784,-0.023770662
-0.02376036,-0.024124313
-0.028264305,0.0061175814
0.0018457578,0.018826572
0.013725517,0.017659592
0.015134141,0.021575779
0.020216601,0.029263567
0.026341721,0.03086269
0.02920905,0.036122873
0.038361024,0.03470402
0.03375097,0.012864097
0.012537169,0.0038097806
0.00045099662,0.003308161
0.0007452486,0.0008450044
-0.005790262,-3.4175733e-05
-0.0014953082,0.00086478377
-0.002371739,-0.0027030127
-0.004555465,-0.00096580875
-0.0012563956,0.015694298
0.01173638,0.02257351
0.018834677,0.023423146
0.018684823,0.025023898
0.018681051,0.024009267
0.015503534,0.024926003
0.016796952,0.020574167
0.012008182,0.018733935
0.009127754,0.035617247
0.027308933,0.039798707
0.034539524,0.013189079
0.0074641495,0.0062791966
0.003350231,0.02569239
0.022078121,0.029209737
0.024585914,0.02654766
0.022057751,0.02407912
0.018501233,0.011160567
0.0071835765,0.004225648
0.00092923624,0.0066269627
0.0062380657,0.004094328
0.0018431009,-0.008018403
-0.007438617,-0.0098920595
-0.010281092,-0.015620939
-0.017019035,-0.013436196
-0.01435336,0.018093359
0.0152992355,0.031635463
0.02926513,0.025472313
0.023681857,0.027504705
0.02416153,0.04129906
0.036311664,0.03909892
0.036345806,0.046633855
0.04346674,0.03748953
0.030549658,-0.024176765
-0.030558582,-0.0522736
-0.06266465,-0.05835275
-0.067251034,-0.06859207
-0.07056101,-0.072928265
-0.072280966,-0.073262386
-0.07103082,-0.0843173
-0.077086344,-0.08114233
-0.07332863,-0.04265094
-0.03648549,-0.026624024
-0.019016812,-0.013761053
-0.00947175,-0.0060021603
-0.0040945048,-0.024919244
-0.026116667,-0.025455037
-0.026249852,-0.01846754
-0.020447627,-0.010964026
-0.014016031,0.014613569
0.011244288,0.025568206
0.020501653,0.032681264
0.029126978,0.03552486
0.03277824,0.021474378
0.017427526,0.01574212
0.011296865,0.01649749
0.010897469,0.06837963
0.06248875,0.004899899
0.0026447026,0.0043472033
0.001917612,0.0012768955
-0.0024401634,0.0002324701
-0.0020313219,-0.0029028093
-0.0036099427,-0.0036560525
-0.0033501408,0.0025728194
0.0010589302,0.0030114704
0.003448677,0.0042036152
0.0022193778,0.0025829594
0.0030279288,-0.011673705
-0.013664603,-0.01829954
-0.021947224,-0.014615823
-0.016815944,-0.015732355
-0.015769308,-0.025598126
-0.026617823,-0.025202287
-0.028223805,-0.02913688
-0.028678726,-0.024212819
-0.025832962,0.011267727
0.010225393,0.02801246
0.028391358,0.027537003
0.027812133,0.033380054
0.03360995,0.044965375
0.044001676,0.0458726
0.045745052,0.057511628
0.05287982,0.053826656
0.04785099,0.007213333
0.0025751966,-0.009704156
-0.017239014,-0.018512357
-0.026712662,-0.021925924
-0.028960906,0.0032456932
-0.001362599,0.011899039
0.0077452953,0.012109727
0.009453094,0.0135784075
0.011848078,0.011129271
0.008378537,0.010940616
0.0072035384,0.0070855184
0.0015924787,0.0065661226
-6.511749e-05,0.014385981
0.008358838,0.015451187
0.011107822,0.017018389
0.012724258,0.01531461
0.011384995,0.0009793288
-0.0022057944,-0.0053583295
-0.0088032,-0.0058561936
-0.00854214,-0.0078037097
-0.008957786,-0.009492466
-0.008744132,-0.00920166
-0.007576736,-0.011839951
-0.010901768,-0.010341101
-0.010308596,0.0019248575
-0.00024682135,0.0070767556
0.0046775793,0.010819311
0.0081997765,0.013552493
0.010192315,0.0071057985
0.0032692153,0.005967609
0.0015912087,0.01499526
0.009895188,0.017364027
0.012013757,0.011569049
0.007552922,0.010305423
0.006589345,0.010329585
0.0061605596,0.010465536
0.005108028,0.013481013
0.0076800804,0.013995402
0.009254809,0.014876334
0.010461438,0.014390738
0.01060164,0.008527909
0.004892628,0.0059853853
0.0024110244,0.006753901
0.002343461,0.006244395
0.0019260576,0.0041719433
0.00070344785,0.004480151
0.0006809172,0.003063673
-0.0002327431,0.0044420944
0.0009849123,0.014303358
0.009448912,0.018626401
0.0146797635,0.019980662
0.015909303,0.02146211
0.017042324,0.020728396
0.015848583,0.020502562
0.015848517,0.021505674
0.016091863,0.021126112
0.015612622,0.018323326
0.014159016,0.017051188
0.011842095,0.014999767
0.010382347,0.013964981
0.010003444,0.016325736
0.01165065,0.015709696
0.011294111,0.015629075
0.011023806,0.075776115
0.06392915,0.019746063
0.014606369,0.021420674
0.015576735,0.02484263
0.018021572,0.028779473
0.020114701,0.019193117
0.014187615,0.031443927
0.025380723,0.0323166
0.026112305,0.03337642
0.028430942,0.040201303
0.034158718,0.039574247
0.035055503,0.015371819
0.008592183,0.00801227
0.00042973735,0.008732213
0.0034432674,0.00952176
0.006096547,0.024232473
0.019468792,0.028908791
0.023133622,0.02977107
0.024858756,0.029169302
0.023076266,0.020702608
0.01582404,0.015834756
0.011536615,0.013347314
0.008380411,0.010163713
0.005208309,0.0030411396
-0.0011121774,-0.0031825996
-0.0052763056,0.0049554813
0.0025986566,0.0018984432
-0.0012387465,-0.02581382
-0.02740465,-0.029582791
-0.032532055,-0.04888144
-0.052025825,-0.045059767
-0.04782708,0.033759866
0.032402348,0.059371762
0.058110386,0.06456334
0.06275455,0.06388659
0.061956756,0.017983822
0.013082847,-0.004238542
-0.009619123,-0.002787388
-0.009404982,-0.009621534
-0.015345906,-0.04808476
-0.052051775,-0.05919237
-0.06167801,-0.0293537
-0.028865095,-0.01887402
-0.014938069,-0.014266553
-0.009314828,-0.007523043
-0.004927755,-0.007244004
-0.0053780437,-0.005390377
-0.004290484,0.016725078
0.014770977,0.023309479
0.021442734,-0.0060016597
-0.0062552406,-0.012219765
-0.014727421,0.0029987015
-0.001545705,0.007901355
0.0037660887,0.017254364
0.01315394,0.021062141
0.016517708,0.012494423
0.009408926,0.011250952
0.008424518,0.012559019
0.0096551,0.013887616
0.01224846,0.02038426
0.018639304,0.023563104
0.020567901,0.022856431
0.019025482,0.023642221
0.019156605,0.027182853
0.021279844,0.027244445
0.021380326,0.027807655
0.022344928,0.026132919
0.021205293,0.015341775
0.010710182,0.009886552
0.0062273075,0.011332198
0.0077419207,0.008682515
0.005123287,0.00275509
-0.00017653401,0.002919584
0.00055392645,-0.01303823
-0.01452585,-0.016573979
-0.018067848,0.03340008
0.028971849,0.046222992
0.044338938,0.004232032
0.0036078503,-0.008119303
-0.008712539,0.0030561618
-0.00027984258,0.0039071753
0.00025548588,-0.0041526644
-0.005984252,-0.006211972
-0.0071627502,-0.00013995777
-0.0022196071,0.0013110713
-0.001150747,0.0010251468
0.00032627993,0.000825225
0.0009364708,-0.0017900323
-0.0029923394,-0.0025944766
-0.0052180933,-0.0032072612
-0.0056495126,-0.07776031
-0.07271805,-0.014709837
-0.015833374,-0.023688916
-0.0242618,0.015385089
0.013588256,0.024877556
0.02528944,-0.0124794
-0.013332058,-0.02218869
-0.023691244,-0.0019715517
-0.005792293,0.0019705503
-0.00044258684,-0.0017330728
-0.00310919,-0.003568172
-0.006381448,-0.010011612
-0.011645612,-0.01273841
-0.014607293,-0.015768033
-0.014593528,-0.015990488
-0.015259293,-0.012484033
-0.013347744,-0.012755561
-0.013614961,0.0011723654
0.00035795546,0.002505219
0.0034861495,-0.026026387
-0.025047215,-0.033694644
-0.03404568,-0.034073457
-0.03559505,-0.029676931
-0.031255975,-0.012817402
-0.011429185,-0.003713012
-0.0025498567,0.027652174
0.02583681,0.037884366
0.036127307,0.0097979205
0.008496432,0.0024805574
9.852778e-05,0.005457602
0.00092025875,0.0053583295
0.0008219171,0.010440875
0.006495286,0.011689979
0.008839265,0.010020751
0.007580235,0.008830985
0.005560686,0.0067053293
0.0036379767,0.003441609
0.000632612,0.0039620064
0.001360102,0.0007020422
-0.0010857136,-0.014429671
-0.014282009,-0.021558253
-0.022442749,-0.021644255
-0.022747269,-0.023636838
-0.024178457,-0.026710901
-0.028267074,-0.025663847
-0.027292162,-0.029269826
-0.030934215,-0.026084471
-0.027058924,-0.003871372
-0.0039023485,0.005905517
0.006134769,0.011026494
0.011564077,0.014718349
0.014249744,0.0104465075
0.00936281,0.01075121
0.008389329,0.008557203
0.0050495844,0.00920166
0.005854565,0.019749193
0.015482102,0.02104762
0.01626402,0.02455007
0.019249054,0.021705847
0.017636856,-0.0017738834
-0.0041611153,-0.011833066
-0.015368321,-0.016397843
-0.021049684,-0.019431721
-0.023296848,-0.01656797
-0.018560184,-0.017426245
-0.01800415,-0.0072829365
-0.0070125093,-0.0039143106
-0.0041829203,-0.031592526
-0.03149463,-0.03457971
-0.035277545,-0.010150318
-0.011543037,-0.0033032787
-0.0053466437,0.030502906
0.027513001,0.04123947
0.040425777,-0.024026291
-0.024260432,-0.03921872
-0.0429409,0.010060059
0.0039941296,0.02600886
0.019024974,0.02028887
0.01697725,0.02367477
0.01948744,0.031887837
0.027686764,0.036981024
0.03386049,0.037605952
0.034149706,0.03999024
0.03643109,0.047053475
0.040867954,0.049253616
0.041681834,0.048944533
0.04264605,0.04757951
0.043111533,0.041766502
0.035175797,0.03648942
0.026875501,0.03561024
0.025446221,0.03771912
0.024828803,0.0016694784
-0.0047952244,-0.0012407169
-0.0071857064,-0.018345859
-0.022811964,-0.025975185
-0.03275669,-0.028998299
-0.033956572,-0.031559475
-0.035431664,-0.029639626
-0.031075636,-0.02930325
-0.030687353,-0.028015338
-0.027537178,-0.0271637
-0.026276827,-0.027884645
-0.028758703,-0.02525424
-0.025900165,-0.028019596
-0.027932944,-0.024629813
-0.023995066,-0.002990314
-0.0031247153,0.0055288323
0.005461496,0.009164605
0.0080766175,0.010700385
0.0088785775,0.001521008
-0.00046116917,-0.0027185357
-0.0047898088,-0.004096957
-0.0057281237,-0.00676667
-0.00859318,-0.011720274
-0.012759971,-0.0166556
-0.017415017,-0.013541478
-0.013624955,-0.0167729
-0.016134558,-0.03675093
-0.037333045,-0.042541277
-0.043399267,-0.04841312
-0.04943938,-0.047193184
-0.04734701,-0.021143388
-0.018611459,-0.009977311
-0.006533339,-0.0054553486
-0.00211316,-0.0005523199
0.00087377534,-0.0034452395
-0.003321934,-0.002257852
-0.003209227,0.0036303892
0.0013430151,0.0069170184
0.0043143122,0.006470731
0.004025641,0.0099365
0.0072804587,0.010507723
0.0082374355,0.015021425
0.012938812,0.033123046
0.029659279,0.04180944
0.03782294,0.04371026
0.040944204,0.046676543
0.045028463,0.048409365
0.04527338,0.0478782
0.0435261,0.0508749
0.04652387,0.04845418
0.043407083,0.033544548
0.026526166,0.026906569
0.019482931,0.019194368
0.012175543,0.015096661
0.00879342,0.023982227
0.01755473,0.022425165
0.01583859,0.022410894
0.015710024,0.017061327
0.011357916,-0.009684501
-0.012799533,-0.022649623
-0.0265212,-0.023855163
-0.028707422,-0.028503062
-0.03315032,-0.035542637
-0.03906783,-0.03611424
-0.038077217,-0.042319823
-0.04307435,-0.039311983
-0.039595,-0.009852376
-0.008748341,0.0030113454
0.003932816,0.00800651
0.008936016,0.013006559
0.014030842,0.0099228555
0.010392595,0.010339349
0.009370126,0.013578532
0.011469902,0.01471547
0.011459051,0.013855568
0.009672353,0.0141128255
0.009891311,0.012555764
0.008195288,0.012487037
0.007872239,0.016949913
0.011792791,0.017018137
0.011728315,0.018230189
0.012349417,0.016374808
0.010862975,0.0040729214
-8.99351e-05,-0.0016132699
-0.0053782742,-0.0029597688
-0.0068035326,-0.0051520234
-0.008954336,-0.0063494258
-0.009913304,-0.0067602857
-0.009461362,-0.008899586
-0.009862619,-0.12911905
-0.112101175,0.0011706128
-0.0020216114,-0.00048734847
-0.0012713391,-0.022337034
-0.0193283,-0.032982964
-0.030993234,-0.01950821
-0.017622268,-0.018297538
-0.01756946,-0.05266681
-0.052073795,-0.05511294
-0.054237645,-0.039442927
-0.038803358,-0.022993885
-0.02416817,0.03163922
0.031326454,0.059600603
0.063003965,0.06768448
0.06976994,0.078653514
0.07544549,0.0871147
0.076966494,0.088023424
0.07566569,0.0965467
0.07937248,0.09206592
0.07491299,0.050433993
0.041614514,0.030115206
0.019678088,0.031367313
0.019494869,0.022742387
0.01244502,6.259292e-05
-0.005495481,-0.006628465
-0.013642476,-0.020041
-0.02705238,-0.019019485
-0.022737242,0.025403712
0.020324858,0.04145116
0.039321862,0.048698545
0.04848507,0.051838454
0.049999617,0.033395577
0.026098048,0.028673816
0.020529091,0.021361837
0.0132027995,0.019076569
0.009587184,0.043078825
0.033381384,0.04741952
0.04052607,0.03485762
0.029122435,0.02400451
0.019158727,0.019252205
0.015006328,0.0035789378
-0.0012044077,-0.029375734
-0.03478287,-0.03735107
-0.041645996,-0.11341587
-0.10612946,-0.1329729
-0.11221926,0.047607675
0.04434872,0.09566514
0.07742314,-0.026644804
-0.019875592,-0.058603123
-0.056594364,-0.039886713
-0.045421086,-0.0376037
-0.04458299,-0.03305194
-0.035951346,-0.033820204
-0.033596706,-0.007158126
-0.008094591,0.003425961
0.00048306942,-0.07123187
-0.07048471,-0.08545799
-0.0792388,0.009215931
0.005666586,0.029862706
0.021903362,0.03208538
0.030058844,-0.039504018
-0.034954336,0.015559974
0.01382654,0.019284504
0.01731128,0.009124545
0.009331759,0.0097511
0.008348756,0.013790096
0.00889086,0.018759347
0.012271776,0.03982612
0.03751349,0.0519719
0.050177388,0.041662097
0.037684903,0.045243163
0.037733637,0.07729662
0.069893636,0.07920721
0.07202289,0.09726464
0.082880646,0.08484958
0.07488988,-0.004152164
-0.011736703,-0.036011457
-0.04819683,-0.092742175
-0.09943498,-0.10616097
-0.10397832,0.002617761
-0.0010543223,0.03908865
0.038318243,0.037289105
0.04018169,0.03913998
0.04369106,0.026109008
0.024874734,0.020172946
0.017335236,-0.015220219
-0.017982276,-0.025633303
-0.028797267,0.0081091635
0.0041708774,0.016904846
0.013936379,0.013809125
0.0142171765,-0.12338416
-0.10282103,-0.025407718
-0.027610194,-0.023386844
-0.02552227,-0.005754167
-0.002494223,0.001857132
0.0055477046,0.004897771
0.0050025173,0.007689039
0.007877559,0.0050337226
0.0062359883,0.004777968
0.005160784,0.0064384327
0.005403869,0.006701323
-0.00069912506,0.005758924
0.0014242572,0.005539473
0.00097186706,0.0037544484
0.0001588617,0.002787388
-0.0013271624,0.007053721
0.002809069,0.007467085
0.0061545516,0.0008425007
-0.00236077,-0.0051738056
-0.0059619634,0.0042774747
0.00142805,0.0034214542
-0.00031658457,-0.038687307
-0.041735075,-0.05122955
-0.056389146,-0.022414776
-0.026014622,-0.013793602
-0.015872408,-0.019716268
-0.020170648,-0.01829666
-0.01710542,-0.009520383
-0.011324011,-0.004905407
-0.00520353,-0.005326783
-0.004203102,-0.003314796
-0.0013244855,0.0027222913
0.0009602933,0.0042415466
0.0025454587,0.007669135
0.0073545533,0.007293828
0.0057639424,-0.006234505
-0.0052957847,-0.01158357
-0.011933869,-0.0096345525
-0.008242898,-0.009883172
-0.009095066,-0.013285598
-0.01422583,-0.012150037
-0.013673309,-0.009807684
-0.011006102,-0.0060036625
-0.007206448,0.0084369
0.007108652,0.01973054
0.019562956,0.009876662
0.008820362,0.015905112
0.012496405,0.060175955
0.055020977,0.07034167
0.06444463,0.08555288
0.076447494,0.07967653
0.07294826,0.008677632
0.003708386,-0.019032879
-0.026022352,-0.04016475
-0.049824115,-0.05055818
-0.058609664,-0.0146202035
-0.01785374,-0.011598969
-0.012686245,-0.0033066587
-0.0023153615,-0.018064942
-0.01479475,-0.07033679
-0.06746203,-0.0835971
-0.07944972,-0.20977215
-0.10504404,-0.22508264
-0.10762676,-0.0021345438
-0.00032407115,0.07960029
0.07347886,0.12174824
0.08310873,0.13971429
0.09976045,0.077953845
0.07354225,0.05280589
0.0438461,0.0042995075
-0.008269325,-0.018294659
-0.03193198,0.000100023484
-0.010704702,0.011871373
0.0026652154,-0.019127395
-0.021648316,-0.013053753
-0.0088662775,0.097967684
0.08272552,0.1292371
0.09229584,0.12396002
0.09042169,0.1146343
0.08618456,0.037346564
0.028496686,0.007964448
0.00037674562,-0.009657587
-0.017336918,-0.017651454
-0.025798861,0.022241643
0.010183772,0.03355156
0.02306265,0.032273408
0.024819912,0.03178969
0.024528936,0.01798207
0.0121144755,0.011896785
0.005599871,0.009937627
