Predicted,Actual
0.83761674,0.83763725
0.83834887,0.8385493
0.8390053,0.839377
0.8396048,0.840106
0.840161,0.840764
0.84066045,0.8413412
0.8411006,0.8418078
0.84149057,0.8421688
0.8418302,0.84238434
0.8421066,0.84245414
0.84231585,0.84249043
0.84243846,0.8425118
0.8424647,0.842511
0.84242827,0.84250736
0.8423454,0.84248286
0.84222305,0.8424366
0.8420763,0.84239936
0.8419102,0.84237266
0.84173125,0.84232396
0.84155446,0.84225315
0.8413892,0.8421566
0.8412288,0.84203106
0.8410722,0.8419018
0.8409168,0.84177166
0.8407596,0.84163874
0.84060764,0.84150624
0.8404623,0.84136164
0.84032494,0.8412019
0.8401963,0.84103894
0.840069,0.8408715
0.8399398,0.84068406
0.83981025,0.8404777
0.8396779,0.8402423
0.8395339,0.8399767
0.8393731,0.8397172
0.8391886,0.8394712
0.83897454,0.839223
0.8387404,0.83897746
0.8384909,0.83875215
0.83822113,0.83854437
0.8379326,0.8383746
0.8376359,0.83824337
0.83733517,0.83808887
0.8370416,0.83789915
0.8367632,0.83768934
0.8364828,0.8374492
0.8361899,0.8371657
0.8358861,0.8368402
0.83556575,0.83644474
0.8352177,0.8359769
0.8348378,0.8355
0.8344103,0.8350236
0.8339253,0.8345302
0.83340156,0.83402795
0.83284706,0.8335236
0.83226067,0.8330115
0.8316492,0.8325237
0.83102095,0.8320584
0.8303787,0.8315404
0.8297409,0.83096117
0.82911575,0.83030045
0.82848,0.8295454
0.82782656,0.82875913
0.8271374,0.82794166
0.82639635,0.8270961
0.8256157,0.82622695
0.8247932,0.82526076
0.8239286,0.8241786
0.8230252,0.8230335
0.82205445,0.8218167
0.8209972,0.82045573
0.8198629,0.81895995
0.8186454,0.81726706
0.81731,0.8153769
0.8158468,0.81349635
0.81421703,0.8116629
0.8123996,0.80985874
0.81046325,0.80812055
0.80844384,0.80642927
0.8063634,0.8047848
0.80426264,0.80324954
0.8021642,0.80182874
0.8000921,0.80044526
0.7980916,0.7990966
0.796191,0.79778343
0.7943857,0.7964985
0.7926848,0.7952851
0.79109335,0.7941512
0.78961,0.7930841
0.7882523,0.79209083
0.78702545,0.79117304
0.7859306,0.79032844
0.784971,0.7895866
0.78414327,0.7889501
0.7834419,0.788369
0.78287333,0.78784615
0.78243667,0.78736055
0.7821106,0.7869089
0.7818873,0.7865869
0.78174925,0.7864145
0.7816829,0.78634983
0.7817126,0.7864058
0.78184766,0.78662807
0.782078,0.78700805
0.7824072,0.7876054
0.7828576,0.78841954
0.7834354,0.78928006
0.78417194,0.7901595
0.7850811,0.79105747
0.7861086,0.7919439
0.7872284,0.79286677
0.78841925,0.79382586
0.7896508,0.79478455
0.7909165,0.79574156
0.7922029,0.79670185
0.7934868,0.797656
0.7947544,0.79862857
0.7959975,0.7996177
0.79720384,0.8005636
0.79837763,0.8014653
0.7995162,0.80229515
0.8005964,0.803048
0.801612,0.8038244
0.80254376,0.8046396
0.8033815,0.80548495
0.8041604,0.8063757
0.80489844,0.80728924
0.8056091,0.8082228
0.80631304,0.8091987
0.8070182,0.81021565
0.8077354,0.81125516
0.8084801,0.812318
0.80926317,0.8133884
0.8100882,0.8144627
0.8109638,0.81557643
0.81188864,0.81672794
0.8128649,0.81792706
0.8139036,0.81917447
0.815008,0.8204123
0.81618786,0.8216283
0.8174481,0.8228318
0.81876576,0.82401216
0.8201282,0.8251646
0.821526,0.8262887
0.8229423,0.82736295
0.8243652,0.8283845
0.8257829,0.8293888
0.8271751,0.83037853
0.8285283,0.8313478
0.8298414,0.8323001
0.83110636,0.83322686
0.8323181,0.8341243
0.8334734,0.8350031
0.83456594,0.83586067
0.83559227,0.8366763
0.8365514,0.8374475
0.83744276,0.8381637
0.83826,0.83882034
0.8390008,0.8394406
0.83966106,0.8400232
0.84023947,0.8405715
0.8407415,0.8410863
0.84117097,0.84153414
0.84153634,0.8419066
0.841843,0.8422214
0.8420835,0.84247357
0.84225655,0.8426404
0.84236723,0.8427249
0.8424152,0.84270257
0.84239304,0.842573
0.84229946,0.8424083
0.8421207,0.8422196
0.84185183,0.84200865
0.841516,0.8417879
0.8411244,0.8415329
0.84068877,0.84124357
0.84022313,0.8409332
0.8397302,0.8406018
0.8392161,0.84025556
0.83868986,0.8399
0.83815676,0.8395206
0.8376241,0.83911896
0.8370981,0.8387249
0.8365766,0.8383378
0.8360608,0.8379754
0.83556265,0.83763963
0.8350857,0.8372707
0.8346433,0.8368598
0.8342416,0.83640766
0.8338582,0.8359049
0.8334834,0.83537185
0.8331087,0.8348098
0.83272046,0.8342083
0.8323157,0.83356863
0.8318866,0.83288795
0.831423,0.83216274
0.8309179,0.83140916
0.83036417,0.8306273
0.8297542,0.82978827
0.8290886,0.828894
0.8283662,0.82793003
0.82757545,0.8268957
0.82671285,0.8258522
0.82576954,0.82481164
0.82474065,0.82376474
0.8236473,0.8227226
0.8225012,0.8216878
0.8213091,0.8206605
0.8200844,0.81966245
0.81883657,0.81869626
0.817576,0.8177256
0.81632215,0.8167473
0.815086,0.81576747
0.81386507,0.8147822
0.8126636,0.8137994
0.81148714,0.8128227
0.81033736,0.8118405
0.80921817,0.810855
0.80813175,0.8098893
0.8070751,0.8089461
0.8060474,0.8080366
0.805056,0.80716574
0.8041032,0.80630744
0.8031927,0.8054626
0.80232805,0.8046276
0.8015026,0.8038011
0.80071414,0.8030204
0.7999588,0.8022946
0.79923284,0.8016027
0.7985456,0.8009498
0.7979017,0.8003638
0.79729533,0.79984117
0.7967284,0.7994098
0.7962103,0.79907006
0.7957447,0.7987371
0.79534596,0.79839665
0.79502034,0.7980529
0.794742,0.79769117
0.79449785,0.7973277
0.79427963,0.79696286
0.79407316,0.796575
0.7938735,0.7961632
0.7936728,0.79574496
0.7934572,0.7953189
0.7932182,0.79489154
0.7929551,0.7944644
0.79266423,0.7940135
0.79234535,0.79353744
0.79199743,0.79303217
0.7916121,0.79249525
0.79118663,0.7919526
0.7907166,0.79140913
0.79019964,0.79085654
0.7896446,0.7902986
0.789057,0.78974074
0.7884395,0.7891822
0.78779787,0.7886337
0.78713894,0.788096
0.7864696,0.7875435
0.7857972,0.7869723
0.78512853,0.7863875
0.78446096,0.7857856
0.78379476,0.7851671
0.78313303,0.7845338
0.7824759,0.78387535
0.7818225,0.78319246
0.7811723,0.78250694
0.7805226,0.78182125
0.7798704,0.7811415
0.77922046,0.78047174
0.7785749,0.77979404
0.7779358,0.7791087
0.7773051,0.77841526
0.7766781,0.77771276
0.776053,0.777023
0.77542764,0.77635163
0.7747999,0.77568614
0.77417517,0.77502996
0.7735554,0.77440006
0.7729392,0.7737947
0.7723276,0.7732318
0.7717277,0.7727119
0.7711424,0.77218366
0.77058125,0.77164024
0.7700489,0.77107775
0.7695313,0.7704878
0.76902205,0.76989526
0.7685136,0.76930064
0.7679974,0.76869816
0.76747507,0.76808923
0.76694417,0.7674579
0.7664026,0.7667981
0.765849,0.76612973
0.76527524,0.765451
0.7646748,0.7647302
0.7640512,0.7639703
0.7634029,0.76315033
0.76271665,0.7622698
0.76198924,0.7614049
0.76120615,0.76056993
0.7603604,0.75975496
0.75947756,0.7589735
0.7585706,0.7582247
0.7576477,0.7575084
0.7567251,0.7568503
0.7558135,0.7562527
0.7549234,0.75567573
0.75407404,0.7551161
0.75327706,0.7545786
0.7525301,0.75405896
0.75183535,0.7535686
0.75119466,0.75311124
0.7506087,0.7526751
0.7500804,0.75226265
0.74961114,0.7518935
0.749199,0.75156933
0.7488439,0.75130326
0.74854845,0.75109947
0.7483137,0.7509286
0.7481445,0.75079143
0.74804276,0.7506816
0.7479997,0.75059724
0.74801135,0.75058275
0.74806994,0.7506484
0.7481696,0.75077003
0.7483225,0.7509535
0.7485334,0.75122833
0.74879766,0.7515901
0.74911624,0.7520703
0.74950284,0.7526689
0.74996144,0.75328964
0.75050956,0.75391626
0.751156,0.75455123
0.75187093,0.7551775
0.7526393,0.75581646
0.75344926,0.756468
0.7542829,0.7571089
0.75513417,0.7577378
0.75599414,0.7583674
0.756848,0.75899434
0.75768614,0.7596283
0.7585048,0.76026946
0.7592982,0.76088774
0.7600673,0.7614816
0.7608112,0.7620416
0.76151824,0.7625648
0.76218426,0.7630913
0.7628004,0.7636277
0.763361,0.7641662
0.7638818,0.7647126
0.76436937,0.7652648
0.7648287,0.7658214
0.76526797,0.7663945
0.7656937,0.76698387
0.7661117,0.767568
0.7665322,0.76814425
0.76696175,0.7687119
0.7674001,0.7692675
0.7678486,0.76981956
0.768308,0.7703687
0.7687782,0.77091014
0.76926184,0.77144426
0.76975834,0.77197117
0.7702676,0.7724892
0.7707892,0.773005
0.77131975,0.77351844
0.7718576,0.774015
0.77240384,0.7744946
0.7729559,0.7749508
0.77350944,0.77538204
0.77406013,0.77581334
0.77460164,0.77624947
0.7751291,0.7766792
0.77564627,0.7771057
0.77615434,0.77753943
0.77664983,0.7779779
0.77713203,0.7784368
0.777605,0.7789158
0.77806914,0.7793708
0.778532,0.7797954
0.7789965,0.7801847
0.7794497,0.780531
0.7798846,0.78085697
0.78029436,0.78116256
0.7806707,0.7814431
0.7810157,0.7816995
0.7813275,0.78191453
0.7816043,0.78208196
0.7818454,0.78222024
0.78204346,0.7823271
0.7821934,0.7823726
0.78229994,0.782359
0.78236085,0.7822663
0.78236574,0.78209364
0.78231144,0.7819126
0.7821845,0.781737
0.7819786,0.78155404
0.78171855,0.7813759
0.78141725,0.78120816
0.7810806,0.78105015
0.78072244,0.780929
0.78035486,0.78084743
0.77998805,0.78075427
0.779641,0.7806436
0.77932674,0.78052586
0.779037,0.78039515
0.7787705,0.7802552
0.77853,0.7801107
0.778313,0.7799414
0.7781188,0.77974945
0.7779469,0.7795787
0.7777891,0.7794341
0.7776419,0.77933
0.777515,0.77927446
0.7774124,0.77922815
0.777343,0.7791916
0.77731305,0.7791624
0.77731335,0.7791382
0.7773417,0.7791671
0.77739304,0.7792618
0.7774629,0.77938884
0.77756697,0.77955437
0.77771425,0.7798052
0.777897,0.7801359
0.7781178,0.78058594
0.77839684,0.78115606
0.7787414,0.781716
0.779176,0.7822414
0.779713,0.78275096
0.7803105,0.78322196
0.7809469,0.7836532
0.78161144,0.7840457
0.78228146,0.78435385
0.78293854,0.7845736
0.783568,0.7847816
0.78413904,0.78498536
0.78463286,0.78517276
0.78506225,0.7853524
0.78542787,0.7855104
0.78572756,0.7856396
0.7859658,0.785767
0.7861405,0.7858884
0.78625166,0.78595203
0.78630936,0.7859529
0.7863168,0.7858662
0.78626317,0.7856819
0.7861447,0.785461
0.7859496,0.7852022
0.7856697,0.784915
0.78532267,0.78460324
0.7849128,0.7841827
0.78444964,0.783633
0.7839417,0.7830055
0.7833621,0.78228945
0.7826966,0.7814178
0.7819561,0.78039956
0.78113514,0.77917105
0.7802025,0.7777319
0.7791481,0.77628493
0.77793527,0.77486604
0.77654356,0.7734582
0.775038,0.7720968
0.7734513,0.7707614
0.77180237,0.7694513
0.7701271,0.76822704
0.76844454,0.7670932
0.7667759,0.7659752
0.7651595,0.7648704
0.7636209,0.76377887
0.7621525,0.7626933
0.76076007,0.76165575
0.7594459,0.7606736
0.758208,0.7597345
0.75706077,0.7588452
0.75600904,0.7580062
0.7550537,0.7572149
0.7541971,0.75650007
0.7534344,0.75586385
0.75276154,0.75525725
0.75218326,0.75468296
0.7516992,0.75412
0.75128776,0.753565
0.7509415,0.7531117
0.7506431,0.7527797
0.7503798,0.75252724
0.75017655,0.7523669
0.75004345,0.7523443
0.7499703,0.75245106
0.7499615,0.75274575
0.7500405,0.75322783
0.7502146,0.75372857
0.75051314,0.7542205
0.75095236,0.75470597
0.7514792,0.75515556
0.7520694,0.75561064
0.7527057,0.7560714
0.7533599,0.75649863
0.7540264,0.7568908
0.75469327,0.75726485
0.7553371,0.75761414
0.7559441,0.75795805
0.75651073,0.7582967
0.75702775,0.7585759
0.7574973,0.75879383
0.7579186,0.7589312
0.75827074,0.7589833
0.7585475,0.7590288
0.7587347,0.75908065
0.7588243,0.75912577
0.75884324,0.7591759
0.7588056,0.75922555
0.75871974,0.75927216
0.7585999,0.7593389
0.7584563,0.75942594
0.75829756,0.7594963
0.7581382,0.7595463
0.75798815,0.75957334
0.7578454,0.7595718
0.7577121,0.75956076
0.7575901,0.7595416
0.75747854,0.7595079
0.7573829,0.75946105
0.75730443,0.75939506
0.7572442,0.75930613
0.7572032,0.759208
0.7571752,0.7590998
0.75715685,0.75895524
0.7571477,0.75877494
0.7571439,0.7585451
0.75713354,0.7582633
0.7571102,0.7579801
0.7570609,0.7577051
0.75697684,0.7574181
0.7568676,0.7571259
0.75673527,0.7568468
0.75657433,0.75657594
0.7563862,0.75634456
0.7561784,0.756152
0.75595206,0.75591636
0.75572026,0.755627
0.7554886,0.7552714
0.75523335,0.7548358
0.7549439,0.7543702
0.75460696,0.75387496
0.7542091,0.75334525
0.7537589,0.7527841
0.7532553,0.75214523
0.75270075,0.7514151
0.752097,0.75063306
0.75142574,0.7497936
0.75067693,0.7488384
0.7498586,0.74777406
0.7489671,0.74655455
0.7479795,0.7451794
0.7468891,0.7438035
0.7456669,0.7424543
0.7442999,0.7411217
0.7428408,0.7398332
0.74131465,0.73856664
0.73973995,0.7373222
0.73814744,0.73614246
0.73654956,0.73503065
0.7349639,0.73394465
0.73341954,0.73288584
0.73193604,0.7318473
0.73051566,0.7308256
0.7291676,0.729861
0.7278937,0.7289577
0.7266964,0.7281175
0.72559255,0.72734547
0.72458875,0.72661185
0.72369516,0.72591084
0.7229174,0.7252593
0.7222417,0.7246539
0.7216609,0.7240774
0.7211743,0.723532
0.7207732,0.7230008
0.720445,0.7224827
0.72018015,0.722029
0.7199618,0.72164893
0.7197783,0.7213281
0.7196376,0.72107375
0.71953994,0.7208951
0.71948,0.72078854
0.7194578,0.7207793
0.71947724,0.7208666
0.71953976,0.7209893
0.7196568,0.72113895
0.7198322,0.7213084
0.7200488,0.7214869
0.7202985,0.72170603
0.72057354,0.7219654
0.7208645,0.7222584
0.7211759,0.72258574
0.7215064,0.72292304
0.7218549,0.72326165
0.72222155,0.72362125
0.72259784,0.7239977
0.7229786,0.7243589
0.72336924,0.7247072
0.7237686,0.7250154
0.7241632,0.72528213
0.7245497,0.725588
0.72491246,0.7259439
0.725244,0.72635484
0.7255717,0.7268335
0.7259066,0.7273421
0.72626114,0.7278794
0.72665054,0.72845453
0.7270719,0.72906506
0.7275307,0.72973454
0.72803277,0.73047155
0.72858125,0.73124725
0.72918934,0.732064
0.72986704,0.73296666
0.7306094,0.7339504
0.73142016,0.7350469
0.7323169,0.73625624
0.7333042,0.73746604
0.73440266,0.7386567
0.73562104,0.73983026
0.7369195,0.7409665
0.73827887,0.74209064
0.73968244,0.74320185
0.741106,0.7442739
0.7425415,0.7453048
0.7439759,0.7463043
0.74538726,0.74726665
0.74676293,0.7482061
0.74809194,0.7491219
0.7493616,0.7499742
0.75056833,0.75076157
0.75170594,0.75146806
0.7527547,0.75208986
0.753706,0.7526877
0.7545438,0.7532707
0.75525755,0.7538316
0.75586814,0.7543793
0.75638515,0.754903
0.7568175,0.75540084
0.7571803,0.755888
0.75748026,0.75636363
0.75772655,0.7568094
0.7579339,0.7572247
0.75811183,0.7576
0.7582641,0.757932
0.75839823,0.7582449
0.75851625,0.7585382
0.7586201,0.7588144
0.75872177,0.7590745
0.7588254,0.75928694
0.7589384,0.75944245
0.75906646,0.75956213
0.7591986,0.75964046
0.75932604,0.759643
0.7594479,0.75957054
0.75955564,0.7593963
0.7596302,0.75911623
0.75966084,0.75881296
0.7596252,0.75850123
0.7595082,0.75815064
0.7593259,0.7577722
0.7590836,0.7573895
0.75877583,0.75699484
0.75840765,0.7566369
0.7579913,0.75631416
0.7575311,0.755902
0.75705147,0.75538486
0.75656265,0.75473934
0.7560288,0.7539443
0.7554359,0.75308466
0.7547607,0.75216085
0.7539798,0.7511696
0.7531061,0.75011647
0.75213593,0.7489149
0.75107044,0.74754083
0.7499121,0.7460628
0.74862784,0.74447054
0.7471955,0.74266636
0.745627,0.74066204
0.74391496,0.7383771
0.74201643,0.73581123
0.7399183,0.73323345
0.7375705,0.73069143
0.7349474,0.7281684
0.7321379,0.72571224
0.7291884,0.7232848
0.7261346,0.7208864
0.72303426,0.7185916
0.71991426,0.71640617
0.7168079,0.7142573
0.71377134,0.7121474
0.7108404,0.7100653
0.7080215,0.7080054
0.7053335,0.7060372
0.70277935,0.7041684
0.7003625,0.7024019
0.69811213,0.70074666
0.69603837,0.69915354
0.6941568,0.6976132
0.692478,0.69615537
0.6909758,0.694775
0.68963635,0.69344133
0.6884562,0.69215876
0.6874199,0.6908981
0.68650514,0.6896578
0.6856967,0.68852854
0.68496555,0.6875271
0.68429196,0.68662727
0.68369025,0.68584234
0.68316185,0.6851909
0.68269837,0.68466693
0.6823017,0.68431574
0.6819806,0.6841367
0.6817385,0.6840186
0.68159413,0.6839461
0.6815578,0.6839096
0.68160003,0.68389016
0.6817078,0.683939
0.6818666,0.6840561
0.68205965,0.68422675
0.6822915,0.68445224
0.68255836,0.68470085
0.6828564,0.6849599
0.6831839,0.6852606
0.6835282,0.68559754
0.68388164,0.6859173
0.6842522,0.6862232
0.6846381,0.6864747
0.68502074,0.68666923
0.68539476,0.68693304
0.6857371,0.68728435
0.68603706,0.6877265
0.68633723,0.6882798
0.6866574,0.68889385
0.6870172,0.6895669
0.6874423,0.69031763
0.6879322,0.69114333
0.6884973,0.6920642
0.6891489,0.6930909
0.6898939,0.6941848
0.6907501,0.69534755
0.691731,0.6966447
0.69282895,0.69807076
0.6940475,0.69966495
0.6954123,0.7014283
0.69692814,0.70321196
0.6986236,0.70498836
0.7005098,0.70677114
0.7025292,0.7085339
0.704654,0.7102885
0.7068636,0.7120347
0.70912284,0.7137277
0.71141547,0.71536326
0.7137186,0.7169959
0.715996,0.71862674
0.7182246,0.7202561
0.72040147,0.7218888
0.72251517,0.72349143
0.7245603,0.72505826
0.7265331,0.72659576
0.72841763,0.72809863
0.7302074,0.7295717
0.731895,0.7310167
0.7334756,0.73241544
0.7349585,0.733767
0.7363471,0.7350973
0.73764086,0.7364041
0.7388458,0.7376998
0.73997426,0.73898554
0.7410354,0.7402065
0.74204654,0.74135095
0.7430183,0.7424404
0.7439405,0.74346685
0.7448127,0.744407
0.7456425,0.7452649
0.7464294,0.74600804
0.7471653,0.74663615
0.74784863,0.74723786
0.7484627,0.74782693
0.74900085,0.748402
0.74949014,0.7489781
0.74994314,0.7495318
0.7503682,0.75006247
0.75077915,0.75058997
0.7511776,0.75111455
0.75156844,0.75162834
0.7519618,0.7521347
0.7523634,0.75262284
0.75277424,0.7530925
0.7531964,0.7535716
0.7536261,0.7540607
0.7540623,0.7545702
0.75451404,0.75510246
0.7549834,0.7556146
0.75547844,0.75609994
0.7560023,0.7565626
0.7565366,0.756996
0.7570738,0.75740826
0.757608,0.7578004
0.7581301,0.7581627
0.7586361,0.7584953
0.7591193,0.75880724
0.7595707,0.7590986
0.75998616,0.7593736
0.7603625,0.7596338
0.76069766,0.75986797
0.7609904,0.7600767
0.76124,0.76025665
0.76144344,0.7604078
0.7616012,0.7605474
0.7617099,0.7606779
0.7617704,0.760805
0.76179194,0.7609322
0.7617784,0.76104337
0.7617376,0.76113933
0.76167685,0.761218
0.7615945,0.76127887
0.7614941,0.76134664
0.76137894,0.76142776
0.76124907,0.7615084
0.76111764,0.7615925
0.7609937,0.7616992
0.7608802,0.7618265
0.7607822,0.7619953
0.7607122,0.7622064
0.76067567,0.7624003
0.7606861,0.76256955
0.7607519,0.7627078
0.76085436,0.7628057
0.7609865,0.7628956
0.7611351,0.7629783
0.7612867,0.7630487
0.7614435,0.76310897
0.76160026,0.76313406
0.76175094,0.76311576
0.7618932,0.7630817
0.7620127,0.7630296
0.76209736,0.76291597
0.7621503,0.76274514
0.7621681,0.7624883
0.76212853,0.7621447
0.7620254,0.76182073
0.76183766,0.7615373
0.761553,0.76127565
0.7612061,0.7610544
0.76081717,0.76088333
0.76039696,0.76076174
0.75996786,0.7607309
0.7595504,0.760795
0.75916094,0.760877
0.75883055,0.7609681
0.7585795,0.7610845
0.7583961,0.7612175
0.7582816,0.7613728
0.7582402,0.761558
0.75826806,0.76174176
0.7583655,0.7619279
0.75853217,0.76218355
0.75875604,0.762516
0.75903314,0.7629501
0.75938004,0.7634983
0.75980186,0.7640946
0.7603131,0.76474005
0.7609256,0.7654279
0.7616224,0.76615393
0.7624026,0.76700354
0.7632582,0.76799804
0.7641814,0.7690831
0.7652002,0.7702696
0.76633006,0.7716296
0.7675601,0.77315336
0.76889664,0.7749085
0.77037203,0.77689517
0.7719957,0.7788984
0.7738072,0.7808809
0.77582574,0.78285486
0.77798223,0.7847824
0.78024185,0.7866972
0.7825785,0.78859943
0.7849501,0.7904307
0.78733724,0.79218704
0.7897163,0.79392296
0.7920469,0.79563606
0.79430383,0.797337
0.7964845,0.7990299
0.7985767,0.80065876
0.8005795,0.80221796
0.80249196,0.80370355
0.80429316,0.80510867
0.8059767,0.8064775
0.80753136,0.8078184
0.8089506,0.809108
0.81025386,0.8103516
0.81145245,0.8115717
0.81254965,0.81276536
0.81355697,0.8139564
0.81449264,0.8151463
0.8153677,0.8162638
0.8162033,0.8172961
0.81701374,0.8182633
0.81778675,0.8191553
0.8185204,0.81995845
0.81922185,0.82067764
0.8198882,0.8212781
0.82051086,0.82176054
0.82108665,0.8222101
0.8216,0.82263875
0.8220432,0.8230522
0.822439,0.8234651
0.8227976,0.8238418
0.823129,0.8241821
0.8234446,0.8244992
0.82374316,0.8247923
0.82402736,0.8250784
0.8243018,0.8253658
0.82456833,0.8256336
0.8248331,0.825885
0.8251003,0.82615745
0.82536495,0.8264493
0.8256266,0.8267862
0.82589793,0.8271704
0.8261822,0.8275184
0.82649356,0.8278179
0.8268385,0.82806915
0.8271899,0.8282587
0.827534,0.8284151
0.82786006,0.8285396
0.8281526,0.8286178
0.8284092,0.8286509
0.8286243,0.82863414
0.82878876,0.8285622
0.828899,0.8284566
0.8289471,0.8283171
0.8289257,0.8281043
0.82883906,0.8278208
0.82868505,0.8274461
0.82845163,0.8269792
0.8281349,0.82650256
0.8277211,0.82603186
0.827204,0.8255562
0.8266122,0.8250903
0.8259607,0.82463324
0.8252596,0.8241851
0.8245266,0.8237733
0.823773,0.8234006
0.8230115,0.82302517
0.82226306,0.82264394
0.82154155,0.82226133
0.8208458,0.82187295
0.82018065,0.82149273
0.8195502,0.8211246
0.81895745,0.8207575
0.81840765,0.82039434
0.8179044,0.82005197
0.81744814,0.8197317
0.8170401,0.8194468
0.8166823,0.8192012
0.8163761,0.8189673
0.81612486,0.8187464
0.81592846,0.8185321
0.8157774,0.8183229
0.81566644,0.8181619
0.8155858,0.81805897
0.8155297,0.81799215
0.8155069,0.8179675
0.8155209,0.81801176
0.81556535,0.81812114
0.8156408,0.8183255
0.8157573,0.8186251
0.81591827,0.81893104
0.8161383,0.819229
0.8164249,0.8195202
0.81675076,0.8197892
0.8171031,0.82005876
0.81747365,0.82032907
0.817848,0.82058036
0.8182246,0.82081187
0.8185972,0.8210303
0.81895584,0.8212318
0.8192939,0.821428
0.8196082,0.82161874
0.8198951,0.82177395
0.8201543,0.82189304
0.8203852,0.821964
0.8205757,0.82198447
0.8207214,0.82200176
0.82081187,0.8220235
0.8208422,0.8220439
0.8208278,0.8220702
0.8207761,0.8220959
0.8206934,0.82211965
0.82058924,0.8221543
0.8204704,0.8221996
0.82034266,0.8222395
0.8202167,0.8222735
0.82009834,0.8222966
0.81998897,0.8223066
0.8198928,0.8223186
0.81981075,0.82233304
0.819744,0.82235014
0.819698,0.82237077
0.81967384,0.8223789
0.8196762,0.8223699
0.8197069,0.8223543
0.8197575,0.82232934
0.81982386,0.8222785
0.8199027,0.8222021
0.8199873,0.82208717
0.8200675,0.82193184
0.8201354,0.82177573
0.82017845,0.8216257
0.8201882,0.8214677
0.82017094,0.82130677
0.8201272,0.8211537
0.820054,0.8210048
0.819953,0.82088274
0.81983,0.8207867
0.8196868,0.8206588
0.81953394,0.8204915
0.81937605,0.8202746
0.8191982,0.8199982
0.818995,0.81970024
0.81875604,0.8193807
0.8184732,0.81903744
0.81815267,0.81867254
0.817794,0.8182488
0.81739974,0.81775546
0.81697166,0.817223
0.8164954,0.81664693
0.81596285,0.8159827
0.81537974,0.8152352
0.8147426,0.8143691
0.814033,0.81338376
0.81324434,0.8123988
0.81235456,0.81143564
0.8113515,0.8104844
0.81027514,0.8095661
0.80914533,0.808668
0.8079764,0.80779004
0.80679274,0.8069672
0.8056079,0.8062023
0.80443686,0.80545384
0.8033039,0.804721
0.80222565,0.80400217
0.80120164,0.8032935
0.8002384,0.8026221
0.79933697,0.8019919
0.7984982,0.8013981
0.79773206,0.8008446
0.7970426,0.8003248
0.79643446,0.79983616
0.79591024,0.7993947
0.79546237,0.7990006
0.7950872,0.79862905
0.7947851,0.7982817
0.79455084,0.7979455
0.79437286,0.79761887
0.7942425,0.7973535
0.7941473,0.79715985
0.79407656,0.79701746
0.79404235,0.79693335
0.79404706,0.7969275
0.7940854,0.7969955
0.79416,0.7971679
0.79427946,0.79744405
0.79444754,0.7977403
0.79467845,0.79804385
0.79497963,0.79835004
0.7953271,0.798644
0.7957098,0.79895836
0.79611737,0.79929274
0.79653686,0.79963344
0.7969695,0.79998046
0.79741114,0.800319
0.79785687,0.80064076
0.7983022,0.8009655
0.79873955,0.8012899
0.799161,0.8015768
0.7995692,0.8018272
0.7999612,0.8020161
0.80032116,0.802141
0.80064297,0.8022829
0.80091006,0.80245346
0.80111295,0.80265254
0.8012781,0.80289286
0.80141765,0.80314565
0.80154437,0.80340946
0.80167466,0.8036978
0.80181104,0.8040092
0.8019605,0.8043493
0.8021321,0.8047233
0.80233073,0.8051088
0.80256677,0.8055057
0.80284894,0.8059546
0.80317384,0.8064526
0.80354434,0.8070206
0.8039767,0.8076595
0.80447614,0.80828387
0.80505985,0.8088767
0.8057369,0.8094522
0.8064746,0.8099951
0.8072567,0.8105
0.80807066,0.8109671
0.8088952,0.81136465
0.8097129,0.8116894
0.8105085,0.81199706
0.811255,0.8122934
0.81193525,0.81256837
0.8125525,0.81282824
0.8131028,0.8130643
0.81358284,0.813271
0.81399393,0.81346846
0.81433284,0.81365365
0.8145986,0.8137865
0.81479627,0.8138628
0.81492656,0.8138646
0.8149841,0.8137841
0.8149659,0.81366587
0.8148642,0.8135087
0.81467396,0.813319
0.814407,0.8130995
0.81406766,0.812789
0.81366676,0.81237274
0.81321263,0.81188637
0.8126871,0.8113218
0.8120825,0.8106335
0.81140625,0.8098281
0.81065434,0.8088592
0.8098071,0.80772704
0.80885834,0.80657387
0.80778056,0.8054234
0.80655986,0.80427384
0.80524135,0.80315024
0.80384797,0.8020173
0.8024,0.80087507
0.80092794,0.7997561
0.79944026,0.7986619
0.79795164,0.7975815
0.796485,0.7965216
0.79505515,0.795464
0.7936719,0.7944092
0.79234666,0.793406
0.791077,0.7924556
0.789865,0.7915775
0.7887306,0.79077613
0.7876799,0.78997606
0.78673124,0.7891655
0.78589404,0.78835374
0.7851377,0.78752947
0.7844476,0.78670454
0.7838144,0.78588134
0.7832194,0.78504056
0.78265464,0.7841827
0.78210914,0.78333163
0.78156435,0.7824882
0.781009,0.78166157
0.7804403,0.78085554
0.7798517,0.78004485
0.7792432,0.77922964
0.77861404,0.7784083
0.7779548,0.7775796
0.77726394,0.77677405
0.77653563,0.77599984
0.775768,0.77524114
0.77497584,0.77450323
0.7741671,0.7738106
0.7733434,0.7731629
0.77251196,0.77258146
0.77168614,0.77206963
0.7708748,0.7715664
0.7700973,0.7710616
0.7693654,0.7705765
0.76866806,0.7701032
0.76800364,0.7696278
0.7673802,0.769156
0.76679707,0.7686541
0.76624906,0.76812357
0.76573557,0.7676502
0.7652415,0.7672448
0.7647612,0.766924
0.7643204,0.7667026
0.76393014,0.7665223
0.7636042,0.76638335
0.7633577,0.7662881
0.76317996,0.7662331
0.76307213,0.7662781
0.7630326,0.7664398
0.76305944,0.76667166
0.76317406,0.766981
0.7633891,0.7674349
0.763695,0.7680255
0.76409465,0.7688081
0.764615,0.7697832
0.76526326,0.7707674
0.76607114,0.77172846
0.767054,0.7726784
0.7681509,0.77358466
0.7693327,0.7744733
0.7705794,0.77534425
0.7718575,0.7761467
0.7731523,0.776877
0.7744443,0.77758586
0.7756996,0.77827215
0.7768962,0.7789434
0.77803206,0.7796038
0.7790977,0.7802064
0.7800885,0.78074616
0.78100115,0.7812219
0.7818162,0.7816278
0.7825252,0.7819959
0.7831189,0.7823327
0.7835905,0.7826177
0.78395295,0.78285414
0.7842139,0.7830647
0.7843758,0.7832467
0.78444856,0.7834202
0.78444725,0.7835866
0.78438354,0.78368235
0.78427476,0.7836958
0.78413343,0.783646
0.78394973,0.7835238
0.7837231,0.7833154
0.78346014,0.7830253
0.7831609,0.7826212
0.78282034,0.7821037
0.78243554,0.7815532
0.7819952,0.78098094
0.7814935,0.7803942
0.780952,0.7798069
0.780379,0.7791816
0.7797814,0.77851844
0.7791663,0.7778279
0.7785273,0.7771091
0.7778642,0.7763863
0.77717763,0.77566916
0.7764676,0.7749345
0.7757409,0.7741864
0.7750022,0.7734644
0.7742484,0.77276623
0.7734827,0.772122
0.77272,0.7715338
0.771967,0.7709074
0.7712397,0.7702293
0.7705469,0.7694971
0.7698622,0.7686958
0.7691735,0.7678624
0.76846826,0.7669984
0.76773024,0.76608956
0.7669587,0.7651378
0.7661479,0.76412886
0.76529163,0.763055
0.7643856,0.7619451
0.76341856,0.760798
0.76238066,0.75956386
0.7612756,0.75824684
0.7600989,0.756818
0.7588316,0.7552764
0.75746804,0.75373286
0.75598675,0.7522084
0.7543775,0.7506894
0.7526773,0.74919546
0.750906,0.7477242
0.7490799,0.7462756
0.74722505,0.7448863
0.7453598,0.7435597
0.7435017,0.7422417
0.74167985,0.7409284
0.7399135,0.739625
0.73820245,0.7383259
0.7365536,0.73705053
0.734971,0.7358043
0.733455,0.7345731
0.73201394,0.73336095
0.7306505,0.7321876
0.7293658,0.73105425
0.7281613,0.7299801
0.727036,0.72896975
0.7259889,0.7279844
0.7250235,0.72702575
0.7241389,0.7260831
0.72332096,0.72515416
0.72256213,0.7243027
0.72184825,0.72354305
0.7211694,0.7228444
0.72054005,0.7222155
0.7199667,0.7216922
0.7194418,0.7212684
0.71896935,0.72098774
0.7185637,0.7208498
0.7182299,0.72072935
0.7179908,0.7206071
0.71785676,0.7204774
0.7177921,0.7203182
0.7177793,0.72017634
0.7178019,0.72005147
0.7178379,0.7199223
0.7178876,0.719789
0.7179432,0.71963274
0.7179922,0.71944183
0.71802825,0.71924573
0.7180371,0.71904045
0.71800613,0.71876925
0.7179391,0.7184342
0.71783173,0.717999
0.71766037,0.7174602
0.71741676,0.71693814
0.7170763,0.71645105
0.7166253,0.7159953
0.7161029,0.7155902
0.7155275,0.7152005
0.7149151,0.71482414
0.7142897,0.71448565
0.7136572,0.71418345
0.7130292,0.7139116
0.7124241,0.7136757
0.71185344,0.71344614
0.7113272,0.71322125
0.71085775,0.7130617
0.7104416,0.712965
0.7100813,0.7129537
0.7098004,0.7130304
0.7096055,0.71308595
0.7095166,0.7130952
0.7095442,0.7131007
0.7096499,0.7130838
0.70981157,0.71298933
0.7100255,0.71281934
0.7102705,0.71251065
0.7105112,0.7120553
0.7107256,0.7116202
0.710867,0.7112324
0.71090496,0.7108373
0.71087503,0.7104562
0.7107872,0.71012264
0.7106297,0.709821
0.71041167,0.70964134
0.71015203,0.7095794
0.70985806,0.7094099
0.70957184,0.70910436
0.7093124,0.7086188
0.70901734,0.7079144
0.7086605,0.707145
0.7082045,0.7063104
0.7076108,0.7054035
0.7069076,0.7044336
0.7060916,0.7032448
0.7051645,0.70179224
0.7041313,0.70020354
0.7029345,0.6984597
0.70153636,0.6963736
0.69996136,0.69396526
0.69819903,0.69108933
0.69617015,0.6877428
0.6938497,0.6844225
0.69115084,0.68122053
0.68802696,0.6780738
0.6846367,0.67506933
0.6810617,0.6721981
0.6773441,0.6694578
0.67357177,0.6670152
0.66980726,0.664885
0.66610754,0.6628076
0.66258496,0.66076124
0.65931153,0.6587786
0.6562517,0.6568313
0.65341336,0.6549895
0.65081114,0.65327793
0.64843863,0.6516171
0.6463156,0.65002334
0.64445037,0.64863217
0.6428198,0.6474548
0.64141834,0.6465774
0.6402778,0.64602774
0.6394042,0.6456128
0.63883245,0.64533794
0.63858235,0.64516413
0.6385933,0.6450791
0.63884866,0.64536947
0.63931125,0.6461025
0.63995063,0.64711607
0.64084893,0.64844763
0.6420463,0.6503023
0.6435053,0.65265083
0.6452396,0.6557004
0.64734036,0.6594517
0.6498359,0.66326123
0.65283763,0.6670171
0.65640366,0.6707622
0.6603328,0.67438376
0.66452646,0.6779718
0.6689268,0.6815278
0.6734273,0.6848713
0.67797935,0.68799007
0.6825258,0.69107455
0.68695396,0.6941238
0.69119394,0.6971575
0.69526076,0.70019245
0.69913375,0.70307606
0.7028081,0.70578945
0.7062861,0.7083411
0.7095157,0.7107108
0.71247786,0.7129767
0.7151587,0.71515745
0.71754414,0.71717614
0.71966517,0.7190396
0.7215451,0.72084844
0.7231759,0.72259414
0.72457373,0.72434473
0.7257935,0.7261072
0.72686166,0.7276406
0.727828,0.72889817
0.72872955,0.7299694
0.7295144,0.7308211
0.73016375,0.7313681
0.7307022,0.73162925
0.7311223,0.7314711
0.73137736,0.7308948
0.73145175,0.7302658
0.73128176,0.72964305
0.7308323,0.7290178
0.7302103,0.72845334
0.7294679,0.7278653
0.72863543,0.7272521
0.7277657,0.7267023
0.7268725,0.7262188
0.72597736,0.7257481
0.7251289,0.72530055
0.7243546,0.7248419
0.7236495,0.7243692
0.7230226,0.723989
