time,open,high,low,close,tick_volume,spread,real_volume,EMA 9,trend,signal,magnitude
2021-01-04,79.393,79.668,78.836,79.015,611074,28,61107400000,78.8302514755365,0.1847485244635009,1,0.05637056
2021-01-05,79.012,79.825,78.925,79.671,544199,28,54419900000,78.9984011804292,0.6725988195708084,1,0.017980607
2021-01-06,79.671,80.5,79.517,80.336,773998,28,77399800000,79.26592094434336,1.0700790556566346,1,0.05188472
2021-01-07,80.346,80.672,80.151,80.597,650338,28,65033800000,79.5321367554747,1.0648632445252986,1,0.0889287
2021-01-08,80.591,80.914,80.369,80.538,707909,28,70790900000,79.73330940437977,0.8046905956202295,1,0.08694124
2021-01-11,80.529,80.636,79.982,80.218,588393,28,58839300000,79.83024752350381,0.387752476496189,1,0.06435779
2021-01-12,80.218,80.679,80.14,80.626,579249,28,57924900000,79.98939801880306,0.6366019811969466,1,0.035793807
2021-01-13,80.622,80.689,80.252,80.3,539009,28,53900900000,80.05151841504245,0.2484815849575454,1,0.059001844
2021-01-14,80.3,80.841,80.261,80.726,572288,27,57228800000,80.18641473203397,0.5395852679660322,1,0.029488329
2021-01-15,80.728,80.777,79.706,79.916,579081,24,57908100000,80.13233178562717,-0.216331785627176,1,0.0472709
2021-01-18,80.01,80.054,79.498,79.603,504996,28,50499600000,80.02646542850175,-0.4234654285017569,0,-0.007948685
2021-01-19,79.603,80.305,79.528,79.919,553350,28,55335000000,80.00497234280141,-0.085972342801412,0,-0.023830159
2021-01-20,79.915,80.332,79.854,80.164,547202,27,54720200000,80.03677787424112,0.1272221257588768,0,-0.0028193812
2021-01-21,80.16,80.503,80.097,80.308,478941,22,47894100000,80.0910222993929,0.2169777006071029,1,0.013746659
2021-01-22,80.31,80.431,79.889,79.975,566833,28,56683300000,80.06781783951433,-0.092817839514339,1,0.019797374
2021-01-25,80.016,80.326,79.749,79.992,568613,28,56861300000,80.05265427161147,-0.0606542716114688,0,-0.0015854446
2021-01-26,79.992,80.332,79.592,80.17,532577,28,53257700000,80.07612341728918,0.0938765827108198,0,-0.0017506595
2021-01-27,80.168,80.428,79.615,79.723,678108,28,67810800000,80.00549873383136,-0.2824987338313605,1,0.008161224
2021-01-28,79.723,80.223,79.188,80.01,753926,28,75392600000,80.0063989870651,0.0036010129349079,0,-0.019927623
2021-01-29,80.015,80.634,79.794,79.972,816320,28,81632000000,79.99951918965208,-0.0275191896520823,1,0.002714827
2021-02-01,79.817,80.196,79.677,79.921,691491,28,69149100000,79.98381535172166,-0.0628153517216532,0,-0.0021240127
2021-02-02,79.921,80.355,79.526,79.831,610193,28,61019300000,79.95325228137733,-0.1222522813773281,0,-0.0003035005
2021-02-03,79.827,80.112,79.791,79.996,540177,28,54017700000,79.96180182510187,0.0341981748981226,0,-0.009390963
2021-02-04,79.995,80.319,79.945,80.167,546791,28,54679100000,80.0028414600815,0.1641585399185032,1,0.007177417
2021-02-05,80.167,80.906,80.028,80.849,541108,27,54110800000,80.1720731680652,0.6769268319348072,1,0.019405415
2021-02-08,80.739,81.177,80.739,80.964,478463,27,47846300000,80.33045853445216,0.633541465547836,1,0.052986365
2021-02-09,80.967,81.146,80.632,80.901,524409,27,52440900000,80.44456682756173,0.4564331724382668,1,0.048443645
2021-02-10,80.901,81.085,80.735,80.739,527115,28,52711500000,80.5034534620494,0.2355465379506114,1,0.03105969
2021-02-11,80.74,81.359,80.661,81.135,444830,28,44483000000,80.62976276963953,0.5052372303604784,1,0.018216915
2021-02-12,81.131,81.472,81.073,81.39,427039,27,42703900000,80.78181021571163,0.6081897842883706,1,0.037443813
2021-02-15,81.444,82.039,81.422,81.952,365146,28,36514600000,81.0158481725693,0.9361518274306916,1,0.05024439
2021-02-16,81.954,82.4,81.867,82.217,544255,28,54425500000,81.25607853805545,0.960921461944551,1,0.07346626
2021-02-17,82.214,82.279,81.746,82.03,574999,28,57499900000,81.41086283044437,0.6191371695556285,1,0.07980437
2021-02-18,82.03,82.287,81.813,82.065,540538,28,54053800000,81.5416902643555,0.5233097356445029,1,0.05952544
2021-02-19,82.061,83.145,81.977,82.87,565450,28,56545000000,81.8073522114844,1.062647788515605,1,0.050516814
2021-02-22,82.911,83.422,82.911,83.126,591955,28,59195500000,82.07108176918753,1.0549182308124756,1,0.08360488
2021-02-23,83.126,83.354,82.9,83.237,569480,27,56948000000,82.30426541535003,0.932734584649964,1,0.07912335
2021-02-24,83.237,84.406,83.142,84.316,652885,28,65288500000,82.70661233228003,1.6093876677199717,1,0.06958829
2021-02-25,84.317,84.936,83.492,83.547,772330,28,77233000000,82.87468986582402,0.672310134175973,1,0.113063104
2021-02-26,83.553,83.811,81.968,82.122,858192,28,85819200000,82.72415189265922,-0.6021518926592222,1,0.059743006
2021-03-01,82.11,83.118,82.069,82.942,602645,25,60264500000,82.76772151412737,0.1742784858726196,0,-0.037537538
2021-03-02,82.942,83.623,82.613,83.359,642021,28,64202100000,82.8859772113019,0.4730227886980884,1,0.012285833
2021-03-03,83.361,83.741,83.111,83.161,646044,24,64604400000,82.94098176904153,0.2200182309584732,1,0.03341794
2021-03-04,83.171,84.025,82.993,83.375,754670,28,75467000000,83.02778541523323,0.3472145847667747,1,0.009964781
2021-03-05,83.375,83.581,82.766,83.173,857432,28,85743200000,83.05682833218658,0.1161716678134183,1,0.02019762
2021-03-08,83.327,83.732,82.915,83.233,941247,28,94124700000,83.09206266574928,0.1409373342507223,1,0.010010111
2021-03-09,83.233,83.901,83.12,83.606,932832,28,93283200000,83.19485013259943,0.4111498674005673,1,0.015784942
2021-03-10,83.606,83.911,83.468,83.805,867205,28,86720500000,83.31688010607954,0.4881198939204694,1,0.03129831
2021-03-11,83.805,84.523,83.747,84.491,842971,28,84297100000,83.55170408486363,0.9392959151363698,1,0.038815506
2021-03-12,84.487,84.764,84.198,84.602,867875,28,86787500000,83.76176326789091,0.8402367321090907,1,0.077651106
2021-03-15,84.597,84.718,84.101,84.6,804908,28,80490800000,83.92941061431273,0.6705893856872649,1,0.07266562
2021-03-16,84.6,84.654,84.179,84.377,744067,28,74406700000,84.01892849145018,0.3580715085498127,1,0.059020475
2021-03-17,84.375,84.997,84.111,84.846,795011,28,79501100000,84.18434279316016,0.6616572068398483,1,0.031231672
2021-03-18,84.855,85.437,84.341,84.481,929072,28,92907200000,84.24367423452813,0.2373257654718656,1,0.0606699
2021-03-19,84.481,84.574,84.102,84.255,835761,28,83576100000,84.2459393876225,0.0090606123774961,1,0.02611148
2021-03-22,83.815,84.366,83.815,84.272,735748,28,73574800000,84.251151510098,0.0208484899020078,0,-0.00048473148
2021-03-23,84.272,84.294,82.699,82.871,795571,28,79557100000,83.9751212080784,-1.1041212080784106,1,0.004377844
2021-03-24,82.871,83.026,82.273,82.439,756331,28,75633100000,83.66789696646273,-1.2288969664627416,0,-0.0712074
2021-03-25,82.439,83.05,82.416,82.743,793034,28,79303400000,83.4829175731702,-0.739917573170203,0,-0.08737769
2021-03-26,82.743,83.824,82.728,83.651,741000,28,74100000000,83.51653405853615,0.1344659414638442,0,-0.05406686
2021-03-29,83.719,83.92,83.324,83.75,767931,28,76793100000,83.56322724682893,0.1867727531710699,1,0.0077
2021-03-30,83.73,84.272,83.681,83.805,544183,28,54418300000,83.61158179746315,0.1934182025368613,1,0.017979981
2021-03-31,83.809,84.465,83.674,84.069,723791,28,72379100000,83.70306543797052,0.36593456202948,1,0.024084544
2021-04-01,84.055,84.261,83.418,84.21,748430,28,74843000000,83.80445235037642,0.4055476496235712,1,0.03717216
2021-04-02,84.21,84.47,83.961,84.185,452371,27,45237100000,83.88056188030114,0.3044381196988581,1,0.030886177
2021-04-05,84.101,84.372,84.064,84.233,562009,28,56200900000,83.95104950424093,0.2819504957590766,1,0.029450975
2021-04-06,84.23,84.449,83.776,84.037,679430,28,67943000000,83.96823960339275,0.06876039660726,1,0.026617652
2021-04-07,84.045,84.233,83.476,83.597,707714,28,70771400000,83.89399168271419,-0.2969916827141929,1,0.0020093424
2021-04-08,83.597,83.77,83.275,83.577,635724,28,63572400000,83.83059334617136,-0.2535933461713568,0,-0.024587443
2021-04-09,83.575,83.772,83.024,83.496,664771,28,66477100000,83.76367467693709,-0.2676746769370908,0,-0.018486792
2021-04-12,83.618,83.672,83.141,83.368,445296,28,44529600000,83.68453974154968,-0.3165397415496898,0,-0.020572307
2021-04-13,83.367,83.451,83.019,83.302,644651,28,64465100000,83.60803179323975,-0.3060317932397396,0,-0.019550811
2021-04-14,83.308,84.274,83.093,84.117,659895,28,65989500000,83.7098254345918,0.4071745654081979,0,-0.020345395
2021-04-15,84.117,84.4,83.87,84.285,636757,28,63675700000,83.82486034767345,0.4601396523265464,1,0.026852164
2021-04-16,84.291,84.365,84.064,84.099,589734,28,58973400000,83.87968827813876,0.2193117218612457,1,0.035127655
2021-04-19,84.036,84.135,83.738,83.867,702261,28,70226100000,83.87715062251101,-0.0101506225110057,1,0.019869242
2021-04-20,83.87,84.706,83.344,83.473,724506,28,72450600000,83.79632049800881,-0.3233204980088118,1,0.00017112556
2021-04-21,83.469,83.91,83.208,83.759,676975,28,67697500000,83.78885639840705,-0.0298563984070483,0,-0.020000778
2021-04-22,83.758,83.849,83.115,83.158,694982,28,69498200000,83.66268511872565,-0.5046851187256465,0,-0.0013993648
2021-04-23,83.159,83.731,83.036,83.451,644804,28,64480400000,83.62034809498053,-0.1693480949805348,0,-0.032865867
2021-04-26,83.491,84.484,83.47,84.28,632876,28,63287600000,83.75227847598444,0.5277215240155613,0,-0.008854325
2021-04-27,84.276,84.498,84.065,84.364,599487,28,59948700000,83.87462278078755,0.4893772192124572,1,0.043805856
2021-04-28,84.364,84.739,84.122,84.587,670010,28,67001000000,84.01709822463005,0.5699017753699565,1,0.044325896
2021-04-29,84.587,84.991,84.348,84.58,609809,28,60980900000,84.12967857970403,0.450321420295964,1,0.05221598
2021-04-30,84.579,84.84,84.126,84.181,646369,28,64636900000,84.13994286376324,0.0410571362367591,1,0.046153177
2021-05-03,84.356,84.739,84.294,84.587,583228,28,58322800000,84.2293542910106,0.3576457089894092,1,0.011913124
2021-05-04,84.588,84.726,83.921,84.201,716010,28,71601000000,84.22368343280847,-0.0226834328084777,1,0.03463059
2021-05-05,84.201,84.677,84.195,84.558,657824,28,65782400000,84.29054674624679,0.2674532537532172,1,4.9436094e-05
2021-05-06,84.562,84.918,84.229,84.897,582740,28,58274000000,84.41183739699743,0.4851626030025784,1,0.022875754
2021-05-07,84.88,85.302,84.711,85.155,748097,28,74809700000,84.56046991759796,0.594530082402045,1,0.03998008
2021-05-10,85.279,85.789,85.12,85.178,757799,28,75779900000,84.68397593407838,0.4940240659216215,1,0.048735984
2021-05-11,85.152,85.431,84.809,85.158,876201,28,87620100000,84.7787807472627,0.3792192527373004,1,0.037448797
2021-05-12,85.157,85.248,84.582,84.68,870949,28,87094900000,84.75902459781017,-0.0790245978101609,1,0.029530121
2021-05-13,84.677,84.826,84.28,84.569,859338,28,85933800000,84.72101967824813,-0.1520196782481235,0,-0.0009369407
2021-05-14,84.569,85.156,84.512,84.957,723226,28,72322600000,84.7682157425985,0.1887842574014939,0,-0.015053378
2021-05-17,84.892,85.127,84.444,84.755,763429,28,76342900000,84.7655725940788,-0.010572594078809,1,0.013652317
2021-05-18,84.757,85.136,84.676,84.804,724530,28,72453000000,84.77325807526306,0.0307419247369438,1,0.0018836121
2021-05-19,84.804,84.944,84.029,84.36,915027,28,91502700000,84.69060646021045,-0.330606460210447,1,0.004562791
2021-05-20,84.365,84.634,84.227,84.542,784732,28,78473200000,84.66088516816836,-0.1188851681683615,0,-0.01826015
2021-05-21,84.539,84.64,84.098,84.128,768716,28,76871600000,84.5543081345347,-0.4263081345346933,0,-0.0014230512
2021-05-24,84.14,84.368,83.962,84.288,707955,28,70795500000,84.50104650762776,-0.2130465076277659,0,-0.026808882
2021-05-25,84.286,84.654,84.23,84.266,748443,28,74844300000,84.45403720610221,-0.1880372061022086,0,-0.017289195
2021-05-26,84.262,84.787,84.247,84.481,759621,28,75962100000,84.45942976488178,0.0215702351182187,0,-0.012638015
2021-05-27,84.482,85.054,84.32,84.983,711602,28,71160200000,84.56414381190542,0.4188561880945798,0,-0.0032715544
2021-05-28,84.983,85.138,84.536,84.638,731531,28,73153100000,84.57891504952434,0.0590849504756647,1,0.028519062
2021-05-31,84.651,84.894,84.58,84.699,516118,28,51611800000,84.60293203961947,0.0960679603805232,1,0.0036177454
2021-06-01,84.699,85.038,84.651,84.876,658003,28,65800300000,84.65754563169558,0.2184543683044211,1,0.0070968503
2021-06-02,84.872,85.181,84.75,84.92,654979,28,65497900000,84.71003650535647,0.2099634946435316,1,0.017382119
2021-06-03,84.917,84.977,84.299,84.396,634728,28,63472800000,84.64722920428518,-0.2512292042851811,1,0.01860924
2021-06-04,84.396,84.83,84.31,84.632,632077,28,63207700000,84.64418336342816,-0.01218336342815,0,-0.02012995
2021-06-07,84.713,84.866,84.552,84.698,579726,28,57972600000,84.65494669074252,0.0430533092574734,0,-0.0011417944
2021-06-08,84.69,84.842,84.625,84.723,604707,28,60470700000,84.66855735259401,0.0544426474059918,1,0.0061582318
2021-06-09,84.731,84.822,84.647,84.718,537218,24,53721800000,84.67844588207521,0.0395541179247942,1,0.0063444255
2021-06-10,84.697,85.004,84.613,84.737,651403,28,65140300000,84.69015670566017,0.0468432943398227,1,0.0039460543
2021-06-11,84.733,85.04,84.376,84.452,593304,28,59330400000,84.64252536452814,-0.1905253645281419,1,0.0031476365
2021-06-14,84.425,84.924,84.425,84.868,602348,28,60234800000,84.68762029162252,0.1803797083774725,0,-0.015367601
2021-06-15,84.862,84.916,84.506,84.58,622882,28,62288200000,84.66609623329802,-0.0860962332980221,1,0.007292919
2021-06-16,84.581,84.744,84.054,84.226,675818,28,67581800000,84.57807698663842,-0.3520769866384228,0,-0.0074044704
2021-06-17,84.224,84.596,83.056,83.162,864165,28,86416500000,84.29486158931074,-1.1328615893107354,0,-0.025470192
2021-06-18,83.162,83.368,82.329,82.329,818866,28,81886600000,83.9016892714486,-1.5726892714486098,0,-0.076220736
2021-06-21,82.458,83.229,82.119,83.035,626510,28,62651000000,83.72835141715889,-0.6933514171588939,0,-0.111642875
2021-06-22,83.035,83.644,82.776,83.551,714121,28,71412100000,83.69288113372711,-0.1418811337271108,0,-0.050855584
2021-06-23,83.549,84.133,83.313,84.032,695874,28,69587400000,83.76070490698169,0.2712950930183098,0,-0.011910235
2021-06-24,84.028,84.154,83.862,84.045,700077,28,70007700000,83.81756392558535,0.2274360744146548,1,0.024503728
2021-06-25,84.044,84.242,83.992,84.024,632650,28,63265000000,83.85885114046827,0.1651488595317261,1,0.029307704
2021-06-28,83.883,84.146,83.581,83.697,639048,28,63904800000,83.82648091237462,-0.1294809123746176,1,0.022132963
2021-06-29,83.703,83.715,82.94,82.941,624775,28,62477500000,83.6493847298997,-0.7083847298996915,0,-0.007040312
2021-06-30,82.951,83.337,82.802,83.293,682265,28,68226500000,83.57810778391976,-0.2851077839197558,0,-0.04720082
2021-07-01,83.291,83.64,83.098,83.298,655315,28,65531500000,83.52208622713582,-0.2240862271358139,0,-0.019365774
2021-07-02,83.298,83.626,83.028,83.513,662610,28,66261000000,83.52026898170865,-0.0072689817086484,0,-0.016229002
2021-07-05,83.442,83.602,83.404,83.506,391406,26,39140600000,83.51741518536693,-0.0114151853669284,1,0.0025553103
2021-07-06,83.506,84.18,82.739,82.901,732367,28,73236700000,83.39413214829355,-0.4931321482935544,1,0.0004223919
2021-07-07,82.901,83.332,82.636,82.809,761304,28,76130400000,83.27710571863484,-0.4681057186348454,0,-0.025156377
2021-07-08,82.809,82.911,81.306,81.414,704450,28,70445000000,82.90448457490788,-1.4904845749078817,0,-0.029787224
2021-07-09,81.412,82.532,81.329,82.33,554662,28,55466200000,82.7895876599263,-0.4595876599262993,0,-0.10238872
2021-07-12,82.318,82.662,82.004,82.44,717536,28,71753600000,82.71967012794104,-0.2796701279410456,0,-0.035191003
2021-07-13,82.44,82.804,82.069,82.344,725994,28,72599400000,82.64453610235284,-0.3005361023528508,0,-0.01978872
2021-07-14,82.339,82.516,82.11,82.232,801723,28,80172300000,82.56202888188227,-0.3300288818822707,0,-0.020902503
2021-07-15,82.229,82.321,81.415,81.484,817653,28,81765300000,82.34642310550582,-0.862423105505826,0,-0.022398386
2021-07-16,81.482,81.93,81.334,81.354,833796,28,83379600000,82.14793848440465,-0.7939384844046486,0,-0.05492046
2021-07-19,81.405,81.551,80.002,80.314,895503,28,89550300000,81.78115078752371,-1.467150787523721,0,-0.05300137
2021-07-20,80.314,80.588,79.828,80.485,793487,28,79348700000,81.52192063001897,-1.0369206300189688,0,-0.097470984
2021-07-21,80.485,81.18,80.076,81.127,731332,28,73133200000,81.44293650401517,-0.3159365040151698,0,-0.071427196
2021-07-22,81.123,81.46,80.843,81.213,710259,28,71025900000,81.39694920321213,-0.183949203212137,0,-0.022118406
2021-07-23,81.213,81.643,80.988,81.357,433325,27,43332500000,81.38895936256971,-0.0319593625697081,0,-0.015222389
2021-07-26,81.327,81.503,80.758,81.449,601433,28,60143300000,81.40096749005576,0.0480325099442353,0,-0.004863509
2021-07-27,81.445,81.497,80.623,80.789,779738,28,77973800000,81.27857399204461,-0.4895739920446118,1,0.006498626
2021-07-28,80.789,81.13,80.623,81.048,783306,28,78330600000,81.23245919363569,-0.1844591936356892,0,-0.029261995
2021-07-29,81.052,81.344,80.739,80.915,690476,28,69047600000,81.16896735490856,-0.2539673549085535,0,-0.011833179
2021-07-30,80.915,81.067,80.44,80.485,763825,24,76382500000,81.03217388392684,-0.5471738839268454,0,-0.016209425
2021-08-02,80.379,80.748,80.324,80.423,709292,28,70929200000,80.91033910714148,-0.4873391071414801,0,-0.036582638
2021-08-03,80.417,80.904,80.144,80.613,752941,28,75294100000,80.8508712857132,-0.2378712857131972,0,-0.034613058
2021-08-04,80.618,81.023,80.509,80.781,709748,28,70974800000,80.83689702857056,-0.0558970285705555,0,-0.020915436
2021-08-05,80.777,81.34,80.72,81.227,665393,28,66539300000,80.91491762285645,0.3120823771435539,0,-0.006295713
2021-08-06,81.236,81.383,81.003,81.027,634579,28,63457900000,80.93733409828516,0.089665901714838,1,0.027772991
2021-08-09,81.044,81.111,80.794,80.801,633554,28,63355400000,80.91006727862813,-0.1090672786281317,1,0.009319232
2021-08-10,80.801,81.308,80.695,81.236,383237,28,38323700000,80.97525382290252,0.2607461770974879,0,-0.0029070901
2021-08-11,81.236,81.569,81.095,81.387,397118,28,39711800000,81.05760305832202,0.3293969416779845,1,0.022240257
2021-08-12,81.383,81.446,80.913,80.928,335598,27,33559800000,81.03168244665761,-0.1036824466576149,1,0.024293965
2021-08-13,80.928,81.095,80.709,80.73,507714,28,50771400000,80.9713459573261,-0.2413459573260894,0,-0.0029902083
2021-08-16,80.665,80.862,79.878,80.077,560881,28,56088100000,80.79247676586088,-0.7154767658608847,0,-0.01357671
2021-08-17,80.077,80.234,79.322,79.443,647266,28,64726600000,80.52258141268871,-1.0795814126887109,0,-0.046015374
2021-08-18,79.443,79.758,79.238,79.365,653683,28,65368300000,80.29106513015097,-0.926065130150974,0,-0.07649577
2021-08-19,79.361,79.547,78.231,78.386,800179,28,80017900000,79.91005210412078,-1.5240521041207842,0,-0.070788756
2021-08-20,78.381,78.618,77.88,78.234,647438,26,64743800000,79.57484168329663,-1.340841683296631,0,-0.1080552
2021-08-23,78.073,79.175,78.058,79.038,610497,26,61049700000,79.4674733466373,-0.4294733466373088,0,-0.10397646
2021-08-24,79.034,79.733,78.985,79.505,575225,26,57522500000,79.47497867730985,0.0300213226901462,0,-0.042661015
2021-08-25,79.493,80.087,79.382,79.95,602815,26,60281500000,79.56998294184788,0.38001705815212,0,-0.004880591
2021-08-26,79.95,80.083,79.58,79.622,557543,26,55754300000,79.58038635347832,0.0416136465216823,1,0.024028014
2021-08-27,79.622,80.339,79.406,80.233,524156,26,52415600000,79.71090908278266,0.5220909172173407,1,0.008580422
2021-08-30,80.213,80.372,79.969,80.152,414318,26,41431800000,79.79912726622614,0.3528727337738644,1,0.044807494
2021-08-31,80.152,80.63,80.01,80.438,547585,26,54758500000,79.92690181298092,0.5110981870190869,1,0.035733737
2021-09-01,80.438,81.217,80.366,80.874,613276,26,61327600000,80.11632145038473,0.7576785496152638,1,0.049073998
2021-09-02,80.852,81.51,80.85,81.322,252410,22,25241000000,80.3574571603078,0.9645428396922,1,0.061595283
2021-09-03,81.323,82.014,81.239,81.81,307210,24,30721000000,80.64796572824625,1.162034271753754,1,0.078037255
2021-09-06,81.767,81.833,81.531,81.698,203519,23,19047100000,80.857972582597,0.8400274174029931,1,0.09029332
2021-09-07,81.694,81.975,81.272,81.412,296334,26,28914900000,80.96877806607762,0.4432219339223877,1,0.07073773
2021-09-08,81.408,81.634,80.957,81.168,332700,26,33270000000,81.00862245286211,0.1593775471378933,1,0.039083544
2021-09-09,81.165,81.235,80.764,80.775,333917,26,33391700000,80.9618979622897,-0.1868979622896915,1,0.016834222
2021-09-10,80.773,81.415,80.738,80.791,311699,26,31169900000,80.92771836983175,-0.1367183698317546,0,-0.009672821
2021-09-13,80.797,81.116,80.655,81.008,295687,26,29568700000,80.9437746958654,0.0642253041345952,0,-0.016517526
2021-09-14,81.003,81.136,80.158,80.271,344145,26,34414500000,80.80921975669233,-0.5382197566923281,1,0.004114666
2021-09-15,80.268,80.337,79.817,80.183,705355,26,70535500000,80.68397580535387,-0.5009758053538604,0,-0.032427724
2021-09-16,80.189,80.356,79.735,79.896,760154,26,76015400000,80.52638064428311,-0.6303806442831075,0,-0.031839885
2021-09-17,79.89,80.494,79.823,79.938,743063,26,74306300000,80.40870451542649,-0.4707045154264904,0,-0.03622279
2021-09-20,79.683,79.953,79.039,79.326,837522,26,83752200000,80.1921636123412,-0.8661636123412109,0,-0.028552815
2021-09-21,79.324,79.818,78.846,78.965,713173,26,71317300000,79.94673088987297,-0.9817308898729636,0,-0.059897587
2021-09-22,78.964,79.933,78.831,79.505,679611,26,67961100000,79.85838471189838,-0.3533847118983857,0,-0.07047362
2021-09-23,79.51,80.585,79.34,80.437,726835,26,72683500000,79.97410776951871,0.4628922304812874,0,-0.029445805
2021-09-24,80.437,80.755,79.993,80.353,558989,26,55898900000,80.04988621561498,0.3031137843850189,1,0.03322724
2021-09-27,80.105,80.95,80.105,80.86,495792,26,49579200000,80.21190897249198,0.6480910275080163,1,0.028087908
2021-09-28,80.846,81.299,80.472,80.645,627607,26,62760700000,80.29852717799359,0.3464728220064046,1,0.05282356
2021-09-29,80.645,80.917,80.174,80.324,608541,26,60854100000,80.30362174239488,0.0203782576051168,1,0.03189956
2021-09-30,80.322,80.893,80.274,80.392,848162,26,84567800000,80.32129739391591,0.0707026060840831,1,0.009017513
2021-10-01,80.39,80.797,79.887,80.577,811821,26,81182100000,80.37243791513274,0.2045620848672626,1,0.009989496
2021-10-04,80.419,81.166,80.419,80.724,881488,26,88148800000,80.4427503321062,0.2812496678938032,1,0.015979027
2021-10-05,80.724,81.335,80.539,81.243,799397,26,79939700000,80.60280026568496,0.6401997343150327,1,0.026714807
2021-10-06,81.241,81.397,80.56,80.989,944527,26,94452700000,80.68004021254798,0.3089597874520251,1,0.052361995
2021-10-07,80.977,81.658,80.959,81.576,790867,26,79086700000,80.8592321700384,0.7167678299615972,1,0.031757627
2021-10-08,81.564,82.062,81.532,81.955,875866,26,87586600000,81.07838573603073,0.8766142639692731,1,0.05874161
2021-10-11,81.928,83.547,81.841,83.25,780586,26,78058600000,81.5127085888246,1.7372914111754056,1,0.064924054
2021-10-12,83.249,83.789,82.998,83.463,664140,26,66414000000,81.90276687105968,1.560233128940311,1,0.11934802
2021-10-13,83.453,83.698,83.105,83.548,651894,26,65189400000,82.23181349684776,1.3161865031522382,1,0.10988391
2021-10-14,83.547,84.389,83.442,84.285,532565,26,53256500000,82.64245079747822,1.6425492025217778,1,0.098325156
2021-10-15,84.282,84.913,84.226,84.702,746836,26,74683600000,83.05436063798257,1.6476393620174292,1,0.1210252
2021-10-18,84.626,85.005,84.264,84.71,763210,26,76321000000,83.38548851038607,1.3245114896139256,1,0.11984552
2021-10-19,84.704,85.526,84.647,85.436,687482,26,68748200000,83.79559080830887,1.640409191691134,1,0.10100823
2021-10-20,85.432,85.959,85.34,85.849,716268,26,71626800000,84.20627264664711,1.642727353352896,1,0.117488325
2021-10-21,85.849,86.242,84.876,85.086,724751,26,72475100000,84.38221811731769,0.703781882682307,1,0.11364444
2021-10-22,85.059,85.535,84.595,84.68,776988,26,77698800000,84.44177449385417,0.238225506145838,1,0.06050577
2021-10-25,84.715,85.293,84.67,85.152,690723,26,69072300000,84.58381959508334,0.5681804049166601,1,0.016419746
2021-10-26,85.152,85.91,85.106,85.591,640144,26,64014400000,84.78525567606668,0.8057443239333111,1,0.042386882
2021-10-27,85.591,86.047,85.035,85.514,772211,26,77221100000,84.93100454085335,0.5829954591466446,1,0.062169544
2021-10-28,85.514,85.695,85.101,85.656,797592,26,79759200000,85.07600363268268,0.579996367317321,1,0.03867174
2021-10-29,85.654,85.862,85.312,85.538,803969,26,80396900000,85.16840290614616,0.3695970938538409,1,0.04101386
2021-11-01,85.785,86.049,85.595,85.731,747121,26,74712100000,85.28092232491693,0.4500776750830653,1,0.02570256
2021-11-02,85.731,85.899,84.483,84.641,701574,26,70157400000,85.15293785993354,-0.5119378599335391,1,0.036002625
2021-11-03,84.641,84.969,84.485,84.901,599796,26,59979600000,85.10255028794684,-0.2015502879468442,0,-0.03645359
2021-11-04,84.901,85.195,83.882,84.16,634858,26,63485800000,84.91404023035747,-0.7540402303574751,0,-0.01826325
2021-11-05,84.164,84.334,83.805,83.929,626298,26,62629800000,84.71703218428598,-0.7880321842859814,0,-0.049112786
2021-11-08,83.763,84.161,83.761,84.015,541588,26,54158800000,84.57662574742879,-0.561625747428792,0,-0.05495363
2021-11-09,84.006,84.057,83.105,83.238,669537,26,66953700000,84.30890059794304,-1.0709005979430373,0,-0.041974336
2021-11-10,83.238,83.944,82.983,83.444,695821,26,69582100000,84.13592047835444,-0.691920478354433,0,-0.076654464
2021-11-11,83.443,83.65,83.102,83.151,569611,26,56961100000,83.93893638268355,-0.7879363826835544,0,-0.047585804
2021-11-12,83.147,83.545,83.09,83.457,559042,26,55904200000,83.84254910614685,-0.3855491061468541,0,-0.053810548
2021-11-15,83.402,83.917,83.402,83.81,648330,26,64833000000,83.83603928491748,-0.0260392849174735,0,-0.027564708
2021-11-16,83.805,84.151,83.683,83.84,703633,26,70363300000,83.83683142793399,0.0031685720660163,1,0.00092080573
2021-11-17,83.842,83.902,82.808,82.815,742682,26,74268200000,83.6324651423472,-0.8174651423472028,1,0.0057667135
2021-11-18,82.842,83.247,82.663,83.111,694764,26,69476400000,83.52817211387777,-0.4171721138777684,0,-0.050251294
2021-11-19,83.107,83.347,82.146,82.362,786890,26,78689000000,83.29493769110223,-0.9329376911022392,0,-0.026798712
2021-11-22,82.384,83.198,82.33,82.968,632405,26,63240500000,83.22955015288179,-0.2615501528817816,0,-0.06720978
2021-11-23,82.962,83.237,82.638,83.183,689124,26,68912400000,83.22024012230543,-0.0372401223054197,0,-0.023595465
2021-11-24,83.179,83.224,82.727,83.029,669048,26,66904800000,83.18199209784434,-0.152992097844347,0,-0.004302562
2021-11-25,83.026,83.185,82.781,82.89,430358,26,43035800000,83.12359367827548,-0.2335936782754828,0,-0.010921133
2021-11-26,82.89,82.917,80.441,80.677,860595,26,86059500000,82.6342749426204,-1.957274942620387,0,-0.011185962
2021-11-29,81.09,81.396,80.635,81.071,767110,26,76711000000,82.32161995409632,-1.2506199540963223,0,-0.13540608
2021-11-30,81.018,81.38,80.104,80.612,997366,26,99736600000,81.97969596327705,-1.3676959632770576,0,-0.09305992
2021-12-01,80.596,81.465,80.023,80.107,920443,26,92044300000,81.60515677062165,-1.498156770621648,0,-0.10524155
2021-12-02,80.104,80.549,79.847,80.02,937072,26,93707200000,81.28812541649732,-1.2681254164973268,0,-0.11588066
2021-12-03,79.98,80.296,78.775,78.887,924139,26,92413900000,80.80790033319786,-1.920900333197864,0,-0.098403014
2021-12-06,78.927,80.041,78.927,79.972,758488,26,75848800000,80.64072026655829,-0.6687202665582959,0,-0.14191441
2021-12-07,79.964,80.917,79.843,80.808,693916,26,69391600000,80.67417621324664,0.1338237867533678,0,-0.046666037
2021-12-08,80.811,81.706,80.663,81.467,761941,26,76194100000,80.83274097059731,0.6342590294026849,1,0.013780677
2021-12-09,81.467,81.657,80.91,80.96,643883,26,64388300000,80.85819277647786,0.1018072235221296,1,0.052328628
2021-12-10,80.925,81.546,80.82,81.278,653256,26,65325600000,80.94215422118229,0.3358457788177134,1,0.013857309
2021-12-13,81.079,81.479,80.691,80.963,571522,26,57152200000,80.94632337694584,0.0166766230541526,1,0.027832394
2021-12-14,80.907,81.14,80.466,80.638,613506,26,61350600000,80.88465870155667,-0.2466587015566688,1,0.0069692833
2021-12-15,80.539,81.848,80.539,81.596,552166,26,55216600000,81.02692696124535,0.5690730387546523,0,-0.008929295
2021-12-16,81.559,82.424,81.41,81.587,603339,26,60333900000,81.13894156899629,0.4480584310037159,1,0.05010574
2021-12-17,81.588,81.736,80.925,80.95,615338,26,61533800000,81.10115325519703,-0.1511532551970305,1,0.047568943
2021-12-20,80.865,81.086,80.259,80.715,602955,26,60295500000,81.02392260415763,-0.3089226041576296,0,-0.002494247
2021-12-21,80.714,81.655,80.611,81.602,446972,26,44697200000,81.13953808332612,0.4624619166738881,0,-0.018823808
2021-12-22,81.542,82.464,81.251,82.27,542095,26,54209500000,81.36563046666089,0.9043695333391072,1,0.03840061
2021-12-23,82.258,82.974,82.035,82.814,460940,26,46094000000,81.6553043733287,1.158695626671289,1,0.0663554
2021-12-24,82.809,82.859,82.52,82.539,390942,26,39094200000,81.83204349866297,0.7069565013370323,1,0.08538605
2021-12-27,82.497,83.214,82.497,83.101,412897,26,41289700000,82.08583479893038,1.015165201069621,1,0.06058594
2021-12-28,83.092,83.428,82.86,82.974,431888,26,43188800000,82.26346783914431,0.710532160855692,1,0.0769012
2021-12-29,82.975,83.487,82.786,83.243,455228,26,45522800000,82.45937427131545,0.783625728684541,1,0.06363199
2021-12-30,83.242,83.748,83.14,83.268,479111,26,47911100000,82.62109941705236,0.6469005829476373,1,0.06764573
2021-12-31,83.182,83.735,83.161,83.685,361086,26,36108600000,82.83387953364189,0.8511204663581111,1,0.05429901
