Predicted,Actual
-0.012720937,-0.014096479
-0.012094511,-0.010294306
-0.009975764,-0.008544782
-0.007870448,-0.009874406
-0.011071372,-0.0071856612
-0.008427979,-0.0076348847
-0.009046447,-0.0033118275
-0.0027720411,0.015110832
0.019427355,0.023808999
0.027050126,0.029521022
0.031280342,0.03351111
0.033739008,0.02910199
0.026368655,0.029468969
0.028333265,0.030707497
0.030997204,0.031999644
0.029874777,0.038956963
0.03860137,0.04209042
0.04078923,0.037274066
0.033385325,0.036548786
0.032554783,0.04460704
0.042920426,0.04256567
0.03890391,0.044997964
0.040385984,0.038430527
0.032769438,0.0033794974
-0.009319311,-0.0133508975
-0.02258491,-0.019814748
-0.02351503,-0.027249053
-0.029564753,-0.028598977
-0.029853838,-0.030813513
-0.031702105,-0.036724206
-0.03684723,-0.038268466
-0.03767116,-0.030429011
-0.027458137,-0.027954552
-0.024785984,-0.02725582
-0.02751716,-0.026662407
-0.027133735,-0.029459424
-0.027009573,-0.029697657
-0.026973428,-0.029637622
-0.028543219,-0.028608868
-0.026106752,-0.024265684
-0.022441888,-0.02201419
-0.02141198,-0.01950208
-0.017968312,-0.017739715
-0.016733566,-0.019601328
-0.019274093,-0.0187329
-0.019129861,-0.016329234
-0.015293087,-0.013364431
-0.012820868,-0.010295174
-0.009834199,-0.0070482395
-0.006079058,0.002232755
0.003738697,0.0065190275
0.0074362243,0.004341623
0.0036979753,0.0040662587
0.0035129886,0.0073459866
0.0067854133,-0.11681571
-0.07992976,0.008325811
0.026473517,0.007635405
0.016635269,0.00030451393
-0.000607546,-0.0010275394
-0.0009050823,-0.008669017
-0.0129877,-0.008099203
-0.0081088245,0.011628962
0.017359087,0.014531822
0.014641265,0.03155875
0.033597592,0.03011235
0.028565895,-0.024516582
-0.039335214,-0.037123807
-0.043955147,-0.054300126
-0.05647225,-0.049484644
-0.04866675,0.03290364
0.046456832,0.063078284
0.06467085,0.07769634
0.07483278,0.08380744
0.07911367,0.04486731
0.036047094,0.032724924
0.02647114,0.028577635
0.0243709,0.026099708
0.020915613,0.04218776
0.04231809,0.044448797
0.043057323,0.046047885
0.044149388,0.04252559
0.040449414,0.018587323
0.010386303,0.007864961
0.0014148405,0.0035205628
-0.0012780651,-0.00080769934
-0.003974404,0.0012602193
-0.0011099193,0.00087467505
-0.0004984275,-0.0023344334
-0.0048097284,-0.0030368108
-0.005042534,-0.0006916197
-0.0013854498,-0.0004858342
-0.00050332356,0.003239126
0.0030305402,0.003637857
0.0024393823,-0.0050502466
-0.008837227,-0.0053476463
-0.0066490234,-0.009023329
-0.010547015,-0.00615951
-0.0064872494,0.018496055
0.024804829,0.028316673
0.032878567,0.031266727
0.031746775,0.03345541
0.032669898,0.026767556
0.024002947,0.023371402
0.021061588,0.024650533
0.023947073,0.021985732
0.018999523,0.012819603
0.009157482,0.008219101
0.005217545,0.0016638086
-0.00054837693,-0.0017149948
-0.003880929,0.0047457325
0.0052224784,0.0030631847
0.002981353,0.0035658495
0.0029302915,-0.0009310665
-0.0029024638,-0.024232022
-0.030821553,-0.035028297
-0.038906414,-0.03702924
-0.03748177,-0.040367965
-0.040826842,-0.042487416
-0.042264607,-0.041928533
-0.041551,-0.042790193
-0.041407943,-0.039671138
-0.03729088,-0.024635438
-0.019767731,-0.014864445
-0.0104628345,-0.014584222
-0.013117684,-0.008105103
-0.0068456978,0.011637637
0.017757518,0.020150494
0.024494348,0.02800383
0.031437386,0.030646248
0.032536425,0.015997132
0.012081813,0.0116869155
0.007798702,0.010035079
0.008489233,0.009398116
0.00819841,0.016994653
0.017419722,0.01843949
0.01810607,0.019416017
0.019320292,0.018202472
0.017747387,0.008075432
0.0061085387,0.0035483248
0.0010815294,0.0021027946
0.00016675143,0.00031023985
-0.0018713076,0.00038103282
-0.0010918457,5.8994152e-05
-0.0007526069,-0.0014521237
-0.0021797202,0.02094171
0.025413109,-0.0055640163
-0.009784551,-0.007569991
-0.010654724,-0.013419609
-0.017617675,-0.016004246
-0.017986866,-0.02247417
-0.023719957,-0.025426133
-0.027439803,-0.01338612
-0.011579402,-0.012119134
-0.010580335,-0.023055956
-0.024605358,-0.028492268
-0.030104,-0.033755068
-0.03485342,-0.03588389
-0.0346978,-0.04432838
-0.043085348,-0.04479513
-0.04201171,-0.02663291
-0.021132203,-0.02242333
-0.018071568,-0.012358755
-0.007324328,-0.012488889
-0.009817469,-0.044290207
-0.049112998,-0.051387724
-0.05298967,-0.062152594
-0.06038756,-0.05961411
-0.056070287,-0.00891367
0.0036616484,0.009223909
0.01731155,0.015214939
0.017598448,0.017653132
0.018053595,-0.005615376
-0.011558935,-0.016207429
-0.020546505,-0.014702384
-0.016153106,-0.0192694
-0.020403609,-0.03557625
-0.039920937,-0.043567877
-0.0460033,-0.040765654
-0.039427068,-0.04287695
-0.041172285,-0.04873611
-0.04799224,-0.04473249
-0.043096296,-0.06376435
-0.06248348,-0.06350582
-0.05960826,0.017989747
0.035572734,0.042796787
0.05144383,-0.0068998868
-0.01522119,-0.019538343
-0.026417468,-0.0095443865
-0.0088620335,-0.009218183
-0.0071103093,-0.016697254
-0.017596545,-0.018645622
-0.020818878,-0.013541588
-0.013608861,-0.0117275175
-0.011993273,-0.011927229
-0.012265214,-0.011174013
-0.010816877,-0.009043283
-0.008893401,-0.007065591
-0.0078500705,-0.009092734
-0.010667726,-0.007857327
-0.008691694,0.0010034211
0.0020706712,0.0030352492
0.003108561,0.0076230858
0.0075557856,0.005759044
0.003784894,-0.008660862
-0.013931535,-0.012346435
-0.016447373,-0.03463859
-0.040905226,-0.03698378
-0.039777964,0.0055447565
0.013721934,0.020352116
0.02634583,0.02487558
0.026309071,0.027973987
0.027220586,0.013234297
0.008167468,0.00939239
0.00600814,0.00908857
0.006010932,0.009470818
0.006598783,0.017759148
0.017394343,0.020836562
0.019821938,0.021642178
0.020231294,0.022476252
0.021268371,0.019233828
0.016393337,0.017597781
0.0143392915,0.02210615
0.020592397,0.021971159
0.01960001,0.012653552
0.008156944,0.012278072
0.009412032,0.005293511
0.001994,0.0076170126
0.005589332,0.038527
0.042384166,0.048373297
0.048447654,0.053593587
0.051684886,0.05334581
0.05096892,0.029413791
0.022422113,0.019127812
0.012904828,0.016182097
0.013214627,0.025788948
0.023957318,-0.023052659
-0.03418442,-0.019470846
-0.024533302,0.007977918
0.0120088365,0.020196129
0.022753514,0.022243746
0.022155965,0.025835795
0.024778757,0.02842026
0.027462881,0.028653113
0.028883928,0.02665564
0.024904007,0.024129303
0.02187683,0.01593276
0.012187777,0.006572296
0.0027977894,0.015968503
0.016499408,0.009056991
0.0075646597,-0.039921343
-0.051143575,-0.054811813
-0.06004103,-0.069639474
-0.06981061,-0.068758555
-0.06489447,-0.009928369
0.004153238,0.013351071
0.02333681,0.018865116
0.02301381,0.02568588
0.028976372,0.017642722
0.017825915,0.015620784
0.016819507,0.020554604
0.0228895,0.020210182
0.019080948,0.011212359
0.0074889758,0.007956056
0.00539746,0.004786161
0.0035812345,0.0036637103
0.0032831447,0.010022759
0.010286838,0.010621724
0.009328717,0.012832964
0.011328503,0.011578644
0.009471239,-0.002207249
-0.006210872,-0.0070648966
-0.010364671,-0.008304121
-0.010116343,-0.008429397
-0.008697005,-0.0018668179
-0.0009843996,0.0018586628
0.0034165592,0.0032059853
0.00461883,0.0061227256
0.0071343295,0.01174348
0.013415249,0.016138025
0.017394021,0.01760663
0.01803969,0.02041111
0.021136388,0.029477123
0.030585987,0.03423795
0.03359892,0.02918406
0.025245305,0.029457342
0.027158286,0.040367965
0.040047865,0.038515896
0.036085773,0.045738168
0.04321905,0.037888475
0.03435673,-0.00860395
-0.022347704,-0.026742917
-0.03675777,-0.053484272
-0.059659194,-0.061218232
-0.062315326,-0.015621479
-0.0052880887,0.00039682243
0.0069604996,-0.0030831385
-0.0008116532,6.350547e-05
0.0019285105,0.0036388983
0.0042850566,0.0040950617
0.004187801,0.008151777
0.0084225135,0.0070072906
0.0070333346,-0.009348491
-0.012609582,-0.016115468
-0.018846234,-0.016566772
-0.017243315,-0.018228326
-0.017727671,-0.01855956
-0.018795997,-0.017706402
-0.01906764,-0.018839782
-0.020658217,-0.01700281
-0.017800266,-0.0066491617
-0.003128183,-0.0010393382
0.002535817,-0.0005731108
0.0003999297,0.0022763067
0.0029016703,0.0089388285
0.010412336,0.011476792
0.012538263,0.014875202
0.015595886,0.015199496
0.015046886,0.0061345245
0.0029291746,0.0028032633
0.0007732695,0.0017462269
0.0014624187,0.00081325177
0.0012478208,0.0031855109
0.0031357289,0.003571749
0.0025214849,0.003261162
0.0021688722,0.01560968
0.016359288,-0.0081512565
-0.01340887,-0.0055478797
-0.007630306,0.008694524
0.010600908,0.015037957
0.015492055,0.019943494
0.020022284,0.022858499
0.022629589,0.017324675
0.015770536,0.017429996
0.018433936,0.017574878
0.017465739,0.01925517
0.019224726,0.03017603
0.031713504,0.03497781
0.03496835,0.032035388
0.02923705,0.03213186
0.029522976,0.03805678
0.037053283,0.03653924
0.03518947,0.03675596
0.03439534,0.031450823
0.027567329,0.006242449
-0.0022686764,-0.008007241
-0.014628667,-0.0074525233
-0.00970693,-0.0145720765
-0.017403726,-0.036274463
-0.04118542,-0.043257464
-0.045354232,-0.05312753
-0.052623093,-0.052533947
-0.048912678,-0.018916301
-0.009912442,-0.005549268
0.00051931327,-6.5240594e-05
0.0027903938,0.0046268767
0.0063981637,-0.0030414956
-0.003238257,-0.0033460096
-0.0025238877,-0.001440672
-3.989181e-05,0.0008352878
0.001375581,0.008923734
0.011019657,0.013060264
0.014595029,0.014231298
0.014659833,0.01598568
0.016173806,0.017346883
0.01787822,0.017581992
0.017048461,0.01986472
0.019258985,0.019214917
0.018528825,0.012337586
0.009621385,0.010013564
0.0074128183,0.004685697
0.0024294576,0.0035825067
0.0022315306,0.013666864
0.014178848,0.013922967
0.013380276,0.020463336
0.021125393,0.017692868
0.016906254,-0.013075187
-0.02176671,-0.022667635
-0.028395452,-0.03170606
-0.03539513,-0.03212058
-0.032644626,0.00014904699
0.0067718667,0.011312302
0.0149814375,0.015012103
0.015558489,0.016806394
0.017145252,0.0027668257
-0.00093527423,-0.002329228
-0.0052788854,-0.0019929614
-0.0030245678,-0.0033208502
-0.00392698,-0.003684185
-0.0042522484,-0.0038970844
-0.0042208037,-0.006005258
-0.006386606,-0.0066295546
-0.006136525,-0.0013318798
0.00026879407,0.00023267989
0.0008083464,-0.0051238155
-0.006083478,-0.006817642
-0.0076770745,-0.0015855546
-0.0005906079,-0.0046162927
-0.00429835,-0.0017687835
-0.0010363437,-0.008083067
-0.009249142,-0.0418914
-0.048717584,-0.056883376
-0.059398986,-0.06624575
-0.06499034,-0.072664835
-0.068779185,-0.060787577
-0.05469835,-0.058744468
-0.05367156,-0.065808326
-0.061363433,-0.06432254
-0.058311455,-0.072507456
-0.06690108,-0.067604005
-0.060299557,-0.03582021
-0.024748653,-0.008524481
0.0016859658,-0.016926117
-0.015014621,-0.0129249245
-0.011340344,0.00074957276
0.004226688,0.0074478383
0.011670591,-0.001697817
-0.0034076038,0.00012007045
-0.0013928768,0.023381986
0.027267085,0.030485922
0.033540603,0.035274167
0.035772946,0.035022747
0.03350964,0.013019316
0.0060422933,0.003829935
-0.0024416375,0.00442647
0.001215913,0.0016586033
-0.0010870823,-0.0026349565
-0.0054429513,-0.0030876498
-0.0059095225,-0.007969936
-0.011205675,-0.006642048
-0.008398556,0.011746777
0.01449878,0.018421099
0.019907426,0.022613153
0.022761041,0.024324851
0.023079861,0.012944532
0.008539695,0.009510204
0.0066185175,0.011921157
0.009697078,0.012266273
0.009269545,0.013498209
0.01119307,0.014212906
0.011902184,0.01411383
0.0122969095,0.014432225
0.013273854,0.01558747
0.014483986,0.015841838
0.014350092,0.016363937
0.014591274,0.01605925
0.014317724,0.013924356
0.012813406,0.013109889
0.012291764,0.010904375
0.00909206,0.010190199
0.008416538,0.0138912145
0.0134929,0.0137650715
0.013045388,0.014373232
0.014039963,0.012372809
0.011735971,0.0031820405
0.0004927773,-0.0009066013
-0.0030528947,-0.0070806863
-0.009623863,-0.009320036
-0.011343352,-0.0020295724
-0.0016253398,-0.0033782828
-0.004730119,0.0048364797
0.005357708,0.0020712153
0.00106214,-0.033242684
-0.040985353,-0.042739354
-0.046490263,-0.051806238
-0.051664844,-0.049605582
-0.04645721,-0.004660191
0.0052663824,0.013950903
0.02083815,0.01818998
0.021187108,0.024163831
0.027233468,0.021322569
0.021394065,0.02073367
0.020931192,0.025616303
0.025527606,0.025313871
0.023523182,0.013303702
0.00998034,0.008514418
0.005633694,0.0084582
0.0068209223,0.007990064
0.007806117,0.0061555193
0.0061436165,0.0056165904
0.004229219,0.014851431
0.016434133,0.016654396
0.017486492,0.008337609
0.0057575046,0.005591778
0.003467581,0.002928192
0.0013097936,0.0014309552
0.0002877444,0.0059655234
0.005748753,0.0047823437
0.0038377894,0.005622316
0.0043349206,0.0021475607
-7.1054325e-05,-0.01584687
-0.021539442,-0.024289107
-0.028374301,-0.027508626
-0.029577134,-0.030888297
-0.03187929,-0.030592807
-0.030261328,-0.030958744
-0.031018313,-0.03269057
-0.032791156,-0.032481834
-0.031838365,-0.028636282
-0.027313923,-0.026338633
-0.024816526,-0.024844866
-0.023675494,-0.022801066
-0.021932455,-0.020309951
-0.019322086,-0.017572623
-0.01632942,-0.016013617
-0.015317571,0.08122228
0.082911216,0.012151234
0.005321288,0.00865878
0.003731881,-0.013820422
-0.020117143,-0.024262387
-0.029758548,-0.026749857
-0.027404815,-0.030201362
-0.03126357,-0.03374188
-0.035045408,-0.035375148
-0.035671443,-0.03020622
-0.02848191,-0.025068004
-0.022020226,-0.03596839
-0.037217375,-0.034817655
-0.03467983,0.0069545433
0.015407934,0.020743212
0.026931437,-0.0001762884
-0.0028809283,-0.005742387
-0.0080230115,0.002495279
0.0032834376,0.0020009428
0.0027738009,-0.012862634
-0.0161273,-0.01956194
-0.023949083,-0.016281866
-0.01697432,-0.017833585
-0.018020324,-0.027497523
-0.030399099,-0.028109847
-0.030117635,-0.032503348
-0.033943553,-0.029023042
-0.028508333,3.4702443e-05
0.0068903696,0.012874085
0.01896226,0.015735824
0.017624477,0.019957375
0.020751739,0.020789886
0.021107344,0.02083257
0.020194216,0.022394875
0.021616956,0.021033844
0.01990207,0.0106435865
0.0064374157,0.0038514507
-0.0007213109,0.0076017436
0.0057515106,0.00400952
0.0019986867,-0.017113335
-0.02332061,-0.023363072
-0.027673181,-0.028647387
-0.031565282,-0.027987868
-0.028399631,-0.0011660021
0.0037976184,0.011454409
0.015314274,0.0042352597
0.0023244843,0.007409492
0.006520711,0.030732658
0.03535802,0.033804864
0.03537105,0.039885428
0.038960148,0.034245413
0.031961218,-0.020042222
-0.035192974,-0.047211286
-0.056224126,-0.031677257
-0.0322418,-0.033555526
-0.033293627,-0.09956148
-0.102243334,-0.11491246
-0.110246204,-0.047260042
-0.031619348,-0.022475038
-0.010318208,-0.02498281
-0.020951742,-0.013305437
-0.010292534,-0.008593366
-0.00690062,-0.016406273
-0.016562425,0.06938701
0.075879805,-0.036232647
-0.05054456,0.030946078
0.037435967,0.027055066
0.029934857,-0.0016183484
-0.009311226,-0.01354471
-0.018820534,-0.010052256
-0.012478393,-0.011647701
-0.013006524,-0.014845358
-0.016620265,-0.013086985
-0.014044526,-0.016524782
-0.017854005,-0.012421739
-0.013389608,0.014126323
0.019643342,0.026260726
0.029115701,0.029364167
0.030167859,0.033816837
0.033193577,0.035025
0.034994718,0.035286833
0.0339531,0.039229725
0.0377273,0.038264822
0.03631723,0.025585243
0.020136945,0.020208795
0.015353046,0.016978517
0.013245745,0.014510653
0.012075082,0.017665973
0.016144197,0.01700385
0.01471294,0.01588435
0.012818514,-0.074551776
-0.08415694,-0.008743454
-0.0016256425,-0.0084587205
-0.003949213,0.003955211
0.006167932,0.005213001
0.0064125424,0.016420849
0.018103022,0.014944781
0.017288864,-0.024147868
-0.03335392,-0.034191623
-0.04079812,-0.04322415
-0.045610573,-0.040549457
-0.037552323,0.008628936
0.01944253,0.028975151
0.03556771,0.031681594
0.033592086,0.037533816
0.03848922,0.037012238
0.036526687,0.035542935
0.03232482,0.041491628
0.040191334,0.038798895
0.03577517,0.014454088
0.0068981084,0.0040169815
-0.0003204627,6.576113e-05
-0.0038392835,-0.0036796737
-0.0072862064,-0.0007086239
-0.0009622835,-0.0006692366
-0.0022250826,-0.0016929586
-0.0039846976,-0.002904768
-0.0038108719,-0.0013179987
-0.0016017508,0.00092239096
-0.00045317126,-0.01416866
-0.019048184,-0.0145203695
-0.017225457,0.016697254
0.023745574,0.025576742
0.029979587,0.030644687
0.033323508,0.029899279
0.029731657,0.0019370904
-0.0055528446,-0.009356993
-0.013778947,-0.009904077
-0.012218483,-0.0128546525
-0.01548365,-0.013657841
-0.013444904,-0.012861072
-0.0119594345,-0.01572229
-0.017399162,-0.013921579
-0.0145157715,0.0019702313
0.005966825,0.009617955
0.012063872,0.007600703
0.008454437,0.010139533
0.010982382,0.019294038
0.020816682,0.02011076
0.022361457,0.027252348
0.030430049,0.024884254
0.024154194,-0.006500982
-0.014664304,-0.01806748
-0.023737399,-0.021228872
-0.023888005,-0.022998003
-0.02499205,-0.01064428
-0.0073425523,-0.004168284
-0.0020072148,-0.0070121493
-0.00889723,-0.0036069718
-0.0035566178,0.013804805
0.018113157,0.020833438
0.023428861,0.022058954
0.022635728,0.02290257
0.022319438,0.018156664
0.015602873,0.013915333
0.013904553,0.015023729
0.014494908,0.011227976
0.007794803,-0.007889253
-0.015488732,-0.017803568
-0.0220332,-0.01371857
-0.013036317,-0.016697774
-0.017016629,-0.032649446
-0.036638685,-0.03355136
-0.036015343,-0.043030683
-0.045056365,-0.037672278
-0.035766486,0.014960918
0.027034936,0.036469664
0.04382282,0.04132124
0.044071022,0.046691444
0.04739645,0.03850427
0.03622225,0.03339954
0.03187091,0.03806164
0.03798709,0.03357583
0.030027682,0.0071856612
-0.00032293747,-0.005248224
-0.011296823,-0.0081021525
-0.010749935,-0.012989818
-0.014647875,-0.016490255
-0.01911328,-0.01755614
-0.019872107,-0.022517895
-0.024936648,-0.109464
-0.090453155,0.0033930314
0.02286413,0.009460233
0.020667978,-0.014476991
-0.018161708,-0.018041627
-0.019664135,0.034023315
0.043165274,0.04929916
0.05475984,0.015951673
0.011584408,0.0075132526
0.0026368785,0.020053849
0.02031072,0.02068335
0.020158662,0.013785025
0.010427403,0.016656825
0.014919568,-0.0063158446
-0.012999888,-0.004568403
-0.0071415543,0.06126456
0.06432451,0.07157726
0.06839296,0.09726539
0.087445386,0.08709741
0.07417469,-0.050790496
-0.07318933,-0.10399437
-0.084035225,-0.10260454
-0.09401265,-0.11058714
-0.09882961,-0.09040229
-0.07605321,-0.087804645
-0.07914566,-0.06642482
-0.055799246,-0.0689895
-0.058970354,-0.11005637
-0.095681205,-0.11919092
-0.10130774,-0.18677965
-0.13277037,-0.25154307
-0.1404031,0.2941339
-0.02296705,-0.13623971
-0.10910474,0.1468911
0.06392028,0.31319407
0.07105476,-0.14890714
-0.06821476,0.18526454
0.08510422,0.18404806
0.10015165,0.27156952
0.089883186,0.04785068
0.012478599,-0.02777063
-0.060067832,0.027326612
0.028350685,0.017855968
0.012812696,-0.14478692
-0.1504528,-0.1878844
-0.15907714,-0.10235208
-0.08088876,-0.064570665
-0.05838198,0.0026014687
0.024252702,0.03282348
0.04567246,0.07291851
0.07451321,0.08174212
0.074933544,-0.0031924513
-0.023512566,-0.032791726
-0.036884356,-0.030610852
-0.02786182,-0.0338852
-0.034192685,-0.031114211
-0.031735335,-0.028998923
-0.031334605,-0.0076433867
-0.0058006067,-0.0004046305
0.0050499323,-0.013700698
-0.01627621,-0.017228201
-0.01869585,-0.011457532
-0.011285234,-0.011182862
-0.012032665,-0.018609706
-0.019260556,-0.020086467
-0.020482251,-0.022165317
-0.019103086,-0.020796306
-0.016941436,-0.010136236
-0.0079159485,-0.006452399
0.00018536978,0.002746872
0.005426579,0.006869522
0.0082696695,-0.015433565
-0.017371032,-0.019554133
-0.01997249,0.004674072
0.013648998,0.0130384015
0.018609596,0.0087568145
0.0128942365,0.010143003
0.01168695,0.013397573
0.012623952,0.01551685
0.01612945,0.018830935
0.020208905,0.019338803
0.019667147,0.021896547
0.027159646,0.020827191
0.017246358,0.009354911
0.010207324,0.0043627913
0.007022963,0.002718069
0.0015700643,0.00078080496
-0.006561305,0.0013060265
-0.0036538576,0.0009878051
0.0040104105,-0.00048791635
-0.0012419402,0.06302796
0.050550938,0.05514357
0.054269794,0.07162254
0.0657273,0.017904205
0.0066878553,-0.0028306784
-0.011606243,-0.084985934
-0.0891331,-0.111825496
-0.11478133,-0.039971836
-0.020903515,-0.017919127
-0.0031778214,-0.029168619
-0.027688725,-0.025400452
-0.024627414,-0.012117399
-0.008529157,-0.004404434
-0.004253629,-0.0027997931
-0.0032974763,0.0013606828
0.0067764446,0.009876489
0.011524041,0.013366514
0.015570182,0.017316345
0.021990843,0.017836189
0.015652753,0.0075718993
0.006082746,0.0032712258
0.0010930732,0.0030919877
0.0026609667,0.0014252294
0.0014436779,-0.0009216969
0.0014007995,-0.002244207
0.00073498377,-0.0036985865
-0.006435766,-0.004610393
-0.004797393,-0.002137844
-0.0008266942,-0.0011312997
0.00014657747,-0.005984783
-0.0031690444,-0.0068917316
-0.005247179,0.0017687835
3.4079578e-05,0.0015937097
0.008180053,0.002666362
0.004619014,-0.0005524629
-0.0029321508,-0.026049042
-0.03141291,-0.03941868
-0.042218458,-0.02632215
-0.02297272,-0.02725339
-0.026223252,-0.066719264
-0.07110674,-0.07132029
-0.06928655,-0.06114588
-0.057143148,-0.051286392
-0.044655398,0.025447996
0.035027713,0.057934687
0.0582364,-0.0003706221
-0.012305242,-0.009678685
-0.01673589,0.030615363
0.038966574,0.04213189
0.047305215,0.034594864
0.03703392,0.028621014
0.02153377,0.03615231
0.036651127,0.030609116
0.028844556,-0.020862935
-0.027927395,-0.03736499
-0.042719875,-0.032687444
-0.03788177,-0.034142
-0.035578858,0.0054606027
0.013266358,-0.0067324475
-0.005595191,0.0011861295
0.002933899,0.0034259986
0.007051497,0.0068886084
0.0060155243,-0.0011458746
-0.005345943,0.03720605
0.042826336,-0.04276417
-0.05324752,0.021067332
0.03195461,0.022576194
0.02739018,-0.0007273632
-0.0070902477,-0.008659821
-0.0117293475,-0.010935434
-0.013000292,-0.012280848
-0.012085715,-0.0041002673
-0.0031409836,-0.005037927
-0.005776536,0.005036192
0.009036132,0.00241529
0.0026362445,-0.035834957
-0.04445746,-0.04540884
-0.04784451,-0.0588373
-0.057818167,-0.056350693
-0.05309117,0.0011149895
0.014599554,0.021773875
0.031055551,0.03231162
0.03762788,0.036445025
0.03923515,0.0064468463
0.0005094447,-0.002973826
-0.005763889,-0.0047136326
-0.0060934233,-0.0059242276
-0.008052225,0.0052831
0.006124799,0.008482839
0.008196633,0.009312053
0.00875461,0.048941027
0.052475765,0.0011569795
-0.0069956686,-0.00016119285
-0.006536498,-0.0065785423
-0.0116245095,-0.0096070245
-0.012220942,-0.011504901
-0.013494917,-0.012933774
-0.015403911,-0.011776274
-0.012853004,-0.012122431
-0.013429141,-0.012392936
-0.014257369,-0.013040311
-0.0132384915,-0.015877062
-0.016523061,-0.016948152
-0.017749267,-0.017202348
-0.01807218,-0.017046187
-0.017043108,-0.015904997
-0.015987864,-0.015046285
-0.016035756,-0.012789238
-0.011153222,-0.011009176
-0.00878911,-0.012746207
-0.012706118,-0.011454756
-0.011523177,-0.0056863423
-0.0057599377,0.007794169
0.00990374,-0.012858296
-0.015978873,-0.037267823
-0.042387944,0.14828232
0.057140645,0.009632704
-0.0074446034,0.008340212
-0.003126618,-0.02435834
-0.036238305,-0.026993642
-0.031495783,-0.03377589
-0.033505805,-0.021108802
-0.02170656,-0.016363764
-0.01737321,-0.0185842
-0.019016143,-0.016071742
-0.015090293,-0.004068688
-0.00018625798,0.0018123351
0.004532436,0.0023193378
0.0021668528,0.004426123
0.0022246405,0.00778237
0.010136165,0.008020775
0.007712512,0.010882686
0.011263033,0.009484871
0.009039292,-0.0043560243
-0.00926322,-0.010362149
-0.014734786,-0.011920983
-0.0151013285,-0.013998618
-0.014906975,-0.013746679
-0.013702508,-0.013788843
-0.014006569,-0.0150606865
-0.016300797,-0.014843796
-0.015352983,-0.01095157
-0.010422516,-0.008895624
-0.009186789,-0.009372956
-0.010080596,-0.008192206
-0.008154441,-0.0049131718
-0.003944791,-0.004033118
-0.0032119958,0.00061839755
0.0012452522,0.0012119828
0.0018440116,-0.009676255
-0.011587114,-0.01142977
-0.013002717,-0.013207576
-0.016074082,-0.009341377
-0.008653265,0.0046105664
0.008154306,0.010044275
0.013520249,0.037619356
0.04047489,0.043354455
0.0432552,0.0038250769
-0.0064278618,-0.009410088
-0.018459547,-0.0072356327
-0.010013499,-0.008848776
-0.011211835,-0.0062554623
-0.006974703,-0.003989046
-0.0036150615,-0.004798654
-0.0059903087,-0.0022754392
-0.004408211,0.009424143
0.012353652,0.01597076
0.017501151,0.015584693
0.014975623,0.018678416
0.01825583,0.028312508
0.029934185,0.031059034
0.031941324,0.03529863
0.03457566,0.03452112
0.033199877,0.018046312
0.012801915,0.011281591
0.0066034426,0.009021421
0.0065787793,0.0062839184
0.0036536683,0.009099849
0.0070004333,0.009525821
0.0078925295,0.002931489
-1.6323873e-05,-0.020744773
-0.027275765,0.0035936115
0.005457753,-0.00048219046
9.824348e-05,0.04442607
0.048677903,0.052905608
0.053843435,0.0062329057
-0.005653967,-0.0055787647
-0.015061959,-0.016323162
-0.020432089,-0.01649251
-0.01641442,0.026687393
0.034901597,0.043645784
0.046217583,0.039333485
0.038984995,0.044037748
0.043324426,0.046715908
0.04536981,0.051097784
0.048980374,0.06315775
0.060666446,0.06237816
0.054904032,0.079046436
0.07156228,0.0777156
0.068413086,0.0064463257
-0.013390062,-0.018807683
-0.03265758,0.01932284
0.022424772,0.024521787
0.024595536,-0.0018191021
-0.00834044,-0.00886231
-0.013969472,-0.004822078
-0.0065713245,-0.0034011866
-0.0019448698,0.0056653474
0.0073785814,0.013580974
0.014705733,0.004076149
0.0024142188,0.008542701
0.0075361687,0.047798276
0.053865705,0.0574813
0.05823329,0.06892321
0.065611064,0.06497859
0.060263734,0.007997525
-0.007780223,-0.015425063
-0.025478464,-0.023736818
-0.028654762,-0.031838797
-0.034492068,-0.022672668
-0.022738317,-0.021699438
-0.02194132,-0.026437363
-0.028291559,-0.027635116
-0.027462395,-0.02725443
-0.025603473,-0.027903194
-0.026875114,-0.023133516
-0.020763015,-0.02238429
-0.021675276,-0.032774027
-0.0340321,-0.03247368
-0.031097429,-0.03496566
-0.033868343,-0.030130396
-0.027718784,0.0011250532
0.009258099,0.015994182
0.023173349,0.016939303
0.019614123,0.022441376
0.024344973,0.030766318
0.03216808,0.031732436
0.032023564,0.04123223
0.04040309,0.03878779
0.03585799,0.0037843015
-0.00620531,-0.008793426
-0.014837308,-0.016606508
-0.019531028,-0.018479398
-0.020948548,0.0005864713
0.00319514,0.0028013547
0.0035425383,0.024295354
0.028376084,-0.0014477859
-0.006203872,-0.0001021987
-0.0018858607,-0.0052185534
-0.005232218,-0.005007042
-0.0051255394,-0.005780386
-0.0066860733,-0.0010029007
-0.0004438312,0.003421661
0.004616317,-0.0071814973
-0.008351161,-0.0080606835
-0.008754894,0.03048575
0.037447713,0.04073286
0.044040818,0.009726227
0.0036386137,0.0025058633
-0.0022242097,0.00359205
0.002345357,-0.0064107557
-0.008613412,0.035726514
0.042697713,-0.03191011
-0.044844948,0.010819007
0.01320387,0.01043728
0.012193694,0.007373575
0.0054106745,0.005879808
0.0051777726,0.0051711844
0.0025731204,0.004294254
0.002816609,0.0040794457
0.003925392,0.095959716
0.07043564,-0.0035295854
-0.018009355,-0.0024472163
-0.009075291,0.0077594663
0.009325295,0.012362571
0.011111849,0.010370131
0.011313026,0.011211839
0.009090067,0.016554974
0.016575951,0.016094126
0.017164892,0.01872648
0.016299311,0.015695568
0.014529963,-0.005679922
-0.0127033,-0.015503316
-0.0209169,-0.01678991
-0.020130401,-0.020225104
-0.021807654,-0.023677824
-0.025543656,-0.024070656
-0.025241744,-0.027857386
-0.0292674,-0.026432503
-0.027183952,-0.009904425
-0.005103466,-0.0025346663
0.0008832687,-0.0016881004
2.6195077e-05,0.00086981675
0.0023161592,0.003466427
0.00415828,0.004109463
0.0062084203,0.006362693
0.008407727,0.0059348117
0.005373207,-0.0038743543
-0.00679612,-0.008658259
-0.00989352,-0.0047203996
-0.00378835,-0.0061220317
-0.006453402,-0.01636307
-0.019373028,-0.016737683
-0.018013468,-0.026719145
-0.027798561,-0.023979908
-0.023505405,0.014886307
0.022175033,0.026630828
0.03021017,0.03807049
0.040634334,0.038197152
0.038485684,-0.0033187682
-0.014971484,-0.01725579
-0.025985675,-0.023512987
-0.027390564,-0.025486168
-0.026639093,-0.002451901
0.0016868882,0.0053615277
0.007812203,0.0071287495
0.007660143,0.00858816
0.009131384,0.0011260943
-0.0011675938,-0.001016261
-0.0019351203,-0.00073170103
-0.0018715763,-0.0007880925
-0.00048140765,0.0020151709
0.0020486051,0.003415241
0.002930396,0.0014800592
0.001581893,0.0016726578
0.002458178,0.0064225546
0.00674225,0.0067737433
0.005421327,0.008579658
0.0087064635,0.007315622
0.0057302234,-0.0057286792
-0.010102941,-0.011443998
-0.014675795,-0.009181572
-0.010455587,-0.010043234
-0.010850278,-0.01570754
-0.017306305,-0.014878325
-0.015890734,-0.016837278
-0.018338231,-0.012901848
-0.011265368,0.011138617
0.017287752,0.023277879
0.027219988,0.023042943
0.02329335,0.028339576
0.028181778,0.03973534
0.040459756,0.041967224
0.04182383,0.054912105
0.053886462,0.053876065
0.04953112,0.015032577
0.0034009223,0.004263195
-0.00273371,-0.0061546518
-0.012210263,-0.005295072
-0.007646174,0.03836338
0.043235924,0.05336524
0.053366035,0.059726026
0.05442495,0.061674397
0.057543065,0.039668363
0.033178188,0.032078072
0.026464785,0.027645355
0.024327079,0.025032781
0.021775346,0.034741137
0.034628842,0.034978326
0.033433527,0.035139
0.032579888,-0.024409352
-0.03591006,-0.00041452068
-0.001451227,-0.0009489383
-0.00050589035,-0.0056891185
-0.0078547355,-0.0076591764
-0.0091393925,-0.007172648
-0.009270463,-0.007292892
-0.0075255125,-0.008296833
-0.009130721,-0.0077674477
-0.009312521,-0.0067609036
-0.007287296,-0.005192006
-0.004915126,-0.00013690114
0.0025084727,0.0040251366
0.0057950374,0.0015158027
0.0018936172,0.0042911307
0.0042736595,0.019152625
0.022591908,0.023284646
0.025021764,0.03090322
0.031978823,0.029641265
0.02938092,0.0070440755
0.000977582,0.0009414773
-0.0014818977,-0.019551877
-0.026172265,-0.025361413
-0.029263621,0.028720437
0.038793337,0.03664821
0.040524624,0.012358581
0.0069170073,0.0062162485
0.0028310653,-0.07097361
-0.08045064,-0.025599992
-0.021221004,-0.07012948
-0.070570655,-0.0665369
-0.06458616,-0.009211416
0.0043643825,0.0124168815
0.020502042,0.021036448
0.026198028,0.026201732
0.030308,0.0024447872
-0.0026885374,-0.0042088856
-0.0066500288,-0.0018029654
-0.0017788224,-0.0010900038
-0.0012180646,0.0050459085
0.0063505797,0.009164915
0.010755865,0.008823964
0.009097477,0.011719015
0.012630164,0.022253463
0.02344948,0.026983405
0.027538966,0.029352715
0.029008446,0.03054405
0.029018205,0.027889313
0.025808122,0.026863854
0.025525166,0.02346076
0.021800395,0.021765893
0.019224288,0.02496754
0.023238052,0.022292675
0.019778393,0.024299866
0.023171853,0.019474665
0.01714783,-0.0057130633
-0.013516762,-0.016599566
-0.02264095,-0.023444276
-0.027073286,-0.027204806
-0.028700864,-0.018249147
-0.016080601,-0.016765444
-0.016492309,-0.01326605
-0.012951254,-0.013148583
-0.012642075,-0.0258731
-0.02830453,-0.027145639
-0.028021613,-0.030876499
-0.030925013,-0.027206715
-0.025867127,0.0018513753
0.007988162,0.014515164
0.019492723,0.018730644
0.021232411,0.023161452
0.02570753,0.020334937
0.020697948,0.019699883
0.019127322,0.022956533
0.023317512,0.022476079
0.021603078,0.015117599
0.012537157,0.012128157
0.008815993,0.00885641
0.0059330435,0.0071867025
0.006470321,0.011782173
0.0116484985,0.01132306
0.010312009,0.011460135
0.010905915,0.009065493
0.007589079,-0.003395634
-0.007096795,-0.009433859
-0.012929659,-0.01015567
-0.011943351,-0.012395365
-0.01447797,-0.015558841
-0.017472275,-0.016003726
-0.016694026,-0.018700453
-0.019704202,0.01897755
0.026891712,-0.0017802353
-0.004282893,0.0010178227
-0.0011266246,0.0059957146
0.0062760226,0.009151207
0.009427454,0.017813632
0.020263234,0.02171193
0.023360979,0.013130537
0.011088812,0.01610228
0.016065212,0.014883184
0.014810356,0.02218076
0.02325257,0.058961358
0.059640344,0.07595462
0.07049679,0.080521464
0.07146109,0.08614586
0.07688526,0.087983534
0.076831184,0.088074625
0.07633542,0.08760875
0.0738881,0.084851116
0.07005073,0.07321365
0.059931405,0.06269586
0.052222688,0.07005243
0.060897414,0.06252409
0.05383356,0.018118318
0.0036327003,0.0039529554
-0.0062428587,-0.009892105
-0.01813572,-0.010000377
-0.013329164,0.03955801
0.045084123,0.05825898
0.056443665,0.062666886
0.05947264,0.067382425
0.064918615,0.05781583
0.05422625,0.055168036
0.054976594,0.0568138
0.057099387,0.056079842
0.05457422,0.054389834
0.052218776,0.05290266
0.05108168,0.050260764
0.048594642,0.04893964
0.04851113,0.04689584
0.04606581,0.04310616
0.040611554,0.05347681
0.051437445,0.055641204
0.051591594,0.015279486
0.0059546214,0.0041649872
-0.0015745579,0.051810227
0.053734835,0.06290893
0.05964642,0.03540638
0.030295596,0.02406493
0.01853853,0.03193232
0.033242743,0.026158875
0.02753079,-0.004158914
-0.012189963,-0.017769385
-0.025397483,-0.025870671
-0.031223902,-0.031553198
-0.034992214,-0.023487134
-0.022744857,-0.022983601
-0.023322878,-0.024980206
-0.026525343,-0.02588247
-0.02797901,-0.034495965
-0.03607613,-0.038790043
-0.039324544,-0.02538744
-0.023078933,-0.023052486
-0.02145655,-0.046982076
-0.04734751,-0.044190437
-0.04123954,-0.051383387
-0.046869446,-0.037407152
-0.030211637,0.0492419
0.06501081,0.08924722
0.0879034,0.095451675
0.09207689,0.10909251
0.10104707,0.12082731
0.10515818,0.12140164
0.10625564,0.13464184
0.10484692,0.1282205
0.10367186,0.06661672
0.04692648,0.038866043
0.023896957,0.036679614
0.029517105,0.026300462
0.020596547,0.013022786
0.006581824,0.0150115825
0.010483813,-0.013425508
-0.024195712,0.041249234
0.04652314,0.025115892
0.025570124,0.029525185
0.030180557,0.004104605
-0.0005323989,-0.0032165695
-0.007965297,0.010219696
0.01504416,0.012611736
0.01729013,0.008139284
0.00967645,0.015476422
0.017287528,-0.03090027
-0.042354908,-0.025211152
-0.027041161,0.023222007
0.038043074,0.04435007
0.053015906,0.043867704
0.047851257,0.049308702
0.051256392,0.05623548
0.05473948,0.053551596
0.051772084,0.06304341
0.060019717,0.05519146
0.050916325,0.0018043536
-0.011053757,-0.020751715
-0.029268464,-0.037991542
-0.042952534,-0.047082365
-0.04673935,-0.024599347
-0.017483117,-0.024210507
-0.020851703,-0.01457919
-0.010938983,-0.01954459
-0.018128598,-0.07481066
-0.079857744,-0.09062421
-0.08717223,-0.10411652
-0.09570704,-0.10163374
-0.09098053,-0.035774227
-0.018165743,-0.0074183415
0.007661596,-0.003470071
0.0046333456,0.003907842
0.011360348,0.015675094
0.02452212,0.022187354
0.031945158,-0.007954667
-0.012253826,-0.011955859
-0.01611619,0.023787137
0.035423137,0.036918715
0.04510331,0.037952155
0.039810877,0.042010255
0.043736942,0.04034003
0.038656484,0.041192666
0.038606625,0.047239743
0.04630868,0.04965885
0.047705863,0.045005772
0.042110216,0.04678809
0.044854786,0.0459528
0.04434641,0.049529407
0.04859151,0.07128593
0.068023294,0.08123026
0.07469958,0.07682739
0.068490334,0.07842075
0.06978196,0.08974208
0.07928891,0.08794154
0.07601096,0.09346097
0.07876962,0.085665934
0.07121964,0.03721351
0.02172258,0.015171735
0.003949753,0.0078337295
0.0029025292,-0.00087554264
-0.0055944435,-0.0007794169
-0.00325503,-0.0019697107
-0.0039874916,-0.00889788
-0.01157379,-0.00919823
-0.0107362475,0.004329477
0.0066986443,0.00944184
0.01284306,0.013684909
0.015458208,0.015945598
0.017267125,0.009361331
0.00900914,0.00999465
0.0109878825,0.008265254
0.009225002,0.011636597
0.012254671,0.030753132
0.034819268,0.038260136
0.043481562,0.046050664
0.051171374,0.048249062
0.051456217,0.034370165
0.031810213,0.032606937
0.031215845,0.022708585
0.019986667,0.023536412
0.022011934,0.057350993
0.05769285,0.0641905
0.060947485,0.07299763
0.06593457,0.06815942
0.061437853,0.015425409
0.0018636691,-0.0060149743
-0.01869246,-0.0145653095
-0.021364652,-0.021422513
-0.025372524,-0.008867863
-0.00632033,-0.0059783636
-0.0030742148,-0.008861096
-0.008341883,-0.009074168
-0.007931973,-0.008435123
-0.0073641515,-0.0076832944
-0.0054091215,-0.007985726
