Predicted,Actual
0.7637239,0.77796257
0.76459306,0.7780025
0.76705825,0.7805175
0.7755025,0.779759
0.7776961,0.7827464
0.7807015,0.7801782
0.7816904,0.7814623
0.7841135,0.7839041
0.78344244,0.7852747
0.7844596,0.7854144
0.7865081,0.7863392
0.78757405,0.7796326
0.7882689,0.7788009
0.7892998,0.7766785
0.7856835,0.77815557
0.78449285,0.7807171
0.7827955,0.77955276
0.783063,0.78245366
0.78437585,0.78152215
0.7836663,0.78057075
0.78559726,0.7813625
0.7851628,0.7776499
0.7848246,0.7666718
0.7853323,0.7596857
0.78311,0.758355
0.7760449,0.7601714
0.7702261,0.7585413
0.7672114,0.75566703
0.76663256,0.7566983
0.7644945,0.75673157
0.7618733,0.7530855
0.7616798,0.75965244
0.7611745,0.75469565
0.7587068,0.75476885
0.762307,0.7498852
0.75942016,0.7569245
0.7591136,0.7589405
0.7559626,0.75672495
0.7594497,0.7521873
0.76076555,0.75363773
0.7592318,0.75265306
0.7566791,0.7510496
0.75680995,0.7548686
0.7561298,0.7611295
0.7543966,0.7606571
0.7569547,0.7635114
0.7610913,0.7609432
0.7619112,0.76299244
0.764739,0.76035106
0.7642708,0.7612825
0.7657144,0.7575832
0.7644145,0.7591867
0.76471144,0.7587276
0.76234084,0.7592399
0.7628526,0.7607968
0.76257825,0.7629259
0.7625107,0.76203436
0.76379794,0.76116276
0.7653278,0.7681156
0.76531035,0.7716219
0.76476777,0.7712227
0.7695491,0.7696658
0.7724255,0.77074367
0.7731935,0.76821536
0.7731177,0.76871437
0.7742233,0.77053076
0.77237004,0.7719546
0.7721586,0.770218
0.7731299,0.771908
0.7739261,0.7694396
0.772922,0.7708701
0.7738092,0.7691069
0.77235764,0.7670377
0.7729285,0.76589996
0.771825,0.76503503
0.7701582,0.7670843
0.76914275,0.76857466
0.7680213,0.7656272
0.76884675,0.76213413
0.7698178,0.76493526
0.7684654,0.762866
0.76615113,0.76532775
0.76737654,0.76676494
0.7659301,0.76678485
0.767176,0.7660663
0.7680203,0.7644628
0.76829064,0.76444286
0.7680003,0.7599186
0.76696193,0.7573038
0.76696396,0.75673157
0.7641526,0.7580689
0.7621425,0.7570642
0.7613044,0.75935304
0.76194656,0.7581022
0.7613354,0.7582818
0.76258224,0.75847477
0.7620397,0.75737697
0.7618777,0.7593796
0.7619184,0.75783604
0.7611089,0.7586877
0.76220626,0.76277286
0.76160383,0.7595526
0.7621566,0.75635237
0.7648327,0.75397044
0.76335907,0.75411016
0.7614743,0.7544495
0.7594647,0.7534448
0.7590834,0.75322527
0.75870794,0.7559731
0.75765425,0.7525666
0.75725716,0.7531454
0.75873584,0.7561993
0.7567951,0.7609099
0.75700736,0.76327854
0.75878686,0.7591867
0.76211023,0.75840825
0.76446927,0.75456923
0.76293933,0.7564255
0.7626176,0.7603976
0.75972885,0.7615154
0.7603394,0.76168174
0.7625318,0.75947946
0.7633428,0.75564706
0.76369685,0.75621927
0.7624923,0.75944614
0.760203,0.7622273
0.7599416,0.7643364
0.76169443,0.7624335
0.76371485,0.7625666
0.7657993,0.7611361
0.7654625,0.7644096
0.7657929,0.7668514
0.7648502,0.7679625
0.76666874,0.7686079
0.7683206,0.76568043
0.76936525,0.769739
0.7702051,0.7716685
0.76874477,0.7695926
0.77117383,0.76218075
0.7728222,0.7577096
0.77208686,0.75824857
0.7675669,0.7636711
0.7636661,0.7632253
0.7627755,0.76553404
0.76557153,0.76588
0.7656849,0.77048415
0.76742727,0.7650084
0.7681974,0.76699114
0.77122015,0.76604635
0.76844007,0.76836836
0.76956147,0.7731189
0.7691922,0.77498853
0.77054524,0.77307236
0.7738291,0.77244693
0.77555186,0.779759
0.7751938,0.78535455
0.77481264,0.78681827
0.77980226,0.7784283
0.7843043,0.7787011
0.7867948,0.76902044
0.78249705,0.7724203
0.78258383,0.7705108
0.7762569,0.7694263
0.7766584,0.76707095
0.7748492,0.7657203
0.77364445,0.7656472
0.7718263,0.7616285
0.77022153,0.761868
0.76983297,0.7626731
0.76669943,0.763538
0.7663289,0.7610763
0.7663756,0.75951934
0.7668249,0.7581022
0.76514107,0.7603843
0.7640396,0.75115603
0.76281804,0.7502445
0.7637531,0.75021124
0.75773335,0.7515153
0.7558033,0.75035095
0.75480586,0.747663
0.7552743,0.74263966
0.75477225,0.7465918
0.75313485,0.7471839
0.74971807,0.7503709
0.7511175,0.748508
0.75127643,0.7433649
0.7531427,0.74068356
0.7522593,0.74140877
0.7488757,0.7407035
0.74647886,0.74339813
0.74593896,0.7379956
0.74502265,0.7354673
0.74589664,0.74140215
0.74250174,0.74010473
0.7402909,0.7425997
0.7434899,0.7400382
0.7427543,0.74104285
0.7446516,0.73733026
0.7433036,0.7393529
0.7439674,0.73923314
0.74152374,0.74126244
0.74262094,0.7415818
0.7427899,0.7426064
0.74398535,0.74510807
0.7443313,0.74171484
0.74504375,0.7415751
0.7471091,0.7420409
0.74519056,0.74228704
0.74503064,0.7367181
0.74526286,0.7364121
0.7453164,0.735281
0.741649,0.73466223
0.7407551,0.7392531
0.7392909,0.739466
0.7379307,0.7402977
0.7402826,0.73506147
0.7410129,0.7344693
0.7422217,0.7338905
0.73936117,0.733458
0.7385824,0.73189443
0.7378078,0.728082
0.7368861,0.7259064
0.7355662,0.723744
0.73257023,0.7246489
0.7302428,0.7261126
0.72772676,0.7253075
0.7273686,0.72743666
0.72814584,0.72896695
0.72781986,0.73314524
0.72930837,0.733458
0.7307269,0.7353941
0.7339711,0.73841476
0.7349061,0.74059707
0.7366754,0.7429923
0.7390307,0.73546064
0.74092495,0.73297894
0.74311376,0.73479533
0.7389649,0.73232025
0.73703057,0.7297587
0.73734367,0.73233354
0.7357448,0.7341566
0.7336642,0.73739016
0.734989,0.73921984
0.7362074,0.7417947
0.73868054,0.74277276
0.7408182,0.74424314
0.7432442,0.7396257
0.74467415,0.74281263
0.7460875,0.74397033
0.74379444,0.74465567
0.7456539,0.73797566
0.7467111,0.7378825
0.7472746,0.73888713
0.74350476,0.735627
0.7428281,0.7369111
0.7427941,0.73727703
0.7399618,0.7405039
0.7405372,0.73944604
0.7405604,0.73818856
0.742671,0.73529434
0.74238664,0.73677135
0.74208856,0.7437109
0.74021953,0.74242014
0.74050677,0.74096304
0.7451401,0.7394993
0.7450201,0.73965895
0.7445408,0.74241346
0.74358165,0.7435312
0.7434051,0.7442498
0.7449571,0.74794245
0.7458284,0.74684465
0.74655294,0.74628574
0.7489228,0.7491999
0.7490966,0.7507502
0.74934304,0.75149536
0.75137454,0.7486876
0.7528783,0.74687123
0.7540846,0.74627906
0.75272804,0.74438286
0.7517494,0.74418324
0.75091475,0.7441633
0.74939036,0.74258643
0.74883604,0.74721724
0.7480817,0.75098306
0.7465634,0.7490735
0.748915,0.74613273
0.75180596,0.74430305
0.7514836,0.74343145
0.7501305,0.7440635
0.749051,0.74308544
0.74821275,0.7435645
0.7484158,0.7413689
0.7477065,0.74102956
0.7476155,0.74358445
0.7457706,0.7414221
0.74505347,0.7399916
0.74619997,0.7383881
0.7446294,0.7381486
0.7438809,0.74402356
0.7428399,0.7480622
0.7426979,0.7502379
0.746267,0.7525865
0.7495667,0.75426316
0.75167495,0.7572106
0.7539091,0.7654941
0.75595963,0.76159525
0.7583799,0.76285934
0.76436883,0.7618015
0.76332986,0.7599851
0.7644258,0.76343155
0.76398027,0.76327854
0.76285225,0.7623138
0.7648119,0.7582818
0.7649468,0.7635979
0.76457536,0.7619279
0.7620169,0.77121603
0.7651617,0.77069044
0.76446366,0.7728328
0.7706629,0.77489537
0.771612,0.7721009
0.77370745,0.7802514
0.776096,0.7812893
0.77516943,0.77769643
0.78073996,0.7787211
0.7819601,0.7758135
0.780514,0.77161527
0.7809846,0.7704243
0.77935606,0.7694329
0.77645946,0.76830184
0.77513784,0.7677496
0.77400625,0.7640237
0.7726196,0.7625932
0.77185386,0.7586677
0.7692298,0.7571374
0.7676845,0.75419664
0.764487,0.753997
0.7626845,0.7515153
0.7601358,0.75273955
0.7593074,0.7537442
0.7571962,0.7528526
0.75700575,0.749486
0.7572637,0.7515419
0.75649744,0.75339156
0.75420696,0.7517881
0.75497025,0.74830174
0.75597435,0.7481953
0.7549399,0.7464587
0.7527453,0.74589986
0.752512,0.748335
0.7512212,0.7449484
0.7503148,0.7475432
0.75188464,0.7504508
0.7499297,0.74962574
0.7515943,0.75257987
0.7538516,0.7531254
0.7539106,0.7542299
0.7559383,0.7528393
0.75673825,0.7490602
0.7576207,0.751675
0.7569354,0.7498653
0.75451404,0.7503044
0.75550467,0.75063705
0.7540946,0.7535779
0.75405514,0.7534914
0.7543114,0.7558866
0.7562146,0.75419664
0.75639814,0.75323856
0.7582831,0.75651205
0.75802267,0.75767636
0.7574467,0.7602512
0.759707,0.7576431
0.7606433,0.75709087
0.7627012,0.75773627
0.76144165,0.75194776
0.7609877,0.75463575
0.761259,0.75484866
0.7575784,0.75552064
0.7582966,0.7610763
0.75787324,0.7591601
0.7579365,0.75840825
0.7613115,0.76009154
0.7608102,0.75564045
0.76076114,0.75585335
0.7618991,0.75385064
0.75925976,0.7522605
0.75891656,0.7494328
0.75745434,0.7443363
0.7557187,0.7432784
0.75306237,0.7438905
0.74929297,0.74735695
0.7476178,0.7453676
0.7472035,0.7417281
0.74890065,0.7316948
0.74777585,0.7256735
0.745515,0.7308299
0.738495,0.73820853
0.7329917,0.7369377
0.734733,0.7384081
0.7386251,0.73268616
0.7385755,0.7338173
0.74005723,0.733438
0.7373279,0.7315418
0.7378432,0.7327793
0.7375718,0.7309563
0.73634374,0.73355776
0.73680663,0.7312424
0.7354541,0.7294659
0.7369395,0.7325797
0.73560053,0.7318478
0.73412824,0.7336044
0.7356662,0.7329124
0.7351567,0.7315484
0.73654586,0.7294659
0.7366907,0.7281286
0.7360898,0.7316549
0.73493594,0.73247993
0.733983,0.7315551
0.7357085,0.729752
0.7358912,0.7287939
0.73542595,0.7298984
0.7337947,0.7313954
0.7326641,0.7299516
0.73283803,0.73164827
0.73383236,0.7311093
0.73345375,0.7308365
0.73469126,0.73239344
0.73452485,0.7350947
0.73454523,0.73698425
0.7357293,0.7354008
0.7377754,0.73580664
0.73935187,0.7382551
0.7383607,0.7358532
0.73855615,0.7372371
0.74017507,0.74226046
0.73905724,0.7447887
0.7399889,0.74409014
0.7432872,0.74119586
0.7454765,0.73979867
0.7458294,0.73379064
0.7444774,0.7336243
0.74357516,0.7321938
0.7393031,0.73502153
0.7382442,0.73747665
0.7367545,0.7399184
0.7378805,0.74003154
0.7393664,0.74031097
0.74106365,0.7416683
0.7417897,0.7424933
0.7423746,0.7434048
0.74366343,0.73588645
0.74455416,0.7371506
0.7457173,0.739965
0.7411569,0.73871416
0.7411795,0.7398253
0.7426138,0.7409364
0.7417209,0.74146867
0.7422852,0.7418679
0.7430509,0.74286586
0.74379283,0.74263966
0.7443301,0.7431786
0.7456783,0.742327
0.7461015,0.73921984
0.74665403,0.73654515
0.7463988,0.7404507
0.74455905,0.74322516
0.7425872,0.74230033
0.74426496,0.7388206
0.74594814,0.7373635
0.74560994,0.73311865
0.7437057,0.7336709
0.7426456,0.7331719
0.73968416,0.72940606
0.739305,0.7314952
0.7385924,0.72810197
0.73569995,0.7285145
0.73628426,0.7287806
0.7338958,0.7275564
0.733623,0.7280155
0.73329073,0.72787577
0.7324273,0.7270042
0.73263407,0.7237839
0.7327707,0.719233
0.7323886,0.71776927
0.72991294,0.71916646
0.72645676,0.7227593
0.7243507,0.7224865
0.7241474,0.7227793
0.72583497,0.7226728
0.72552055,0.72351116
0.72584087,0.72418314
0.7258852,0.72592634
0.7264406,0.72696424
0.727177,0.72707736
0.7285198,0.7267048
0.72964835,0.7256535
0.73018175,0.72548056
0.73022443,0.72192097
0.7296856,0.723052
0.729343,0.7235045
0.72686815,0.71967876
0.72694767,0.7243029
0.7268029,0.72506803
0.7240249,0.7252344
0.7265204,0.72739005
0.7273141,0.72856104
0.72784716,0.72868747
0.72960883,0.7273967
0.73063034,0.7250348
0.73116654,0.7251745
0.7306406,0.7230587
0.7292461,0.72263956
0.7286753,0.72090966
0.7268431,0.72323835
0.7259194,0.7269909
0.7243811,0.73106277
0.7252891,0.7343229
0.7276552,0.7309031
0.7307378,0.73305213
0.7339532,0.7341765
0.7330441,0.73471546
0.73492944,0.73037744
0.7360032,0.7276362
0.7367665,0.7266915
0.7343571,0.72772276
0.73202956,0.72759634
0.730783,0.72766286
0.73061574,0.7288139
0.73025584,0.72912663
0.7300859,0.728927
0.73071194,0.7293196
0.731076,0.72908
0.73137456,0.72884715
0.7318344,0.7272104
0.73188305,0.7272437
0.7317402,0.72985184
0.7306516,0.7307035
0.7304791,0.7307101
0.7318269,0.73077
0.73248935,0.72926635
0.73297334,0.72768945
0.7333327,0.7297986
0.73274046,0.72920644
0.7315633,0.72787577
0.7325114,0.7209496
0.7320069,0.72176796
0.73112357,0.72403675
0.7263061,0.725261
0.72554255,0.7247287
0.725994,0.72407
0.726896,0.722746
0.72703534,0.7225996
0.72713065,0.7271439
0.7265719,0.7237773
0.72620976,0.7228192
0.72943646,0.7232184
0.7274073,0.7226595
0.7266589,0.7224998
0.72652215,0.72171474
0.7259145,0.7195723
0.7256063,0.7195457
0.7250719,0.72089636
0.72363746,0.71661156
0.72312135,0.7189735
0.7242023,0.71808195
0.72171366,0.71301204
0.72268957,0.7127526
0.7222225,0.713897
0.7189052,0.7214752
0.7178442,0.7212889
0.71773183,0.7201179
0.7222729,0.71906
0.72287613,0.7209496
0.72285545,0.72228026
0.7228494,0.72599953
0.7239747,0.7261259
0.72519517,0.724436
0.72784334,0.72424966
0.7286885,0.72326493
0.7277485,0.72367746
0.727801,0.7217413
0.7270975,0.72267944
0.7269561,0.7225331
0.72517437,0.72275263
0.72530776,0.72176796
0.72520274,0.7242962
0.72535604,0.7204373
0.72499907,0.7213355
0.72657967,0.71516776
0.7246664,0.71184105
0.72474104,0.7144492
0.7209487,0.7171505
0.71798474,0.7170374
0.7185662,0.7178957
0.71954435,0.7202909
0.71935666,0.7221339
0.71996987,0.7228857
0.7219797,0.7249616
0.7236062,0.72695094
0.724816,0.73147523
0.7269791,0.73225373
0.728924,0.73268616
0.73256147,0.7292264
0.73415864,0.7295325
0.73511356,0.7280288
0.7333292,0.7266848
0.73320186,0.7287207
0.73207587,0.7288272
0.7307976,0.7317946
0.731774,0.7282417
0.73182136,0.73000485
0.73388904,0.7311093
0.73212475,0.7313289
0.73335826,0.7301978
0.7340383,0.7305837
0.73443526,0.7285744
0.73394173,0.73020446
0.73405534,0.73022443
0.73269516,0.73116255
0.7332202,0.7299383
0.7331689,0.73093635
0.73369277,0.73065686
0.73298776,0.7290135
0.7339135,0.7290867
0.7342367,0.72760963
0.73344696,0.7245225
0.73344773,0.72702414
0.73229074,0.7272171
0.7302046,0.7291133
0.7311601,0.7292996
0.73119915,0.72823507
0.73232275,0.7313422
0.7327641,0.73210067
0.7324447,0.7324533
0.7345364,0.73284584
0.735305,0.72904676
0.73602873,0.7303309
0.73634,0.7346755
0.734253,0.73479533
0.73457944,0.73805547
0.73699456,0.73917323
0.73745364,0.741655
0.7399823,0.74287254
0.7412934,0.7431187
0.7436076,0.74365765
0.7451718,0.7398386
0.7460222,0.7410096
0.74692154,0.74177474
0.74486864,0.7428858
0.74543494,0.7470642
0.7456271,0.7473303
0.7462494,0.74713737
0.7488508,0.7434847
0.74938494,0.73930633
0.74973255,0.7443762
0.74775285,0.74352455
0.74489486,0.7452811
0.74733335,0.74854124
0.7467279,0.74861443
0.74801874,0.75339156
0.750392,0.7564322
0.75113976,0.7583417
0.75455767,0.75944614
0.757168,0.7566983
0.75927526,0.75681806
0.76076806,0.7544628
0.75980604,0.7549485
0.76024276,0.7515552
0.758738,0.7483483
0.75879896,0.74700433
0.75646514,0.74625915
0.75378335,0.74512804
0.7520275,0.7476231
0.7508052,0.74796903
0.7494605,0.7483749
0.7502799,0.75165504
0.7505502,0.7504308
0.7508841,0.7507369
0.75354284,0.7466583
0.753457,0.7472571
0.7539709,0.7484148
0.7513752,0.7487209
0.7513215,0.7458732
0.7517933,0.7434248
0.7519112,0.7452145
0.7501077,0.7432917
0.7481207,0.7528393
0.7487485,0.7577229
0.74734735,0.75868106
0.7532216,0.75236696
0.75718856,0.7509564
0.7591453,0.75202096
0.7563772,0.7533317
0.75563,0.7428326
0.7560052,0.751003
0.7564428,0.7450083
0.7497749,0.74751663
0.7533286,0.7467182
0.74961865,0.7473902
0.7505043,0.73413664
0.74978286,0.74501497
0.74976754,0.73944604
0.74116194,0.73696434
0.7462373,0.7532984
0.74325174,0.74438286
0.7404826,0.745148
0.7501811,0.74242675
0.74537057,0.74662507
0.74624985,0.7472638
0.7435424,0.75093645
0.746513,0.7537841
0.7473119,0.7570177
0.75037545,0.75472224
0.7540404,0.75456256
0.7566695,0.7478493
0.75642204,0.7442964
0.75684214,0.7382684
0.75276524,0.73698425
0.74915785,0.73791575
0.7440772,0.7424068
0.74192065,0.74635226
0.7410714,0.74474216
0.7434495,0.7467049
0.74639183,0.74583995
0.7462489,0.74073017
0.74862784,0.74284595
0.74860865,0.74060374
0.7457643,0.739466
0.74632245,0.73900694
0.7443,0.739639
0.74270606,0.7391666
0.7418952,0.73778933
0.7417383,0.73313195
0.7410504,0.7339503
0.74031764,0.73110265
0.7378972,0.7292131
0.7380515,0.7283681
0.73629695,0.7381154
0.734509,0.73923314
0.7335765,0.7350947
0.7386793,0.72810864
0.7397406,0.7236309
0.7377362,0.72605276
0.73345953,0.72990507
0.7294947,0.73574007
0.7300072,0.7349683
0.73192334,0.7322803
0.736145,0.7330987
0.73645276,0.73245996
0.7355945,0.7346889
0.73607075,0.73747665
0.7353632,0.7408632
0.7370136,0.73755646
0.73899955,0.7365385
0.7415778,0.7370641
0.7404398,0.7405705
0.74009955,0.73938614
0.74042666,0.7424467
0.7430234,0.74495506
0.7429786,0.7447488
0.74512005,0.75113606
0.74727875,0.7537309
0.74792355,0.76001173
0.7526376,0.7566717
0.7550794,0.75326514
0.7597876,0.75383735
0.7591248,0.755015
0.7575488,0.7530057
0.7575448,0.7498919
0.7579032,0.75236696
0.75636363,0.7504774
0.7542164,0.75035095
0.7555377,0.7480622
0.75436026,0.74583995
0.7539772,0.75043744
0.7523047,0.74997175
0.75055283,0.75122255
0.7529735,0.7518413
0.7529022,0.7513423
0.753786,0.75236696
0.75438035,0.75796247
0.75417584,0.7559132
0.7551105,0.7564921
0.75921625,0.7549551
0.7592099,0.75776285
0.7599106,0.7589272
0.7592308,0.7604309
0.760824,0.7585679
0.76159304,0.75522125
0.7624841,0.7580423
0.7618791,0.75892055
0.7595801,0.7532785
0.7609363,0.75436294
0.76172745,0.75839496
0.7588254,0.75993186
0.7594072,0.7614688
0.761904,0.766898
0.7632301,0.7681954
0.7647796,0.76639235
0.768859,0.76196784
0.7702718,0.76168835
0.7695048,0.7648421
0.7670338,0.76647884
0.7662407,0.7706771
0.76777804,0.76794255
0.7689369,0.7700916
0.7724104,0.7732919
0.77164423,0.7719679
0.77320707,0.7721675
0.7758229,0.76981884
0.7758392,0.77271307
0.7762486,0.7796792
0.77494246,0.7818748
0.7766374,0.77953947
0.78088886,0.77781624
0.78326386,0.77592
0.7824717,0.7710364
0.78147274,0.7754543
0.7803728,0.7720411
0.7771684,0.7731256
0.77913487,0.77969915
0.77678716,0.7762593
0.7767741,0.77977896
0.78086025,0.7745361
0.7796151,0.7795927
0.78199387,0.77512825
0.77926475,0.77572703
0.7822422,0.7767517
0.7798828,0.7732054
0.7800815,0.7712293
0.7806389,0.76842827
0.7782056,0.77415687
0.77650285,0.7752946
0.77364284,0.7765188
0.7767569,0.7742633
0.7772346,0.7724203
0.7785521,0.7676099
0.77772367,0.7671575
0.7764063,0.7625866
0.77306134,0.7612293
0.771825,0.7589006
0.76851654,0.75839496
0.76659226,0.7565519
0.7640606,0.75586
0.7627055,0.7582153
0.7610427,0.7637376
0.7600498,0.7618148
0.761254,0.76385736
0.7649285,0.7606837
0.7647215,0.7681688
0.7664734,0.7651215
0.76502264,0.76830184
0.769448,0.7691069
0.76805604,0.7703045
0.7699701,0.7704975
0.771063,0.76663184
0.7721887,0.76560724
0.7729464,0.7664456
0.7708938,0.7658734
0.7702981,0.77081686
0.7698587,0.7736312
0.7693355,0.7682686
0.771893,0.76888734
0.7739876,0.76968575
0.7712686,0.7681688
0.771605,0.76434976
0.77225196,0.7621541
0.7712758,0.7598321
0.7686491,0.75832176
0.7665525,0.7577296
0.7644125,0.7608367
0.76262736,0.7622406
0.76170844,0.7603843
0.7632923,0.7637642
0.76387167,0.7673371
0.76299644,0.7650417
0.76482946,0.764383
0.7678924,0.76429653
0.7673733,0.7621474
0.76733756,0.76206094
0.7673606,0.7604043
0.7659754,0.7575766
0.7658265,0.75760317
0.7644564,0.7575034
0.7621244,0.7609432
0.7612314,0.7622938
0.7607063,0.7644562
0.7624794,0.7645427
0.76372916,0.7645493
0.76539016,0.76328516
0.76578104,0.77104306
0.76602376,0.7761595
0.76560813,0.77502847
0.7705031,0.7759666
0.7745787,0.7769047
0.775155,0.7790138
0.7768771,0.7795461
0.7779817,0.78252685
0.7797958,0.7778628
0.78073156,0.7802314
0.78310513,0.77846825
0.7806633,0.777264
0.7819397,0.7749619
0.78109646,0.77535444
0.7804579,0.7759799
0.77898073,0.7746359
0.77883637,0.7749486
0.7793877,0.7736379
0.778296,0.7758135
0.77874637,0.7792401
0.7778732,0.7787078
0.7788871,0.7756206
0.7810056,0.77795595
0.7812615,0.7779027
0.7797026,0.7798854
0.78066546,0.7797524
0.7806359,0.77956605
0.78197116,0.7789872
0.78246695,0.778568
0.7826924,0.7782154
0.78258675,0.7773638
0.78262705,0.7749486
0.7823329,0.77391064
0.7817542,0.777763
0.7799125,0.7738641
0.7786846,0.77745026
0.7806343,0.7790471
0.77815,0.7763924
0.77998513,0.7770444
0.7810654,0.7788475
0.77984816,0.7796659
0.7803958,0.7813159
0.7816554,0.77796257
0.7823213,0.77810895
0.78339565,0.7771043
0.78203225,0.77627265
0.78192085,0.77926
0.7811316,0.7784283
0.7804795,0.7794663
0.7822474,0.781276
0.7818799,0.7825468
0.78267634,0.7808967
0.78401035,0.7869114
0.7852692,0.79023814
0.7848288,0.7832254
0.7889609,0.78464264
0.7920377,0.7817617
0.7885336,0.77955276
0.7894813,0.7732054
0.7876708,0.7767517
0.7857203,0.7804909
0.7810447,0.77984554
0.78211844,0.7756472
0.78384537,0.77570707
0.78297406,0.77368444
0.78069603,0.7732586
0.78027713,0.7740238
0.77879333,0.7731256
0.77815324,0.7777031
0.77868044,0.7753877
0.7780568,0.7806705
0.78053814,0.77926
0.7794366,0.782793
0.7827056,0.7835115
0.7823592,0.78479564
0.7846776,0.7810165
0.78555936,0.77868783
0.78682786,0.7844297
0.7849688,0.7736179
0.7831222,0.772926
0.78643197,0.77256006
0.77990496,0.77606636
0.7783775,0.7771908
0.7770862,0.77862126
0.7786634,0.78007835
0.7794046,0.7806705
0.7806434,0.7816286
0.7822922,0.7821609
0.7830235,0.78413695
0.78429115,0.785135
0.7849116,0.7855009
0.78654397,0.78862137
0.7873473,0.78822213
0.78797156,0.78777635
0.7902449,0.7851217
0.79029,0.78361136
0.7901119,0.7858535
0.7887496,0.7861596
0.7878595,0.785135
0.7891225,0.78368455
0.7893583,0.7824204
0.78900844,0.78486216
0.78797644,0.78601986
0.78670025,0.79125607
0.7878174,0.79335195
0.7887672,0.79729074
0.7922808,0.7962927
0.79431635,0.7962195
0.797577,0.79554087
0.79797286,0.7952149
0.7984322,0.79981905
0.79827356,0.8021743
0.79788536,0.80325216
0.8007492,0.79953295
0.80265814,0.802354
0.8043256,0.8030659
0.80262524,0.8058803
0.8042295,0.8042369
0.80481225,0.8065323
0.8067388,0.80332536
0.8064736,0.8062728
0.80839187,0.8058869
0.8071421,0.80598676
0.80885625,0.80732405
0.8087047,0.80858153
0.8087243,0.8141438
0.8095952,0.81129616
0.81036866,0.8107572
0.81440306,0.81130946
0.8135281,0.8116288
0.81353533,0.8119282
0.8137845,0.8096062
0.8142982,0.809533
0.8144674,0.81233406
0.81310743,0.81407726
0.8131243,0.81305265
0.81484365,0.8119349
0.8164078,0.813525
0.8162148,0.8150487
0.8157318,0.810551
0.8165237,0.79861474
0.8173857,0.79400396
0.8151064,0.7983553
0.80714136,0.8014824
0.8023804,0.80346507
0.8033357,0.80355823
0.80468744,0.80172193
0.8060124,0.8002648
0.8064208,0.7976899
0.8055057,0.7990672
0.80456835,0.80112976
0.8027563,0.80174184
0.80317116,0.8000785
0.80414253,0.7960798
0.80452055,0.7944697
0.8037308,0.7963659
0.80126005,0.8007505
0.7996212,0.8022808
0.7997814,0.8009568
0.8026612,0.7985682
0.80408615,0.7959268
0.803817,0.7954278
0.8025935,0.79301924
0.8008942,0.7928063
0.8001458,0.7996327
0.7976471,0.7971044
0.79681826,0.79962605
0.8007627,0.8013227
0.79973245,0.79857486
0.8016539,0.8035117
0.8031959,0.803678
0.8018181,0.8037379
0.8049374,0.80294615
0.80551696,0.80236065
0.80581254,0.8032855
0.80521756,0.8050286
0.8050917,0.80120957
0.8056921,0.79678506
0.8070266,0.7970978
0.80483955,0.7966387
0.80167717,0.7949155
0.8012159,0.7961064
0.80044556,0.7958869
0.79914135,0.79655886
0.7992294,0.79640585
0.7987188,0.7936247
0.7985722,0.7952082
0.79825956,0.7998124
0.7962074,0.7988077
0.79681087,0.800817
0.7997487,0.79794276
0.80008036,0.8011098
0.80197704,0.797324
0.8005124,0.79967266
0.8023425,0.79868793
0.8002114,0.79983896
0.8014207,0.79840183
0.80115074,0.79832864
0.80180734,0.79765666
0.8011286,0.7954677
0.80107546,0.7953546
0.80058473,0.7959334
0.79867476,0.7931856
0.7982511,0.7925402
0.7982917,0.7910565
0.7967336,0.78683156
0.7957393,0.7838841
0.7945302,0.78444964
0.7915229,0.7867451
0.78899765,0.7885282
0.7882644,0.7939907
0.7891223,0.7955076
0.79025793,0.79770327
0.79421717,0.79798937
0.79607743,0.796978
0.7984041,0.79440314
0.7993092,0.79233396
0.799166,0.7971643
0.7978091,0.7989408
0.7966546,0.79918694
0.79948235,0.7995728
0.80093324,0.8041504
0.80158764,0.81218106
0.80221504,0.81115645
0.80532587,0.8151218
0.81107664,0.8188345
0.81208295,0.8224406
0.81557083,0.8231791
0.81906366,0.82430357
0.82273394,0.82707804
0.82446724,0.82569414
0.8262826,0.823911
0.8286931,0.8223541
0.82811964,0.8246562
0.8272212,0.8246695
0.82616675,0.82853514
0.8273077,0.8268385
0.82719654,0.8334653
0.8295747,0.8285817
0.8291115,0.83145595
0.8333724,0.82868147
0.8312782,0.82621974
0.8334027,0.8245032
0.8321445,0.82374465
0.8303981,0.8241971
0.82917213,0.8239243
0.8279793,0.8224739
0.8279201,0.82061094
0.8270859,0.8212563
0.82610554,0.8167187
0.8246196,0.8210833
0.82483953,0.81639266
0.821559,0.81894094
0.823786,0.8208771
0.82082206,0.8212563
0.8221179,0.8194
0.82351476,0.81608
0.8241401,0.8174572
0.82342595,0.8159003
0.82081777,0.8150753
0.8213075,0.81633943
0.8198794,0.81736404
0.8190567,0.81536806
0.8196892,0.81611323
0.8199106,0.81974596
0.8190248,0.8162995
0.81953543,0.81923366
0.8219789,0.81783646
0.82027256,0.8180294
0.82198834,0.8183887
0.8215313,0.8221013
0.8215016,0.81792957
0.82202685,0.81909394
0.8245554,0.82001877
0.8225404,0.8241971
0.8229314,0.8261732
0.8238953,0.82802284
0.8265202,0.83245397
0.82830685,0.83225435
0.83006215,0.83595365
0.83349997,0.8377235
0.8340635,0.8397062
0.8371732,0.8340774
0.83922726,0.84248734
0.8415064,0.8418885
0.83870393,0.83638614
0.8439523,0.8363928
0.8444997,0.82613987
0.84123313,0.8305245
0.8406555,0.83390445
0.8336695,0.8336383
0.83467984,0.8311166
0.8359481,0.8337181
0.83583874,0.83086383
0.83415025,0.82940674
0.8354928,0.8274639
0.8336916,0.8295198
0.8325594,0.82940674
0.83139384,0.8245165
0.8320871,0.82460964
0.8317412,0.82441664
0.8285552,0.82291967
0.82801497,0.8252816
0.8269576,0.82717115
0.82540643,0.8285152
0.8266836,0.8312564
0.8279966,0.8275238
0.82910234,0.8283422
0.8318605,0.83093035
0.8305529,0.83050454
0.83127075,0.8338179
0.8329927,0.8288944
0.8331162,0.83137614
0.83531547,0.82961965
0.83277935,0.8323808
0.83385175,0.83021843
0.8326837,0.8298924
0.8341877,0.83333224
0.83303183,0.8305445
0.83275163,0.83282655
0.8348664,0.82945997
0.83363205,0.83029824
0.83534384,0.8342504
0.83332163,0.8320548
0.8338482,0.83498895
0.8361506,0.83724445
0.83491427,0.83223444
0.83703214,0.8284952
0.8388585,0.82684517
0.8364397,0.83142936
0.8340579,0.830611
0.8323132,0.8344566
0.8345678,0.83769685
0.83395916,0.8355345
0.83650744,0.839633
0.8389097,0.8417421
0.838221,0.8504381
0.84135664,0.85120326
0.843638,0.8616092
0.84995955,0.8655613
0.8519841,0.8750091
0.8599623,0.8716758
0.86438483,0.88026536
0.8722417,0.8773245
0.87249094,0.87716484
0.8789289,0.87642634
0.8789141,0.87823606
0.8789854,0.88174903
0.8789424,0.88450354
0.87990415,0.882288
0.8826025,0.88254744
0.88474,0.88470316
0.88440186,0.89560145
0.8848089,0.89305985
0.8866277,0.8925342
0.8936075,0.8884557
0.8940516,0.8909973
0.89450663,0.8941976
0.8926407,0.90069795
0.89379996,0.89473647
0.8959972,0.8955083
0.9003217,0.89169586
0.89787805,0.88876176
0.8982262,0.8794004
0.8961653,0.8817091
0.8937888,0.89431065
0.88693774,0.88703185
0.8864127,0.88443035
0.893745,0.8850092
0.89044213,0.88317287
0.8896501,0.87833583
0.8897883,0.87757736
0.8888313,0.871596
0.8852662,0.870711
0.8840054,0.869061
0.8793448,0.849999
0.87707114,0.8571115
0.87499124,0.8559405
0.86190236,0.8658341
0.86353874,0.8615493
0.86154264,0.87382483
0.8669984,0.87156934
0.8648988,0.880598
0.8729525,0.8780298
0.8733107,0.8794137
0.87978005,0.8803119
0.88071144,0.88275373
0.88242924,0.88514894
0.88381046,0.8909374
0.88556916,0.89743775
0.88829565,0.89997935
0.8921398,0.90411115
0.89728594,0.90353227
0.900392,0.9050093
0.90459293,0.912541
0.905463,0.91065145
0.9072935,0.9039847
0.91256106,0.8953686
0.9130026,0.89972657
0.9094744,0.8945502
0.9032425,0.90818304
0.9039493,0.9247234
0.90015376,0.9267327
0.9073633,0.9380834
0.9191655,0.942162
0.92311347,0.9339583
0.93307054,0.93818986
0.938454,0.9417162
0.93562806,0.94560844
0.93862283,0.95097107
0.9415402,0.94518924
0.9446636,0.934098
0.94881856,0.9382431
0.9467288,0.9311107
0.9392232,0.93115723
0.94019383,0.9281366
0.9351025,0.926074
0.93370795,0.9288019
0.93134207,0.92511594
0.9293205,0.9322218
0.9301082,0.9392744
0.9271738,0.9433263
0.9311634,0.9392145
0.93562275,0.9482631
0.9393526,0.9440582
0.9384648,0.9450695
0.9451112,0.94124377
0.9441379,0.9426144
0.94541645,0.94502956
0.943704,0.94456387
0.9437884,0.9344507
0.94498175,0.9313369
0.94477814,0.9216495
0.9389122,0.92512923
0.9360247,0.9267394
0.928874,0.92459697
0.9284566,0.93383855
0.92897594,0.93942744
0.9276187,0.9409976
0.9334718,0.9372118
0.938336,0.9387554
0.9415243,0.9433396
0.94061613,0.93674606
0.941864,0.93923444
0.9444135,0.94254786
0.940485,0.9450429
0.9412593,0.94936097
0.9428976,0.94803023
0.94453275,0.9435326
0.94776535,0.9429005
0.9482332,0.94125044
0.9466147,0.9470522
0.9457711,0.9524947
0.94544756,0.946653
0.9490686,0.9448965
0.953388,0.9496936
0.95093894,0.9499398
0.9497043,0.95314676
0.95195854,0.96506965
0.9519071,0.9783498
0.9533579,0.98731196
0.9608681,0.9874982
0.9709983,0.99632734
0.979359,1.0
0.98318785,0.98712564
0.99110746,0.9920026
0.9954436,0.98574173
0.98946697,0.98739177
0.9920291,0.9916034
0.9883182,0.99141043
0.9881152,0.9672919
0.9897965,0.9706518
0.98956525,0.9680237
0.9746327,0.9705853
0.9731309,0.98181623
0.9701789,0.98347294
0.9703477,0.9750963
0.9779705,0.968383
0.9804505,0.97633386
0.9762201,0.9770391
0.9720146,0.9744243
0.975968,0.97183615
0.9755085,0.96914816
0.97348535,0.97228855
0.971606,0.97824335
0.9694541,0.97706574
0.9705723,0.983952
0.97456974,0.99402523
0.9753101,0.99755156
0.9802116,0.9928143
0.9883036,0.994145
0.9933582,0.98375237
0.99226016,0.98812366
0.994086,0.98845637
0.9881707,0.9869261
0.9891853,0.98098457
0.9893756,0.98462397
0.9884629,0.9877843
0.9840239,0.98514295
0.9856084,0.97962725
0.98745143,0.9723019
0.9857371,0.980765
0.9820446,0.985602
0.97597885,0.98208904
0.98006046,0.98858273
0.98307824,0.97226864
0.98193395,0.9792281
0.98630124,0.9849101
0.97718745,0.98041904
0.98036647,0.9813106
0.9840283,0.9790684
0.9818753,0.97807705
0.98305863,0.98592806
0.98203516,0.9868329
0.9813964,0.98424476
0.98514897,0.97544897
0.98613864,0.9773119
0.9842581,0.9735461
0.97869045,0.9654622
0.97889245,0.9703258
0.97601277,0.95991325
0.97014064,0.9534395
0.9721236,0.9640051
0.9651353,0.96675295
0.9593421,0.96588135
0.96355194,0.96908826
0.96512914,0.972089
0.9648949,0.9774849
0.9671876,0.9711575
0.9700308,0.97481686
0.97353697,0.98687947
0.9706699,0.9734263
0.9734123,0.98065853
0.9809792,0.94598764
0.9741457,0.9508912
0.978666,0.94548863
0.9570757,0.94475013
0.95600265,0.9470788
0.9499355,0.9555752
0.9467074,0.961703
0.94701093,0.958343
0.9510949,0.9429005
