Predicted,Actual
-0.0647653,-0.07304024
-0.0662036,-0.07635475
-0.06939578,-0.077807985
-0.06754497,-0.07480537
-0.06358576,-0.073354565
-0.06556897,-0.07509676
-0.066049546,-0.07080715
-0.060663145,-0.073090054
-0.060904805,-0.065219305
-0.05521587,-0.03382249
-0.024988635,-0.01972461
-0.010949232,0.0061277966
0.0084964065,0.015685003
0.015395042,-0.021032946
-0.021945408,-0.019298118
-0.019916825,-0.031181896
-0.03320086,-0.017170133
-0.016280876,0.09288818
0.09027811,0.13532354
0.11049783,0.13327499
0.10248927,0.13890293
0.10471519,0.12310956
0.09377312,0.100340486
0.07894668,0.13930398
0.10334542,0.12719184
0.09355664,-0.05409252
-0.07305149,-0.118120514
-0.11937362,-0.041854773
-0.03837604,-0.02917937
-0.023924496,-0.048372533
-0.04332591,-0.051116638
-0.047525987,-0.043815985
-0.039067864,-0.04081892
-0.03464162,-0.036866266
-0.030438721,-0.033204094
-0.026254738,-0.035430346
-0.032490127,-0.033650026
-0.034124117,-0.021071905
-0.0176363,-0.018675845
-0.013913257,-0.014749619
-0.011921348,-0.016111571
-0.015797906,-0.04369949
-0.050382156,-0.057284534
-0.06250764,-0.04109702
-0.039924055,-0.03976195
-0.03416781,-0.08419383
-0.08080666,-0.08943659
-0.08623455,-0.06424732
-0.05684979,-0.04395777
-0.03414063,0.011395014
0.020724166,0.0387043
0.041096237,0.056972712
0.057102412,0.06771812
0.06672157,0.04923038
0.040997718,0.044016246
0.034914985,0.050104856
0.041024864,0.049013793
0.037087675,0.03760169
0.027693361,0.03239895
0.025498096,0.031966154
0.024998514,0.029916544
0.022528332,0.02693246
0.021203697,0.025950752
0.021803278,0.023268389
0.018850625,0.023092354
0.01890621,0.031239232
0.02586881,0.034177825
0.02606344,0.031646058
0.023978427,0.03130067
0.025258018,0.034009613
0.028755227,0.03244854
0.028275302,0.033316713
0.026194507,-0.029757824
-0.0340489,-0.013472192
-0.014999999,-0.016239382
-0.012760888,-0.024794225
-0.027389383,-0.02840096
-0.029905217,-0.03677483
-0.03740715,-0.039328545
-0.037249513,-0.025121612
-0.023815233,-0.024412083
-0.025496954,-0.020896858
-0.021357492,-0.025075136
-0.023826947,-0.05918393
-0.0595393,-0.074105866
-0.07146694,-0.07471181
-0.07223866,-0.07779689
-0.07569529,-0.08115757
-0.07860171,-0.0789778
-0.07714482,-0.074755244
-0.07248631,-0.067330964
-0.06494721,-0.04332145
-0.038881868,-0.021960812
-0.01574769,-0.03360294
-0.030645285,-0.018842386
-0.015808929,0.062311165
0.06588024,0.08719477
0.090530105,0.11149719
0.10418605,0.10904418
0.097508185,0.017844502
0.0058255577,-0.017300148
-0.030100493,-0.030319797
-0.037571803,-0.041859027
-0.047876608,-0.021609653
-0.023126692,-0.019838903
-0.020097738,-0.022550961
-0.020440852,-0.027096495
-0.024441281,-0.04673104
-0.04566118,-0.054747146
-0.05070892,-0.0634642
-0.06024233,-0.06561337
-0.061293095,-0.05005223
-0.040874615,-0.04726818
-0.03877899,-0.032162998
-0.025989875,-0.030992117
-0.024679821,-0.07122506
-0.067233466,-0.076495014
-0.074954964,-0.09135741
-0.08830484,-0.08212493
-0.07779292,0.00861871
0.015206903,0.044500608
0.049985442,0.06431726
0.06522763,0.07403759
0.07190701,0.034669783
0.031878486,0.024465773
0.020650702,0.023097215
0.020357996,0.022970846
0.019326413,0.04310714
0.038167726,0.04838856
0.04154838,0.048228394
0.038215905,0.046362035
0.033901837,0.030800665
0.019350672,0.021232523
0.012712165,0.025328327
0.01790935,0.020034304
0.014125152,-0.0055422042
-0.010831932,-0.013360101
-0.016601242,-0.023715993
-0.02642488,-0.023751915
-0.028903956,0.012790305
0.007956881,0.026148431
0.020258594,0.026324313
0.019924968,0.027601285
0.020264423,0.02300259
0.0163896,0.0190349
0.011421418,0.013359569
0.00556918,0.007930139
0.0024714773,-0.0012158387
-0.0025222786,-0.013578511
-0.014067582,-0.002511493
-0.0029920621,-0.012081457
-0.010884733,-0.076701574
-0.07683011,-0.09734038
-0.09730874,-0.11849225
-0.10991543,-0.1186935
-0.10896534,-0.039089937
-0.025589788,-0.007001287
0.0023100793,0.0016676204
0.0064499653,0.011696884
0.0141136125,0.00032465399
0.0008310656,-0.0014732077
-0.001357334,0.0049561565
0.0043984163,0.06183584
0.02935486,-0.00745641
-0.016811568,4.7995632e-05
-0.0067424485,0.052111864
0.045697443,0.074988924
0.06910879,0.07404648
0.06574101,0.07964746
0.06748794,0.08880437
0.077899545,0.08611981
0.07939846,0.0937199
0.07934215,0.08472589
0.06863688,0.029839462
0.016119432,0.0048173335
-0.005463876,-0.0055618733
-0.0129256975,-0.01661302
-0.022234717,-0.015075109
-0.020086648,-0.018255578
-0.019945083,-0.026849303
-0.030464426,-0.03087038
-0.030988982,-0.02773988
-0.0269889,-0.028841881
-0.027230881,-0.02906652
-0.028028823,-0.031080512
-0.03094597,-0.04001871
-0.038911063,-0.04292936
-0.042459406,-0.04734602
-0.046862405,-0.047722314
-0.048865467,-0.034223694
-0.032851465,-0.029710284
-0.02738691,-0.029029991
-0.026291339,-0.028677315
-0.025705144,-0.03495677
-0.031820137,-0.038402505
-0.038116638,-0.03579373
-0.03257854,-0.038292844
-0.0319034,-0.046279334
-0.04287095,-0.047330756
-0.044352137,-0.067447454
-0.065950684,-0.070512116
-0.06787657,-0.02303327
-0.017036686,-0.016909955
-0.01301959,-0.012840654
-0.010471083,-0.024727244
-0.024277076,-0.11347064
-0.11417511,-0.16286156
-0.12989798,-0.14486714
-0.11963091,-0.167324
-0.12659362,-0.26245683
-0.14692533,-0.28354567
-0.14898343,-0.38306347
-0.16627118,-0.40086925
-0.16955379,-0.029224176
0.0074857017,0.099676296
0.113305986,-0.06576214
-0.05258253,-0.13186276
-0.10590604,0.0086623
0.016087087,0.050109945
0.059793115,0.041190658
0.036647633,0.052783955
0.042555753,0.07406691
0.073193386,0.086126715
0.08280516,0.09533254
0.082274094,0.10143748
0.088042356,0.09761886
0.08281707,0.09761006
0.07738578,0.102200925
0.07994051,0.10081452
0.08401608,0.10052913
0.07853285,0.10275926
0.07581952,0.06835793
0.05179655,0.06383138
0.049765967,0.12682603
0.0934108,0.12325013
0.09707311,0.15393984
0.11445374,0.12745687
0.09287705,-0.07341327
-0.10312022,-0.15215679
-0.13904135,-0.19270125
-0.14246684,-0.21483232
-0.1452252,-0.11706104
-0.10218938,-0.07743989
-0.06088008,-0.080860265
-0.069210336,-0.06507357
-0.054435723,-0.032658976
-0.021908937,-0.011440807
-0.007311213,-0.004046062
-0.0014789072,0.0080276495
0.007827057,0.02803712
0.023363689,0.035239957
0.025584335,0.048473004
0.040784832,0.3379982
0.15773548,0.033541884
0.021667557,0.032332957
0.015624439,0.016167313
0.011318422,0.009805386
-0.0033831352,0.0077096783
0.00197129,0.005785904
-0.0002597011,0.0101845665
0.0044549457,0.011826367
0.002629235,0.007888523
0.0005757905,0.009123347
0.0008882128,0.013674199
0.009468879,0.012272301
0.008188531,0.035831247
0.028067557,0.04272553
0.034092978,-0.024647731
-0.031538613,-0.038717743
-0.04288832,0.029010702
0.028293462,0.051580798
0.05033435,0.045300208
0.04049212,0.04980914
0.048927866,0.052201096
0.050287392,0.053876918
0.049024448,0.0649649
0.060271904,0.060621217
0.05548301,0.060729284
0.04874414,0.04806512
0.03564931,-0.008623038
-0.0129449265,-0.041745417
-0.04213064,-0.04151926
-0.040722717,-0.059688568
-0.057786576,-0.114736065
-0.108788066,-0.13592409
-0.11601836,-0.16312963
-0.12914266,-0.1666362
-0.12409042,-0.093343
-0.07870056,-0.06535539
-0.052287865,-0.04232296
-0.0329728,-0.030115817
-0.022094104,-0.071867004
-0.07178129,-0.073036976
-0.0740019,-0.07493971
-0.07314982,-0.059852224
-0.05958197,0.02980901
0.036620256,0.072640024
0.08213825,0.0723945
0.07315673,0.08623122
0.08608745,0.11414994
0.114435,0.11516347
0.10681088,0.13336049
0.11919102,0.12137207
0.11115253,0.020646855
0.00734276,-0.023096606
-0.036521133,-0.027670773
-0.032197423,-0.041817866
-0.043446336,-0.05370992
-0.053043153,-0.05442439
-0.052434932,-0.06889917
-0.065438606,-0.06278497
-0.0584286,0.0067259953
0.0080144415,0.039549083
0.037964933,0.03503833
0.028032,0.046036925
0.03583462,0.07820015
0.06301295,0.08302895
0.068174236,0.09888239
0.076924324,0.09037874
0.07006695,0.008439789
-0.0008019783,-0.026743667
-0.04027516,-0.03501874
-0.044955865,-0.04755046
-0.049679816,-0.047729604
-0.046898216,-0.048426
-0.048417907,-0.059770357
-0.060990233,-0.05919798
-0.050940234,-0.028782722
-0.016592693,-0.0162106
-0.0043841368,-0.0141941765
-0.0028448692,-0.010263471
-0.0008545521,-0.010847316
-0.007696332,-0.011127013
-0.010735704,-0.0072892606
-0.011619046,-0.0075943214
-0.013999931,-0.019513717
-0.028512873,-0.024440104
-0.029930374,-0.021553304
-0.025476206,-0.023121135
-0.025617117,-0.025656931
-0.02970362,-0.022525823
-0.025615616,-0.043860946
-0.051548254,-0.77975065
-0.2048832,-0.066447444
-0.05761541,-0.06454076
-0.023372408,-0.020326758
-0.022358255,-0.011007707
0.0038439047,0.030067896
0.030155653,0.044075936
0.05103598,-0.09746462
-0.09244414,-0.14050333
-0.12597688,0.027857287
0.039826937,0.06148043
0.06884623,-0.051495895
-0.05757694,-0.084817395
-0.07543098,-0.12319264
-0.10788195,-0.1463629
-0.11149207,-0.05496533
-0.03943779,-0.04744672
-0.03167913,-0.12508771
-0.087331325,0.065449186
0.03925758,-0.5843866
-0.17340592,-0.5110134
-0.16745678,-0.832525
-0.19235641,-1.0
-0.20678417,0.22896878
0.10673916,-0.38304272
-0.12852025,0.39693412
0.1276167,0.38409933
0.1521298,0.47094786
0.19841856,-0.25180444
-0.13644744,0.12091664
0.0742114,0.11130901
0.07122099,0.23834054
0.13785245,0.26200792
0.15556318,0.27452704
0.16041549,0.25783566
0.15127085,0.13045745
0.08862882,0.061243415
0.030348172,0.092352405
0.07154979,0.061923932
0.029234078,-0.10879334
-0.11952727,-0.16184878
-0.13345997,-0.19212438
-0.1440703,-0.18084876
-0.12845774,0.016401596
0.026248287,0.11298559
0.11230329,0.13434008
0.11341131,0.16012725
0.11911381,0.2658418
0.16433115,0.2753848
0.1809298,0.13743488
0.093893886,0.07932493
0.041913096,0.042951535
0.030087555,0.0067434623
0.005394173,-0.01053694
-0.008094255,-0.033203483
-0.040913314,-0.071302146
-0.082745194,-0.075481184
-0.08059002,-0.12412422
-0.118433625,-0.11445713
-0.11400409,0.059844326
0.0825104,0.11778348
0.11579853,0.16117238
0.1494156,0.1679358
0.13225208,0.034262273
0.025159327,-0.0048522674
-0.01454686,-0.012765699
-0.02496955,-0.0124161355
-0.033263713,0.0654965
0.066022046,0.0998663
0.08510737,0.08481975
0.06442246,0.09407539
0.06905896,0.14195597
0.075209394,0.14743628
0.07306909,0.1639508
0.11766794,0.149948
0.108129196,0.04346536
0.0157563,-0.0019173952
-0.027281538,-0.016929548
-0.032147072,-0.033966403
-0.043575943,-0.026847783
-0.027422082,-0.0279147
-0.030172167,-0.04076462
-0.045439802,-0.043190982
-0.036258474,-0.026259838
-0.017273167,-0.020827826
-0.015259195,-0.017726716
-0.006446051,-0.016274469
-0.013118197,-0.02554089
-0.019100782,-0.026701747
-0.009068302,-0.027511597
-0.01180127,-0.18910415
-0.1284223,-0.013492012
-0.0069400514,-0.0068052793
0.0058836783,0.00082792464
0.0007895453,0.017042778
0.0071467757,-0.002693679
-0.007695137,0.010877389
0.004179237,0.1124505
0.097363226,0.14018066
0.11968574,0.16672528
0.12595296,0.16038279
0.108043484,0.04389231
0.0325753,-0.00067262235
-0.0027812503,-0.014876823
-0.016460722,-0.02814306
-0.031518016,-0.0033342536
-0.009705457,0.0020704193
-0.0044102836,-0.0047741225
0.0012523805,-0.0052767857
-0.00043140043,-0.0069103837
0.003285041,-0.008851777
0.0023870924,0.0050185053
0.013864019,0.006939394
0.005174974,-0.019857282
-0.016031355,-0.018707057
-0.024420617,-0.031084917
-0.044387124,-0.019460633
-0.028489208,0.071056694
0.060330003,0.106740385
0.091245465,0.11626342
0.086794205,0.12376676
0.087769106,0.10017417
0.07262074,0.087586254
0.059581235,0.100273356
0.075623505,0.09554153
0.06835289,0.039156765
0.016931629,0.017936165
0.0024352449,0.04716839
0.037011024,0.047175378
0.03472888,0.027596122
0.0228679,0.014554751
0.009503527,0.0014724482
-0.0059160334,-0.009437825
-0.015723307,-0.034544855
-0.04254456,-0.036002345
-0.041869204,-0.0473625
-0.047681004,-0.023927873
-0.030212997,0.036364436
0.037975032,0.061481494
0.054346595,0.23936082
0.11940893,0.2678477
0.12133219,0.037089992
0.011909898,-0.044668593
-0.06887565,-0.023974273
-0.043455236,-0.042392068
-0.0501096,-0.081630774
-0.08551455,-0.09140616
-0.08940996,-0.11837659
-0.10565102,-0.115255356
-0.09575931,-0.003458799
0.014677711,0.049873766
0.065682665,0.014942666
0.015801487,0.07965331
0.07692273,0.05597969
0.0484874,0.05494163
0.043855023,0.06927493
0.052501272,0.06214561
0.04482034,-0.0014866495
-0.013211324,-0.030307798
-0.04307194,-0.037466895
-0.04098021,-0.049174335
-0.048901368,-0.056674562
-0.05581562,-0.061087657
-0.06272193,-0.06983357
-0.06960237,-0.07177739
-0.065696225,-0.04891484
-0.038232792,-0.0371976
-0.029556192,-0.054710615
-0.05143706,-0.051511236
-0.048678927,-0.010790664
-0.0071434705,-0.008670122
-0.0036771286,0.03169094
0.028840004,0.022074496
0.01763565,-0.12528166
-0.12518051,-0.16903849
-0.13398871,-0.23158477
-0.14418162,-0.2414986
-0.14279778,-0.014080111
0.009723858,0.06279013
0.07793997,0.023715613
0.031215016,0.50707394
0.10560794,0.15806769
0.10087952,0.18951447
0.111944325,0.04613694
0.018817112,0.0032955988
-0.019963544,0.00732708
-0.005238545,0.001117797
-0.008690917,0.025203554
0.016265608,0.028897852
0.01615033,0.024307964
0.0093651945,0.020016532
0.014126817,-0.004079097
-0.009088771,-0.02053598
-0.026056178,0.00065545936
-0.001197262,-0.0044296477
-0.0024833067,-0.07479937
-0.077027716,-0.087090656
-0.08028198,-0.10601985
-0.10444138,-0.09065782
-0.08767298,0.049968615
0.062136546,0.11429856
0.11484865,0.124322206
0.11737499,0.14728387
0.1255673,0.1694586
0.13738307,0.17571443
0.13461584,0.19282025
0.1490739,0.18696912
0.14512318,0.12759085
0.09486918,0.10296726
0.071908005,0.08627192
0.06468182,0.07408308
0.056399193,0.08858961
0.0726396,0.08256281
0.06336555,0.07774032
0.059295323,0.06397461
0.050513864,0.016706657
0.0066557527,-0.007851615
-0.011622166,-0.022579212
-0.03021822,-0.036151797
-0.042268895,-0.037134875
-0.04540915,-0.043931115
-0.050173078,-0.052161228
-0.046391476,-0.059665024
-0.053859245,-0.07043572
-0.080099285,-0.077277526
-0.08102828,-0.083435394
-0.08323092,-0.087325245
-0.08621227,-0.08429324
-0.07699335,-0.083912164
-0.07663047,-0.085704856
-0.08451448,-0.08476112
-0.07821644,-0.08435141
-0.07337642,-0.08411257
-0.0751091,-0.068516195
-0.055570114,-0.062012102
-0.04820436,-0.08920877
-0.08362552,-0.08806735
-0.082580425,-0.067936756
-0.058805916,-0.038946405
-0.03388264,-0.0154436575
-0.0051150024,0.015926195
0.024203788,0.13966714
0.10510298,0.18560852
0.1272336,0.13729075
0.09904121,0.121147506
0.09231774,0.1532095
0.10988035,0.14332308
0.106519096,0.051896263
0.026804572,0.013210721
-0.007435289,0.004232273
-0.010769973,-0.009530246
-0.02035128,-0.010224588
-0.017709835,-0.011883171
-0.009441662,-0.024073226
-0.02212124,-0.024570802
-0.019916853,0.0033434425
0.010325708,0.013932251
0.01770273,0.014698966
0.015962448,0.017034272
0.011649426,0.014504326
0.0055318144,0.012817644
0.004768673,0.014925427
0.004358072,0.013304207
0.009498149,0.0025572863
0.0024750987,-0.0024038064
-0.0008185517,-0.0034295614
-0.0023134332,-0.0052950117
-0.0026944273,-0.0065294565
-0.0060183895,-0.0068269228
-0.004694325,-0.008784188
