time,open,high,low,close,tick_volume,spread,real_volume,EMA 9,trend,signal,magnitude
2021-01-04,0.97914,0.98165,0.97731,0.97889,442718,24,44271800000,0.9755713734606104,0.0033186265393896,1,0.10605154
2021-01-05,0.97884,0.98586,0.97848,0.98261,425785,24,42578500000,0.9769790987684884,0.0056309012315116,1,0.058356497
2021-01-06,0.98265,0.98989,0.98142,0.98844,602751,24,60275100000,0.9792712790147908,0.0091687209852092,1,0.085501716
2021-01-07,0.98854,0.98996,0.98297,0.98549,465976,24,46597600000,0.9805150232118326,0.0049749767881673,1,0.12579253
2021-01-08,0.98544,0.98855,0.98284,0.9852,513590,24,51359000000,0.981452018569466,0.0037479814305338,1,0.07261037
2021-01-11,0.98457,0.98586,0.98117,0.98374,427706,24,42770600000,0.9819096148555728,0.001830385144427,1,0.052584775
2021-01-12,0.98369,0.98884,0.98226,0.98769,406220,24,40622000000,0.9830656918844584,0.0046243081155415,1,0.024765328
2021-01-13,0.98764,0.98867,0.98134,0.98147,386916,24,38691600000,0.9827465535075668,-0.0012765535075667,1,0.07237321
2021-01-14,0.98147,0.98536,0.98071,0.98264,403289,24,40328900000,0.9827252428060534,-8.524280605348711e-05,0,-0.0023450071
2021-01-15,0.98289,0.98416,0.97948,0.97988,431878,24,43187800000,0.9821561942448428,-0.0022761942448428,1,0.002635754
2021-01-18,0.98113,0.98333,0.97824,0.97914,375020,24,37502000000,0.9815529553958744,-0.0024129553958742,0,-0.027255934
2021-01-19,0.97918,0.98323,0.97757,0.97954,368353,24,36835300000,0.9811503643166994,-0.0016103643166994,0,-0.029313836
2021-01-20,0.97954,0.98269,0.97724,0.97809,386469,24,38646900000,0.9805382914533596,-0.0024482914533595,0,-0.026647067
2021-01-21,0.97809,0.98195,0.97725,0.98064,328194,20,32819400000,0.9805586331626877,8.136683731230221e-05,0,-0.035464
2021-01-22,0.98049,0.98279,0.97845,0.98133,422344,24,42234400000,0.9807129065301502,0.0006170934698498,1,0.0037163454
2021-01-25,0.98032,0.98323,0.97928,0.98224,441916,24,44191600000,0.9810183252241202,0.0012216747758797,1,0.013286551
2021-01-26,0.98224,0.985,0.98001,0.98198,377172,24,37717200000,0.9812106601792964,0.0007693398207037,1,0.027912427
2021-01-27,0.98198,0.98473,0.97967,0.98024,561907,24,56190700000,0.9810165281434372,-0.000776528143437,1,0.016009241
2021-01-28,0.98019,0.98499,0.97682,0.98489,638227,24,63822700000,0.9817912225147496,0.0030987774852503,0,-0.0047008335
2021-01-29,0.98485,0.9853,0.97587,0.97594,685395,24,68539500000,0.9806209780117998,-0.0046809780117997,1,0.055861674
2021-02-01,0.97426,0.98145,0.97421,0.97864,604746,24,60474600000,0.98022478240944,-0.0015847824094399,0,-0.06008194
2021-02-02,0.97861,0.98234,0.97132,0.97214,500769,24,50076900000,0.978607825927552,-0.006467825927552,0,-0.019331682
2021-02-03,0.97209,0.9755,0.97143,0.97379,440188,24,44018800000,0.9776442607420416,-0.0038542607420416,0,-0.08987538
2021-02-04,0.97379,0.97724,0.973,0.97464,427098,24,42709800000,0.9770434085936334,-0.0024034085936334,0,-0.057967916
2021-02-05,0.97459,0.97985,0.97267,0.97855,393561,24,39356100000,0.9773447268749068,0.0012052731250932,0,-0.03137622
2021-02-08,0.97802,0.98373,0.97769,0.98049,340014,24,34001400000,0.9779737814999256,0.0025162185000744,1,0.017646955
2021-02-09,0.98044,0.98483,0.98034,0.98204,362358,24,36235800000,0.9787870251999404,0.0032529748000594,1,0.039892744
2021-02-10,0.98204,0.98367,0.97996,0.98054,407545,24,40754500000,0.9791376201599524,0.0014023798400475,1,0.056221858
2021-02-11,0.98059,0.98499,0.97985,0.98444,335590,24,33559000000,0.980198096127962,0.004241903872038,1,0.016452096
2021-02-12,0.98434,0.98584,0.98345,0.98483,307542,24,30754200000,0.9811244769023696,0.0037055230976303,1,0.06009781
2021-02-15,0.9847,0.98615,0.98228,0.98288,225457,24,22545700000,0.9814755815218956,0.0014044184781042,1,0.053177707
2021-02-16,0.98288,0.98608,0.98256,0.9838,378894,24,37889400000,0.9819404652175168,0.0018595347824833,1,0.031635087
2021-02-17,0.98382,0.98634,0.98201,0.98419,419677,24,41967700000,0.9823903721740136,0.0017996278259865,1,0.032294177
2021-02-18,0.98414,0.98715,0.98367,0.98435,394423,24,39442300000,0.9827822977392108,0.0015677022607891,1,0.041045684
2021-02-19,0.98434,0.9932,0.98355,0.99213,382571,24,38257100000,0.9846518381913688,0.0074781618086312,1,0.031490304
2021-02-22,0.99216,0.99891,0.9919,0.99799,407372,24,40737200000,0.9873194705530952,0.0106705294469049,1,0.10496947
2021-02-23,0.9978,0.99877,0.99528,0.99554,633112,24,63311200000,0.9889635764424762,0.0065764235575237,1,0.14393418
2021-02-24,0.99549,0.99885,0.99374,0.99669,702907,24,70290700000,0.9905088611539812,0.0061811388460188,1,0.091583654
2021-02-25,0.99674,0.99924,0.99052,0.99145,787787,24,78778700000,0.990697088923185,0.000752911076815,1,0.082507685
2021-02-26,0.99153,0.9932,0.9788,0.98104,917303,24,91730300000,0.988765671138548,-0.007725671138548,1,0.013174126
2021-03-01,0.98128,0.98617,0.98007,0.98253,672095,24,67209500000,0.9875185369108386,-0.0049885369108385,0,-0.10730993
2021-03-02,0.98253,0.98867,0.98113,0.9872,724987,24,72498700000,0.9874548295286708,-0.0002548295286709,0,-0.07713163
2021-03-03,0.9872,0.98974,0.983,0.98344,679721,24,67972100000,0.9866518636229368,-0.0032118636229367,0,-0.006452027
2021-03-04,0.98344,0.98735,0.97761,0.9782,803329,24,80332900000,0.9849614908983496,-0.0067614908983495,0,-0.046991713
2021-03-05,0.97813,0.97877,0.97023,0.9724,819587,24,81958700000,0.9824491927186796,-0.0100491927186795,0,-0.096377574
2021-03-08,0.97318,0.97516,0.96788,0.9682,784617,24,78461700000,0.9795993541749436,-0.0113993541749437,0,-0.1434815
2021-03-09,0.96818,0.97599,0.96652,0.97393,710686,24,71068600000,0.978465483339955,-0.004535483339955,0,-0.16347386
2021-03-10,0.9741,0.97783,0.9723,0.97569,682052,24,68205200000,0.977910386671964,-0.0022203866719641,0,-0.077445485
2021-03-11,0.97569,0.97963,0.97461,0.97574,615629,24,61562900000,0.9774763093375712,-0.0017363093375711,0,-0.040657844
2021-03-12,0.97579,0.9771,0.967,0.96828,618044,24,61804400000,0.9756370474700572,-0.007357047470057,0,-0.02966165
2021-03-15,0.96834,0.96837,0.96364,0.96732,576630,24,57663000000,0.9739736379760456,-0.0066536379760456,0,-0.10526794
2021-03-16,0.96732,0.96769,0.96277,0.96333,560122,24,56012200000,0.9718449103808364,-0.0085149103808365,0,-0.092913754
2021-03-17,0.96333,0.96912,0.96086,0.96694,572624,24,57262400000,0.9708639283046692,-0.0039239283046692,0,-0.12817355
2021-03-18,0.96704,0.97185,0.96605,0.96879,701969,24,70196900000,0.9704491426437356,-0.0016591426437354,0,-0.05599336
2021-03-19,0.96879,0.97026,0.96583,0.96728,632240,24,63224000000,0.9698153141149886,-0.0025353141149885,0,-0.023416145
2021-03-22,0.9658,0.97123,0.96444,0.96959,548315,24,54831500000,0.9697702512919908,-0.0001802512919909,0,-0.04278168
2021-03-23,0.96959,0.96983,0.95863,0.95994,620366,24,62036600000,0.9678042010335928,-0.0078642010335927,0,-0.006579498
2021-03-24,0.95994,0.96026,0.95204,0.95344,583756,24,58375600000,0.9649313608268744,-0.0114913608268742,0,-0.10480768
2021-03-25,0.95344,0.95764,0.95333,0.95542,618063,24,61806300000,0.9630290886614996,-0.0076090886614994,0,-0.1691658
2021-03-26,0.95544,0.96103,0.95538,0.95978,554694,24,55469400000,0.9623792709291996,-0.0025992709291996,0,-0.117368154
2021-03-29,0.95952,0.96364,0.95827,0.96044,573096,24,57309600000,0.9619914167433598,-0.0015514167433597,0,-0.039223287
2021-03-30,0.96035,0.96422,0.95849,0.95924,363699,24,36369900000,0.9614411333946878,-0.0022011333946878,0,-0.029342398
2021-03-31,0.95929,0.96067,0.95372,0.95395,529081,24,52908100000,0.9599429067157504,-0.0059929067157503,0,-0.0262785
2021-04-01,0.95395,0.95642,0.94897,0.95543,545175,24,54517500000,0.9590403253726004,-0.0036103253726003,0,-0.067880884
2021-04-02,0.95543,0.95832,0.95414,0.95647,196245,24,19624500000,0.9585262602980804,-0.0020562602980803,0,-0.05123761
2021-04-05,0.95604,0.95942,0.95556,0.95765,426618,24,42661800000,0.9583510082384644,-0.0007010082384643,0,-0.023673896
2021-04-06,0.95758,0.96395,0.9549,0.96253,482791,24,48279100000,0.9591868065907716,0.0033431934092283,0,-0.0063864402
2021-04-07,0.96253,0.96492,0.95949,0.95959,358897,24,35889700000,0.9592674452726172,0.0003225547273827,1,0.049339246
2021-04-08,0.95959,0.96291,0.95868,0.96099,454953,24,45495300000,0.959611956218094,0.001378043781906,1,0.0040667825
2021-04-09,0.96089,0.962,0.95408,0.95456,485872,24,48587200000,0.9586015649744752,-0.0040415649744751,1,0.02421284
2021-04-12,0.9561,0.95784,0.95329,0.95749,469944,24,46994400000,0.9583792519795802,-0.0008892519795802,0,-0.057763543
2021-04-13,0.95754,0.95959,0.95564,0.95729,465186,24,46518600000,0.9581614015836644,-0.0008714015836642,0,-0.010247203
2021-04-14,0.95739,0.96841,0.95643,0.96705,471330,24,47133000000,0.9599391212669314,0.0071108787330685,0,-0.010509781
2021-04-15,0.96703,0.97287,0.96501,0.97209,490978,24,49097800000,0.9623692970135452,0.0097207029864548,1,0.09647275
2021-04-16,0.97214,0.97294,0.96602,0.96671,450701,24,45070100000,0.963237437610836,0.0034725623891638,1,0.13449128
2021-04-19,0.96637,0.97266,0.96522,0.9718,530473,24,53047300000,0.9649499500886688,0.006850049911331,1,0.06639523
2021-04-20,0.97188,0.97549,0.97099,0.97379,553295,24,55329500000,0.9667179600709352,0.0070720399290649,1,0.10337867
2021-04-21,0.97379,0.97575,0.96587,0.96869,509487,24,50948700000,0.9671123680567482,0.0015776319432518,1,0.10409885
2021-04-22,0.96864,0.96999,0.96191,0.96339,544654,24,54465400000,0.9663678944453986,-0.0029778944453986,1,0.027814737
2021-04-23,0.96339,0.96815,0.96176,0.96505,486886,24,48688600000,0.9661043155563188,-0.0010543155563189,0,-0.041045003
2021-04-26,0.96548,0.97077,0.96516,0.96659,479763,24,47976300000,0.9662014524450552,0.0003885475549447,0,-0.013385216
2021-04-27,0.96639,0.96689,0.96259,0.96259,465236,24,46523600000,0.965479161956044,-0.0028891619560441,1,0.0024157893
2021-04-28,0.96254,0.96404,0.95745,0.95924,504913,24,50491300000,0.9642313295648354,-0.0049913295648353,0,-0.03357961
2021-04-29,0.95924,0.96062,0.95324,0.95379,512231,24,51223100000,0.9621430636518684,-0.0083530636518682,0,-0.0679071
2021-04-30,0.95384,0.95533,0.94547,0.94773,517069,24,51706900000,0.9592604509214948,-0.0115304509214947,0,-0.10888054
2021-05-03,0.9488,0.95321,0.94719,0.95254,285502,24,28550200000,0.9579163607371958,-0.0053763607371957,0,-0.16611268
2021-05-04,0.9525,0.953,0.94628,0.94803,373380,24,37338000000,0.9559390885897568,-0.0079090885897566,0,-0.079424456
2021-05-05,0.94813,0.9511,0.94754,0.95014,452763,24,45276300000,0.9547792708718054,-0.0046392708718053,0,-0.11906546
2021-05-06,0.95014,0.9511,0.94488,0.94558,381749,24,38174900000,0.9529394166974444,-0.0073594166974443,0,-0.06993672
2021-05-07,0.94519,0.95405,0.9448,0.95096,524641,24,52464100000,0.9525435333579556,-0.0015835333579554,0,-0.09865752
2021-05-10,0.95226,0.9556,0.94701,0.94714,515658,24,51565800000,0.9514628266863644,-0.0043228266863645,0,-0.027410636
2021-05-11,0.94714,0.95011,0.94662,0.94884,645589,24,64558900000,0.9509382613490917,-0.0020982613490916,0,-0.06432611
2021-05-12,0.94879,0.94891,0.93569,0.93709,676519,24,67651900000,0.9481686090792734,-0.0110786090792733,0,-0.031207476
2021-05-13,0.93704,0.94112,0.93374,0.93984,659076,24,65907600000,0.9465028872634188,-0.0066628872634187,0,-0.16134308
2021-05-14,0.93984,0.94307,0.9383,0.94011,523986,24,52398600000,0.9452243098107352,-0.0051143098107351,0,-0.12130934
2021-05-17,0.94098,0.94276,0.93631,0.93674,545044,24,54504400000,0.9435274478485882,-0.0067874478485882,0,-0.08210228
2021-05-18,0.93674,0.94089,0.93586,0.93959,490656,24,49065600000,0.9427399582788708,-0.0031499582788706,0,-0.109712064
2021-05-19,0.93955,0.94058,0.93337,0.93724,660089,24,66008900000,0.9416399666230966,-0.0043999666230966,0,-0.043028306
2021-05-20,0.93729,0.93972,0.93588,0.93749,527212,24,52721200000,0.9408099732984774,-0.0033199732984773,0,-0.06044612
2021-05-21,0.93749,0.93779,0.93141,0.93234,518650,24,51865000000,0.939115978638782,-0.0067759786387819,0,-0.045076977
2021-05-24,0.9325,0.93572,0.93086,0.93359,465464,24,46546400000,0.9380107829110256,-0.0044207829110256,0,-0.088381775
2021-05-25,0.93354,0.93622,0.93309,0.93499,515647,24,51564700000,0.9374066263288204,-0.0024166263288205,0,-0.06330461
2021-05-26,0.93499,0.94084,0.93434,0.93829,530918,24,53091800000,0.9375833010630564,0.0007066989369435,0,-0.027012536
2021-05-27,0.93819,0.93914,0.93284,0.93404,490400,24,49040000000,0.9368746408504453,-0.0028346408504451,1,0.004358379
2021-05-28,0.93399,0.93602,0.9297,0.93075,518303,24,51830300000,0.9356497126803562,-0.0048997126803562,0,-0.03298026
2021-05-31,0.93031,0.93549,0.93017,0.93238,369094,24,36909400000,0.934995770144285,-0.002615770144285,0,-0.064111724
2021-06-01,0.93238,0.93671,0.93036,0.93589,484764,24,48476400000,0.9351746161154282,0.0007153838845718,0,-0.029294426
2021-06-02,0.93589,0.93709,0.93153,0.93299,451454,24,45145400000,0.9347376928923428,-0.0017476928923426,1,0.009818131
2021-06-03,0.93294,0.93346,0.92604,0.92659,455676,24,45567600000,0.9331081543138742,-0.0065181543138741,0,-0.015618866
2021-06-04,0.92659,0.9364,0.92595,0.93443,469325,24,46932500000,0.9333725234510992,0.0010574765489006,0,-0.09096614
2021-06-07,0.93243,0.93858,0.93219,0.93669,416508,24,41650800000,0.9340360187608796,0.0026539812391205,1,0.016916873
2021-06-08,0.93659,0.93772,0.93465,0.93676,428306,24,42830600000,0.9345808150087036,0.0021791849912964,1,0.033008967
2021-06-09,0.93685,0.93778,0.9339,0.93609,379095,24,37909500000,0.934882652006963,0.001207347993037,1,0.033343647
2021-06-10,0.93619,0.9383,0.93525,0.93764,446764,24,44676400000,0.9354341216055704,0.0022058783944295,1,0.029298415
2021-06-11,0.93754,0.93925,0.93402,0.93617,392376,24,39237600000,0.9355812972844564,0.0005887027155434,1,0.03638542
2021-06-14,0.93657,0.93892,0.93548,0.93639,387125,24,38712500000,0.9357430378275652,0.0006469621724346,1,0.014721349
2021-06-15,0.93629,0.93822,0.93444,0.93654,417450,24,41745000000,0.9359024302620524,0.0006375697379477,1,0.0043438505
2021-06-16,0.93644,0.93958,0.93267,0.93399,463233,24,46323300000,0.935519944209642,-0.0015299442096419,1,0.008046886
2021-06-17,0.93394,0.93816,0.9313,0.93278,654842,24,65484200000,0.9349719553677136,-0.0021919553677135,0,-0.02137305
2021-06-18,0.93283,0.93409,0.92866,0.93176,598205,24,59820500000,0.9343295642941708,-0.0025695642941708,0,-0.03018013
2021-06-21,0.93221,0.93596,0.93006,0.93032,659674,24,65967400000,0.9335276514353368,-0.0032076514353367,0,-0.047099706
2021-06-22,0.93032,0.93289,0.9282,0.92944,542609,24,54260900000,0.9327101211482696,-0.0032701211482695,0,-0.049221348
2021-06-23,0.92934,0.93266,0.92737,0.93204,519669,24,51966900000,0.9325760969186158,-0.0005360969186157,0,-0.038502492
2021-06-24,0.93194,0.93505,0.9307,0.93419,511917,24,51191700000,0.9328988775348928,0.0012911224651072,1,0.0010651994
2021-06-25,0.93419,0.93588,0.93168,0.93173,477689,24,47768900000,0.9326651020279144,-0.0009351020279143,1,0.028198695
2021-06-28,0.93115,0.9346,0.93104,0.93289,466380,24,46638000000,0.9327100816223316,0.0001799183776685,0,-0.0035845214
2021-06-29,0.93294,0.93389,0.92896,0.93129,460331,24,46033100000,0.9324260652978652,-0.0011360652978653,1,0.010356945
2021-06-30,0.93139,0.9327,0.92739,0.92944,483437,24,48343700000,0.9318288522382924,-0.0023888522382923,0,-0.008792078
2021-07-01,0.92934,0.92985,0.92605,0.92889,492096,24,49209600000,0.931241081790634,-0.0023510817906339,0,-0.031056367
2021-07-02,0.92889,0.9291,0.92468,0.92683,488043,24,48804300000,0.9303588654325072,-0.0035288654325071,0,-0.038822636
2021-07-05,0.9264,0.93074,0.92531,0.92885,402300,24,40230000000,0.930057092346006,-0.0012070923460059,0,-0.04695855
2021-07-06,0.92885,0.93759,0.92814,0.93403,538178,24,53817800000,0.9308516738768048,0.0031783261231952,0,-0.021971578
2021-07-07,0.93403,0.93659,0.9327,0.93368,550678,24,55067800000,0.931417339101444,0.002262660898556,1,0.039824117
2021-07-08,0.93368,0.93564,0.9298,0.93085,517326,24,51732600000,0.9313038712811552,-0.0004538712811552,1,0.027210375
2021-07-09,0.93085,0.9352,0.92875,0.93055,415415,24,41541500000,0.9311530970249242,-0.0006030970249242,1,0.0048928307
2021-07-12,0.93041,0.93372,0.92979,0.93023,517477,24,51747700000,0.9309684776199396,-0.0007384776199395,0,-0.0029013099
2021-07-13,0.92998,0.93543,0.92972,0.93089,519845,24,51984500000,0.9309527820959516,-6.278209595156348e-05,0,-0.00890952
2021-07-14,0.93134,0.93619,0.92945,0.93514,572669,24,57266900000,0.9317902256767612,0.0033497743232386,0,-0.0065771365
2021-07-15,0.9351,0.93746,0.9324,0.93454,606367,24,60636700000,0.9323401805414092,0.0021998194585909,1,0.04534265
2021-07-16,0.93454,0.93581,0.93207,0.9325,558163,24,55816300000,0.9323721444331272,0.0001278555668726,1,0.035252348
2021-07-19,0.93257,0.94185,0.93141,0.93584,703107,24,70310700000,0.933065715546502,0.0027742844534981,1,0.007247507
2021-07-20,0.93579,0.93671,0.92888,0.92929,604026,24,60402600000,0.9323105724372016,-0.0030205724372015,1,0.04533274
2021-07-21,0.92929,0.93052,0.92162,0.92319,598421,24,59842100000,0.9304864579497611,-0.0072964579497613,0,-0.032327015
2021-07-22,0.92318,0.92833,0.92173,0.92625,558083,24,55808300000,0.929639166359809,-0.003389166359809,0,-0.10366395
2021-07-23,0.92613,0.92882,0.92389,0.9249,328156,24,32815600000,0.9286913330878472,-0.0037913330878472,0,-0.057408392
2021-07-26,0.92448,0.92651,0.92259,0.9261,451712,24,45171200000,0.928173066470278,-0.0020730664702779,0,-0.067678034
2021-07-27,0.92595,0.9277,0.92369,0.92725,576126,24,57612600000,0.9279884531762224,-0.0007384531762224,0,-0.037190855
2021-07-28,0.92725,0.92803,0.92146,0.92354,610575,24,61057500000,0.927098762540978,-0.0035587625409779,0,-0.003920776
2021-07-29,0.92345,0.92383,0.91972,0.91985,507505,24,50750500000,0.9256490100327824,-0.0057990100327824,0,-0.039824232
2021-07-30,0.91985,0.92135,0.91449,0.91513,558364,24,55836400000,0.923545208026226,-0.0084152080262259,0,-0.080840565
2021-08-02,0.91464,0.92136,0.91391,0.92014,532692,24,53269200000,0.9228641664209808,-0.0027241664209808,0,-0.11218506
2021-08-03,0.92004,0.9277,0.9195,0.92689,560790,24,56079000000,0.9236693331367848,0.0032206668632153,0,-0.04297623
2021-08-04,0.92694,0.93105,0.92435,0.92534,514866,24,51486600000,0.9240034665094278,0.0013365334905722,1,0.039509892
2021-08-05,0.92529,0.92734,0.92396,0.92514,494929,24,49492900000,0.9242307732075422,0.0009092267924577,1,0.020128116
2021-08-06,0.92505,0.92568,0.92245,0.92254,467794,24,46779400000,0.9238926185660338,-0.0013526185660337,1,0.020984437
2021-08-09,0.92256,0.9244,0.92078,0.92174,540366,24,54036600000,0.9234620948528272,-0.0017220948528271,0,-0.016120648
2021-08-10,0.92174,0.92367,0.91953,0.92004,451503,24,45150300000,0.9227776758822616,-0.0027376758822617,0,-0.022721212
2021-08-11,0.92004,0.92304,0.918,0.92174,418322,24,41832200000,0.9225701407058092,-0.0008301407058093,0,-0.033272974
2021-08-12,0.92169,0.92244,0.91746,0.91844,424480,24,42448000000,0.9217441125646476,-0.0033041125646474,0,-0.018632345
2021-08-13,0.91844,0.92324,0.91746,0.92179,380863,24,38086300000,0.921753290051718,3.67099482819766e-05,0,-0.04219409
2021-08-16,0.92129,0.92284,0.91931,0.92219,280818,24,28081800000,0.9218406320413745,0.0003493679586255,1,0.011504816
2021-08-17,0.92199,0.92272,0.91516,0.91549,545264,24,54526400000,0.9205705056330996,-0.0050805056330995,1,0.0042043165
2021-08-18,0.91544,0.91673,0.91318,0.91509,531740,24,53174000000,0.9194744045064798,-0.0043844045064798,0,-0.067884475
2021-08-19,0.91504,0.91729,0.91183,0.91674,681793,24,68179300000,0.918927523605184,-0.0021875236051839,0,-0.0577763
2021-08-20,0.91664,0.92059,0.9133,0.9133,567302,24,56730200000,0.9178020188841473,-0.0045020188841472,0,-0.026518984
2021-08-23,0.91317,0.91621,0.91127,0.91198,462197,24,46219700000,0.916637615107318,-0.0046576151073178,0,-0.06138783
2021-08-24,0.91175,0.91626,0.91079,0.91359,448529,24,44852900000,0.9160280920858545,-0.0024380920858544,0,-0.07329327
2021-08-25,0.91339,0.91758,0.91192,0.91594,476479,24,47647900000,0.9160104736686836,-7.047366868362381e-05,0,-0.032630175
2021-08-26,0.91599,0.91842,0.91406,0.91789,483635,24,48363500000,0.9163863789349468,0.001503621065053,1,0.0062084435
2021-08-27,0.91794,0.92303,0.91714,0.92229,484537,24,48453700000,0.9175671031479576,0.0047228968520425,1,0.025380025
2021-08-30,0.92106,0.92301,0.91813,0.91964,420295,24,42029500000,0.917981682518366,0.0016583174816339,1,0.06905031
2021-08-31,0.91939,0.92412,0.91884,0.92279,511139,24,51113900000,0.918943346014693,0.003846653985307,1,0.045650553
2021-09-01,0.92279,0.93033,0.92121,0.92934,491780,24,49178000000,0.9210226768117544,0.0083173231882456,1,0.074067675
2021-09-02,0.92954,0.93351,0.92829,0.92873,398576,24,39857600000,0.9225641414494036,0.0061658585505963,1,0.123678625
2021-09-03,0.92863,0.9348,0.92798,0.9337,459330,24,45933000000,0.924791313159523,0.0089086868404769,1,0.0912471
2021-09-06,0.93279,0.93398,0.93105,0.93209,353078,24,34524300000,0.9262510505276184,0.0058389494723815,1,0.122373536
2021-09-07,0.93209,0.93509,0.92966,0.93369,462196,24,45768000000,0.9277388404220948,0.0059511595779052,1,0.08779394
2021-09-08,0.93384,0.9374,0.93211,0.93443,529573,24,52957300000,0.929077072337676,0.005352927662324,1,0.09316767
2021-09-09,0.93438,0.93759,0.93146,0.93269,543704,24,54370400000,0.9297996578701408,0.0028903421298592,1,0.08707432
2021-09-10,0.93264,0.93435,0.93021,0.93279,454857,24,45485700000,0.9303977262961126,0.0023922737038873,1,0.051717494
2021-09-13,0.93158,0.93458,0.93051,0.93169,502704,24,50270400000,0.9306561810368902,0.0010338189631098,1,0.04533878
2021-09-14,0.93145,0.93219,0.9271,0.92899,540124,24,54012400000,0.9303229448295122,-0.0013329448295121,1,0.015923526
2021-09-15,0.92899,0.92963,0.92531,0.92574,502820,24,50282000000,0.9294063558636098,-0.0036663558636097,0,-0.028898265
2021-09-16,0.92574,0.92727,0.92297,0.92338,500386,24,50038600000,0.928201084690888,-0.0048210846908879,0,-0.059375357
2021-09-17,0.92343,0.92865,0.92305,0.9284,525613,24,52561300000,0.9282408677527104,0.0001591322472896,0,-0.062448394
2021-09-20,0.92616,0.93151,0.92415,0.92958,612771,24,61277100000,0.9285086942021684,0.0010713057978316,1,0.014495428
2021-09-21,0.92953,0.93016,0.92524,0.92644,479264,24,47926400000,0.9280949553617348,-0.0016549553617346,1,0.019672714
2021-09-22,0.9265,0.92944,0.92357,0.92488,436830,24,43683000000,0.9274519642893878,-0.0025719642893877,0,-0.025109684
2021-09-23,0.92488,0.92533,0.91991,0.92274,552733,24,55273300000,0.9265095714315104,-0.0037695714315103,0,-0.033512104
2021-09-24,0.92269,0.92503,0.91655,0.91857,332151,21,33215100000,0.9249216571452084,-0.0063516571452083,0,-0.05029367
2021-09-27,0.91694,0.92131,0.91677,0.91994,329409,24,32940900000,0.9239253257161668,-0.0039853257161668,0,-0.09190337
2021-09-28,0.91994,0.9211,0.91574,0.91769,649753,24,64975300000,0.9226782605729336,-0.0049882605729334,0,-0.06732877
2021-09-29,0.91764,0.92043,0.9141,0.91479,433081,24,43308100000,0.9211006084583468,-0.0063106084583468,0,-0.08325275
2021-09-30,0.91499,0.92023,0.91414,0.91604,650921,24,64779000000,0.9200884867666776,-0.0040484867666775,0,-0.09371932
2021-10-01,0.91594,0.92094,0.91531,0.91778,612821,24,61282100000,0.919626789413342,-0.001846789413342,0,-0.069079414
2021-10-04,0.91748,0.91986,0.91503,0.9161,654385,24,65438500000,0.9189214315306736,-0.0028214315306737,0,-0.03966147
2021-10-05,0.91624,0.91802,0.91461,0.91709,572348,24,57234800000,0.918555145224539,-0.0014651452245389,0,-0.043072976
2021-10-06,0.91695,0.91733,0.91335,0.91524,673060,24,67306000000,0.9178921161796312,-0.0026521161796311,0,-0.024336992
2021-10-07,0.91519,0.9191,0.91449,0.91714,540293,24,54029300000,0.917741692943705,-0.000601692943705,0,-0.03619361
2021-10-08,0.91719,0.91845,0.91042,0.91063,587515,24,58751500000,0.916319354354964,-0.0056893543549639,0,-0.013558766
2021-10-11,0.91135,0.91833,0.91003,0.91718,537200,24,53720000000,0.9164914834839714,0.0006885165160286,0,-0.084658004
2021-10-12,0.9172,0.92,0.91551,0.91594,555334,24,55533400000,0.9163811867871772,-0.0004411867871771,1,0.009320583
2021-10-13,0.91589,0.91834,0.91301,0.91794,403813,24,40381300000,0.9166929494297418,0.0012470505702582,0,-0.0028837298
2021-10-14,0.91784,0.91906,0.91622,0.91719,329869,24,32986900000,0.9167923595437936,0.0003976404562064,1,0.014050558
2021-10-15,0.91714,0.91926,0.91536,0.91615,340919,24,34091900000,0.9166638876350348,-0.0005138876350347,1,0.012887392
2021-10-18,0.91484,0.91917,0.91475,0.91724,471618,24,47161800000,0.916779110108028,0.0004608898919721,1,0.0013065785
2021-10-19,0.91719,0.92477,0.91663,0.92255,508179,24,50817900000,0.9179332880864224,0.0046167119135775,1,0.016463686
2021-10-20,0.92255,0.92675,0.92243,0.92549,512733,24,51273300000,0.919444630469138,0.006045369530862,1,0.061266866
2021-10-21,0.92554,0.92777,0.92206,0.92324,496463,24,49646300000,0.9202037043753104,0.0030362956246895,1,0.07266199
2021-10-22,0.92324,0.92619,0.92212,0.92238,555330,24,55533000000,0.9206389635002484,0.0017410364997516,1,0.056482326
2021-10-25,0.92292,0.92872,0.92254,0.92714,510870,24,51087000000,0.9219391708001988,0.0052008291998012,1,0.036789186
2021-10-26,0.92714,0.93033,0.92627,0.92899,488143,24,48814300000,0.9233493366401592,0.0056406633598409,1,0.08018238
2021-10-27,0.92894,0.93364,0.92488,0.9279,569855,24,56985500000,0.9242594693121272,0.0036405306878727,1,0.08747972
2021-10-28,0.9279,0.93248,0.92578,0.93109,616656,24,61665600000,0.9256255754497018,0.0054644245502981,1,0.06598484
2021-10-29,0.93099,0.93278,0.92941,0.9303,603700,24,60370000000,0.9265604603597616,0.0037395396402385,1,0.08929247
2021-11-01,0.93081,0.93144,0.92809,0.92994,511709,24,51170900000,0.9272363682878092,0.0027036317121906,1,0.0684596
2021-11-02,0.92994,0.93204,0.92027,0.92098,439672,24,43967200000,0.9259850946302476,-0.0050050946302474,1,0.032985736
2021-11-03,0.92103,0.92494,0.92041,0.92279,461397,24,46139700000,0.925346075704198,-0.002556075704198,0,-0.07074202
2021-11-04,0.92284,0.9247,0.91944,0.92149,460616,24,46061600000,0.9245748605633586,-0.0030848605633585,0,-0.035265617
2021-11-05,0.92149,0.92268,0.91777,0.92083,307457,20,30745700000,0.9238258884506868,-0.0029958884506868,0,-0.036310613
2021-11-08,0.91946,0.92489,0.91946,0.9233,261778,22,26177800000,0.9237207107605496,-0.0004207107605496,0,-0.040623974
2021-11-09,0.9232,0.92404,0.917,0.91734,384425,24,38442500000,0.9224445686084396,-0.0051045686084396,0,-0.0034684082
2021-11-10,0.91729,0.91809,0.91367,0.91474,430159,24,43015900000,0.920903654886752,-0.0061636548867518,0,-0.05602343
2021-11-11,0.91474,0.9196,0.91246,0.91669,368737,24,36873700000,0.9200609239094016,-0.0033709239094015,0,-0.08166011
2021-11-12,0.91664,0.92096,0.916,0.91912,302208,24,30220800000,0.9198727391275212,-0.0007527391275211,0,-0.0463195
2021-11-15,0.91832,0.92299,0.91787,0.91894,451522,24,45152200000,0.9196861913020172,-0.0007461913020171,0,-0.012251934
2021-11-16,0.91884,0.9208,0.91634,0.91679,515163,24,51516300000,0.9191069530416136,-0.0023169530416137,0,-0.009667663
2021-11-17,0.91679,0.91758,0.91367,0.91619,529382,24,52938200000,0.918523562433291,-0.002333562433291,0,-0.023232711
2021-11-18,0.91609,0.91893,0.91517,0.91644,493590,24,49359000000,0.9181068499466328,-0.0016668499466327,0,-0.029139161
2021-11-19,0.91649,0.91768,0.91319,0.91336,579411,24,57941100000,0.9171574799573065,-0.0037974799573063,0,-0.025780104
2021-11-22,0.91437,0.91952,0.91339,0.91734,415355,24,41535500000,0.9171939839658452,0.0001460160341548,0,-0.048088234
2021-11-23,0.91734,0.92031,0.91459,0.91528,498932,24,49893200000,0.9168111871726762,-0.0015311871726761,1,0.0043024234
2021-11-24,0.91513,0.91608,0.91007,0.91109,467205,24,46720500000,0.915666949738141,-0.004576949738141,0,-0.021083426
2021-11-25,0.91099,0.91199,0.90839,0.90899,256191,21,25619100000,0.9143315597905128,-0.0053415597905128,0,-0.07259465
2021-11-26,0.9087,0.91337,0.90676,0.91033,696717,24,69671700000,0.9135312478324102,-0.0032012478324102,0,-0.07836729
2021-11-29,0.9096,0.91197,0.90745,0.90964,683713,24,68371300000,0.9127529982659284,-0.0031129982659282,0,-0.03793436
2021-11-30,0.90927,0.91519,0.90624,0.91044,780494,24,78049400000,0.9122903986127426,-0.0018503986127426,0,-0.04769708
2021-12-01,0.91034,0.91312,0.90934,0.91059,718644,24,71864400000,0.9119503188901942,-0.0013603188901941,0,-0.03423417
2021-12-02,0.91059,0.91254,0.90785,0.90834,767839,24,76783900000,0.9112282551121554,-0.0028882551121554,0,-0.021875814
2021-12-03,0.90824,0.90875,0.8971,0.89849,752805,24,75280500000,0.9086806040897244,-0.0101906040897243,0,-0.043338552
2021-12-06,0.89721,0.90182,0.89698,0.89914,606349,24,60634900000,0.9067724832717796,-0.0076324832717794,0,-0.14827175
2021-12-07,0.89904,0.90286,0.89811,0.89964,532527,24,53252700000,0.9053459866174236,-0.0057059866174236,0,-0.11881306
2021-12-08,0.89969,0.9086,0.89936,0.90724,595635,24,59563500000,0.905724789293939,0.001515210706061,0,-0.088068135
2021-12-09,0.90719,0.9095,0.90525,0.90854,486977,24,48697700000,0.9062878314351512,0.0022521685648487,1,0.012841573
2021-12-10,0.90854,0.91275,0.90675,0.91184,473862,24,47386200000,0.907398265148121,0.0044417348518789,1,0.033803172
2021-12-13,0.91097,0.91408,0.90887,0.91284,498695,24,49869500000,0.9084866121184968,0.004353387881503,1,0.067401096
2021-12-14,0.91279,0.91509,0.90927,0.91357,471118,24,47111800000,0.9095032896947975,0.0040667103052023,1,0.07070795
2021-12-15,0.91354,0.92132,0.91248,0.91924,382711,20,38271100000,0.9114506317558382,0.0077893682441617,1,0.06916544
2021-12-16,0.91907,0.92311,0.91692,0.91745,550122,24,55012200000,0.9126505054046706,0.0047994945953293,1,0.107268125
2021-12-17,0.91747,0.91961,0.91545,0.91784,569492,24,56949200000,0.9136884043237364,0.0041515956762634,1,0.075669385
2021-12-20,0.91861,0.92235,0.91568,0.91984,629714,24,62971400000,0.9149187234589892,0.0049212765410107,1,0.06761848
2021-12-21,0.91974,0.92468,0.91847,0.92374,299032,24,29903200000,0.9166829787671916,0.0070570212328084,1,0.08016174
2021-12-22,0.92364,0.92825,0.91984,0.92574,410098,24,41009800000,0.9184943830137532,0.0072456169862468,1,0.10403263
2021-12-23,0.92564,0.92864,0.92192,0.92719,248164,24,24816400000,0.9202335064110024,0.0069564935889974,1,0.10267253
2021-12-24,0.92719,0.92872,0.9243,0.92504,513819,24,51381900000,0.921194805128802,0.0038451948711978,1,0.09783738
2021-12-27,0.92459,0.92734,0.92423,0.92529,298126,24,29812600000,0.9220138441030415,0.0032761558969582,1,0.06356952
2021-12-28,0.92534,0.92852,0.92229,0.92629,329660,24,32966000000,0.9228690752824334,0.0034209247175664,1,0.052484445
2021-12-29,0.92561,0.9302,0.92342,0.9265,334414,24,33441400000,0.9235952602259468,0.0029047397740531,1,0.05127447
2021-12-30,0.9265,0.93023,0.92292,0.92316,165957,24,16595700000,0.9235082081807576,-0.0003482081807575,1,0.04625385
2021-12-31,0.92317,0.92551,0.91661,0.91906,276616,24,27661600000,0.922618566544606,-0.003558566544606,1,0.0048132776
