Predicted,Actual
-0.013819009,-0.015162166
-0.016574958,-0.017335854
-0.020137932,-0.02828717
-0.030330574,-0.033700116
-0.03578567,-0.029855557
-0.030659476,-0.030557057
-0.029978901,-0.040218588
-0.041208692,-0.039309897
-0.0394418,-0.043862246
-0.040744767,-0.038227677
-0.034175757,-0.00044842716
0.005683889,0.016552957
0.021035876,0.02254142
0.021676224,0.02900569
0.026000975,0.026579484
0.023614658,0.026435189
0.02305361,0.03217687
0.028950555,0.031770065
0.029908871,0.021232028
0.018136257,0.018143727
0.014517776,0.0077176094
0.0042323098,0.005980139
0.0027944443,0.026530461
0.02672821,0.0267815
0.02555192,0.040354006
0.038268406,0.034063816
0.03061822,-0.030992348
-0.041420776,-0.05193116
-0.05724147,-0.072288536
-0.068417795,-0.07433569
-0.06770151,-0.007732039
0.0024527241,0.013899207
0.020141542,0.023517082
0.022738665,0.0258482
0.023201605,-0.01364336
-0.018935408,-0.027187748
-0.028545912,-0.030099934
-0.028030856,-0.032246057
-0.02851667,-0.019642739
-0.01725842,-0.015349751
-0.013901402,-0.013161079
-0.012546896,-0.011020135
-0.010004905,-0.016572751
-0.013750245,-0.016707983
-0.015408656,-0.009015718
-0.0061419583,-0.0030026492
0.0010113693,-0.008094998
-0.006379692,-0.0038978385
-0.00235667,0.022317946
0.026109379,0.028530994
0.02935234,0.04308804
0.041857433,0.04260502
0.039564386,-0.011549775
-0.021027079,-0.026429454
-0.033884678,-0.026524726
-0.027561052,-0.028233707
-0.027872473,0.02971829
0.035615966,0.04316463
0.04532621,-0.011622477
-0.018180104,-0.028412413
-0.034897655,-0.026552476
-0.023788547,-0.028912269
-0.025040999,-0.020749377
-0.018967941,-0.019720621
-0.019589862,-0.019378196
-0.01910942,-0.020667054
-0.022054642,-0.032806963
-0.03358759,-0.03834996
-0.03488666,-0.033657752
-0.029266825,-0.033956334
-0.029682606,-0.044025227
-0.03846597,-0.042893615
-0.036328483,-0.04650434
-0.041564412,-0.04039637
-0.035504177,-0.0014490635
0.006847709,0.017135875
0.024233254,0.019297354
0.020185167,0.026796298
0.026325783,0.035177484
0.034427866,0.036197916
0.034038126,0.05258641
0.049914263,0.0531031
0.050164025,0.0018490221
-0.0055339616,-0.013850924
-0.020770075,0.0018847261
0.0028931347,0.0061364593
0.008507211,0.016391827
0.015131231,0.01990099
0.016646367,0.025084358
0.021892952,0.024997225
0.023070946,0.008798533
0.0054798895,0.0024607996
-0.0010575249,0.0005266799
-0.0018967584,-0.0015145517
-0.004811818,0.001223185
-0.0024929813,0.0014351889
-0.0006754356,0.00033465543
-0.0012155758,-0.00027860203
-0.0026081987,-0.0014246443
-0.002931316,-0.0021792378
-0.004037373,-0.0021781276
-0.0045859646,-0.0025248078
-0.0047113285,-0.0036408808
-0.0056515043,-0.08671923
-0.07817872,-0.0009749221
0.0045573288,-0.0015349011
0.006893457,-0.011565499
-0.014055831,-0.01539378
-0.016644793,-0.0071448656
-0.006098641,-0.0062759453
-0.002793155,-0.013960626
-0.014140245,-0.018583274
-0.01933683,-0.01553419
-0.014520498,-0.017893244
-0.017949484,-0.034654133
-0.03563688,-0.04090085
-0.038846496,-0.03924811
-0.035536904,-0.039094564
-0.0366324,-0.03512957
-0.033248823,-0.028449781
-0.025972093,-0.037039272
-0.036012262,-0.030846942
-0.029396823,0.0134567
0.018534482,0.028084602
0.031163683,0.042299964
0.04113515,0.043556266
0.03978666,-0.0019498442
-0.011561468,-0.017441116
-0.024116617,-0.02268516
-0.023654228,-0.025191655
-0.024430973,-0.0051441477
-0.0039191335,0.0016396081
0.0009517321,0.0022972643
0.00022551202,0.0037507678
0.002111865,-0.0008885296
-0.002006707,-0.00227266
-0.0034794118,0.00073868386
0.00060363533,0.0009867618
0.0014923364,-0.00174931
-0.0029698117,-0.0004228979
-0.00086754607,-0.007271587
-0.008305678,-0.007688565
-0.0093492195,0.021460127
0.023527067,0.030603675
0.03197682,0.0067262226
0.001903467,0.0013240072
-0.002693841,0.015719
0.016370244,0.01973135
0.019176308,0.013363463
0.010554056,0.012313803
0.008348968,0.018717209
0.015015939,0.017761158
0.015603091,0.019381896
0.016931338,0.015288703
0.011839979,-0.0074438173
-0.012790079,-0.01800831
-0.021856591,-0.022484627
-0.023451433,-0.026834408
-0.026950374,-0.025811387
-0.024898896,-0.025742754
-0.025626304,-0.029206224
-0.029863715,-0.029764168
-0.029912882,-0.02691192
-0.025898388,-0.02620931
-0.024911525,-0.022528656
-0.02121568,-0.021522284
-0.022587582,-0.02884493
-0.029645992,-0.028577983
-0.028532322,-0.029500736
-0.029843166,-0.026076114
-0.024602324,-0.0052843736
-0.0008449193,0.005196316
0.008820155,0.0036046219
0.004144495,0.008170292
0.0076921345,0.018643951
0.019731488,0.019148063
0.019474652,0.038524594
0.03918378,0.03948823
0.038693096,-0.021421647
-0.031168418,-0.03766344
-0.044532992,-0.019924115
-0.0174827,-0.011386794
-0.0075627943,0.018253613
0.02301042,0.032195926
0.033099607,0.036141675
0.033842616,0.04044484
0.037139285,0.037858244
0.033560283,0.034003507
0.03000054,0.041675054
0.038345143,0.03731121
0.03295404,0.0027788056
-0.007227556,-0.010340464
-0.018191557,-0.018762348
-0.02333447,-0.021811616
-0.024362704,-0.0022843147
-0.0012453375,0.0034821555
0.0033446844,0.007763303
0.006010562,0.009000547
0.0068186955,-0.004784333
-0.008453435,-0.006748607
-0.0089840265,-0.009413456
-0.009392442,-0.0065852567
-0.0063582184,0.017699
0.01969513,0.028218169
0.02899268,0.029510356
0.027952332,0.032538533
0.02945795,0.033578206
0.030567769,0.032643426
0.03030787,0.035624247
0.03311794,0.032761082
0.029459218,0.017066872
0.011217193,0.009928296
0.0045998394,-2.0349419e-06
-0.0041681994,-0.004428773
-0.0076073906,0.0059719994
0.005979561,0.0061329445
0.005739411,0.007460837
0.0054960847,0.0044524525
0.0018538393,-0.016541671
-0.021404989,-0.02461558
-0.02772523,-0.026822383
-0.026875725,-0.027986184
-0.027689314,-0.01958872
-0.018709043,-0.014337275
-0.014018348,-0.017125145
-0.018515041,-0.013607286
-0.015665062,0.0045588245
0.0051523857,0.011854276
0.012727337,0.015840542
0.014033376,0.017509934
0.014054991,0.008313662
0.0043212897,0.079337016
0.07734044,-0.0052392352
-0.01292643,-0.0029985793
-0.011066714,0.0074219876
0.008568003,0.012279023
0.012379528,0.017049298
0.016080515,0.019543767
0.015817812,0.015212855
0.012195502,0.016326522
0.012629753,0.0128735965
0.009317547,0.013218982
0.012179348,0.036639128
0.03767052,0.045018833
0.042858195,0.022235438
0.014861514,0.017973902
0.011615132,0.041234765
0.039574195,0.04186671
0.03924843,0.04620705
0.041935336,0.037853062
0.03172153,-0.015767839
-0.02783878,-0.039368168
-0.047805108,-0.048280474
-0.0494199,-0.056778945
-0.05431058,-0.04948775
-0.04534275,-0.04744985
-0.04445375,-0.05436088
-0.051511854,-0.053511754
-0.05016818,-0.037484366
-0.03253199,-0.031341802
-0.02569796,-0.026581889
-0.022690913,-0.024286106
-0.022119224,-0.033378966
-0.031931553,-0.034532778
-0.03208079,-0.034650803
-0.0324121,-0.032597177
-0.030281212,-0.01994058
-0.015313709,-0.013892733
-0.010551667,-0.012856207
-0.011512893,-0.010474401
-0.008872175,-0.007954773
-0.0055796504,-0.0073626046
-0.0054930053,-0.0043555154
-0.0023065086,-0.0048550013
-0.0033966259,-0.01488449
-0.014863907,-0.018726459
-0.01895889,-0.020447096
-0.019863684,-0.021291226
-0.020293163,-0.018174065
-0.016276449,-0.017614271
-0.016113834,-0.014134335
-0.012915052,-0.012331007
-0.010278168,-0.0232037
-0.022331646,-0.025409577
-0.024164997,-0.008606324
-0.0049968045,-0.0034558862
-0.0012189441,-0.012984593
-0.014659462,-0.013546607
-0.015242993,-0.011379025
-0.011728512,-0.008447044
-0.0080921585,0.0013001428
0.001668573,0.006424866
0.00724301,0.010424637
0.009871315,0.013405642
0.012706812,0.01206961
0.01168022,0.0135047985
0.0136419125,0.014362434
0.014955504,0.016455095
0.016588556,0.023530401
0.024035275,0.026635168
0.026134914,0.028929658
0.027441705,0.029692762
0.027731473,0.0264326
0.02395135,0.02564896
0.023265438,0.021791266
0.01914378,0.020897187
0.017685274,0.028232412
0.026559856,0.02762008
0.025374021,0.031055432
0.027825402,0.027486514
0.023590894,0.0019587239
-0.004776925,-0.00820137
-0.013129913,-0.0137558365
-0.016152963,-0.016823605
-0.01770813,-0.004763614
-0.004476989,-0.0006924352
-0.0015742858,-0.0052364604
-0.0074802255,-0.005205566
-0.008058524,0.0010888788
0.0007891186,0.0007209244
0.0010500845,0.0051215785
0.005143352,0.002557922
0.00072040054,-0.022062838
-0.026616791,-0.03128353
-0.033484757,-0.03410692
-0.034140814,-0.035404287
-0.03378965,-0.025200719
-0.021454696,-0.019742636
-0.017573178,-0.020496119
-0.020195786,-0.017101467
-0.016651437,-0.0045329253
-0.0019529964,0.0019818484
0.005164803,0.002347583
0.0036818841,0.0047386396
0.005193089,0.009770125
0.009891456,0.010208748
0.009655549,0.013358653
0.012107392,0.011401409
0.009559424,-0.006237467
-0.008971461,-0.014325621
-0.017934404,-0.015514212
-0.017741399,-0.01853425
-0.018662905,-0.021916509
-0.022504298,-0.0230385
-0.023489695,-0.025343904
-0.024683567,-0.025195355
-0.024390284,-0.015412464
-0.014580283,-0.010294216
-0.010351825,-0.01637425
-0.01764495,-0.014833616
-0.016636586,0.0006398967
0.0016539347,0.0016155588
0.002095552,0.01521415
0.0150008295,0.012059435
0.01011766,-0.042182494
-0.04729789,-0.05912875
-0.059812374,-0.067016736
-0.06033454,-0.06171516
-0.054210186,-0.028255537
-0.020641955,0.039558712
0.04812926,0.0046640867
0.0035036604,0.0025368324
-0.0041750474,-0.008234669
-0.010355417,-0.013704963
-0.013238097,-0.01486192
-0.0125192925,-0.017633881
-0.016506579,-0.020396406
-0.018514981,-0.021255152
-0.019554524,-0.028392432
-0.027747614,-0.028795352
-0.026392842,-0.014580358
-0.010092991,-0.012987924
-0.010468349,-0.0015678302
-6.5373846e-05,-0.0031983736
-0.0024384302,-0.044105884
-0.046937823,-0.05465243
-0.05541472,-0.06501398
-0.059928164,-0.0623767
-0.055776898,-0.009374422
-0.0006154067,0.011963053
0.018000912,0.016368886
0.016180584,0.02166584
0.019007677,0.016378507
0.01362159,0.014064038
0.012688591,0.010867329
0.009309837,0.0076147523
0.006014662,0.0015289813
-0.00040567492,-0.008800568
-0.012033877,0.0044230386
0.00433096,-0.0037017441
-0.0033502886,-0.06872109
-0.07041183,-0.08807191
-0.07947154,-0.10666592
-0.08610135,-0.10482133
-0.08336039,-0.025920348
-0.010468204,0.0063512386
0.018290304,0.013348478
0.015761599,0.023649909
0.02369066,0.018403644
0.018096495,0.017732669
0.017929293,0.026174532
0.025916893,0.026534531
0.024593825,0.008504577
0.0031563563,0.0017206358
-0.004665898,0.0042517334
0.001918717,0.0036860197
0.0024378311,0.0010531748
-0.00040895044,0.003113831
0.0010262601,0.0006247271
-0.0011475455,0.0047980226
0.003735388,0.028895989
0.031208653,0.03999789
0.041442025,0.04343213
0.041423526,0.047662962
0.043813273,0.047946557
0.042435784,0.04818798
0.04253623,0.051822938
0.04680513,0.05121634
0.04649143,0.04168116
0.035079427,0.037941676
0.03116207,0.03350957
0.027517604,0.031529944
0.02572637,0.038373824
0.033708952,0.038002722
0.033855397,0.039117686
0.03455373,0.036106527
0.03053759,0.01781018
0.011329787,0.009746816
0.0045428323,0.008077609
0.0058062575,0.0052875187
0.004223209,0.0066292854
0.0054424587,0.008394505
0.0069901193,-7.7327786e-05
-0.0028555396,0.00076791306
-0.0017359265,0.024232088
0.024946412,0.029359771
0.029197292,0.03692513
0.034161925,0.034359436
0.029735107,-0.002688158
-0.012170125,-0.016492093
-0.02416928,-0.023821954
-0.028748844,-0.027326124
-0.030285338,-0.009084165
-0.00941702,-0.0036591953
-0.0048329444,-0.004729205
-0.008232082,-0.0047760084
-0.0073978333,-0.009359067
-0.011275281,-0.011894605
-0.012746431,-0.011825787
-0.012164259,-0.013325909
-0.01618245,-0.018271742
-0.022718122,-0.020726252
-0.024006227,-0.021065533
-0.02385781,-0.022099838
-0.02355425,-0.022203434
-0.021872,-0.021338215
-0.021060275,-0.026850687
-0.027482886,-0.02618822
-0.026502004,-0.012192447
-0.01078552,-0.0063022147
-0.0051013245,-0.0043814145
-0.00525453,-0.0021720228
-0.0026277339,-0.003220388
-0.005018737,-0.0027930501
-0.005715522,-0.0016150038
-0.004031558,-0.0009301534
-0.0029929439,-0.0002519628
-0.0016022453,0.00013486114
-0.0009392592,0.00027804705
-0.00030182803,0.00020053427
-0.00010855305,6.789306e-05
-0.0006421339,-0.00027527212
-0.0013631379,-0.0016048291
-0.0034867416,-0.002416771
-0.0038273835,-0.0023686723
-0.0024320332,-0.0038066362
-0.004518901,-0.002872228
-0.0033885562,-0.004626718
-0.005084242,-0.014080687
-0.015536091,-0.017807776
-0.019011326,-0.02041657
-0.019546295,-0.021289932
-0.019791618,-0.015525866
-0.013658571,-0.013675364
-0.011700303,-0.012323238
-0.011455659,-0.011683156
-0.011884902,-0.01504895
-0.014899971,-0.017611867
-0.019339876,0.00038608396
0.0027632224,0.00045212707
0.0017984653,0.000139856
-0.00019481331,0.0024432251
0.0022804616,-0.00998731
-0.011378403,-0.013823545
-0.012907497,0.02867418
0.033458173,0.039642148
0.04298129,-0.014067737
-0.019605221,-0.027925322
-0.034732986,0.0042104796
0.0067359773,0.012278839
0.015992828,0.006186778
0.0041187424,0.0056452984
0.0028549836,0.0047351248
0.0036191603,0.00436495
0.0034190908,0.0044232234
0.004507651,0.004472432
0.004929705,0.00523868
0.0055917967,0.006147929
0.0036152038,0.0045858338
0.004631608,0.005140633
0.0048138825,0.011195879
0.01116165,0.012741695
0.011318968,0.014198899
0.012437172,0.013773781
0.01153206,0.005420715
0.00087868393,0.0017015813
-0.0013745499,0.0030431629
0.00078406057,0.0021176345
0.0002972613,-0.0021057948
-0.0033961684,-0.0022534207
-0.0031777618,-0.0047303145
-0.0052529057,-0.003257942
-0.0034002655,0.011613968
0.012930135,0.01798537
0.019001981,0.017023584
0.0153957885,0.018322062
0.015675,0.021403149
0.01943091,0.020378092
0.018303411,0.022608018
0.020358102,0.019448863
0.016516961,0.00037313433
-0.0045994236,-0.00872879
-0.012461492,-0.011770288
-0.013279723,-0.015804099
-0.016204545,-0.017674025
-0.017690292,-0.019211331
-0.019598471,-0.022555295
-0.023162296,-0.023529662
-0.023549045,-0.017981486
-0.016916387,-0.015960233
-0.0148437,-0.018272113
-0.01796346,-0.01834167
-0.017793577,-0.014645661
-0.013581229,-0.01487339
-0.014312412,-0.013603401
-0.013505008,-0.015228394
-0.01525981,-0.028474385
-0.030104335,-0.034758657
-0.03566863,-0.03150016
-0.030292977,-0.03278754
-0.031297434,-0.04214901
-0.041458443,-0.04195791
-0.04038694,-0.046728555
-0.043405972,-0.042268887
-0.037986882,-0.008637403
-0.0029260423,0.006185668
0.011227881,0.010933002
0.01192122,0.015967079
0.015055932,0.013948971
0.012441255,0.01365224
0.012812852,0.0145383645
0.014074922,0.013451151
0.01230011,0.00821876
0.0057148556,0.0032263077
1.7930612e-05,0.0051123286
0.002645646,0.0008324762
-0.0002989233,-0.019011721
-0.02107438,-0.02704049
-0.028861653,-0.033227086
-0.03265606,-0.035449427
-0.03361693,-0.022618748
-0.019374609,-0.01871277
-0.01632087,-0.017080376
-0.015972342,-0.016330224
-0.015834177,-0.02285147
-0.022807285,-0.02395626
-0.022775302,-0.024536774
-0.023270797,-0.0232629
-0.02191286,-0.014152835
-0.012071986,-0.009817114
-0.00847472,-0.008639993
-0.0081546875,-0.0067661814
-0.006537504,-0.0052864086
-0.0053621815,-0.004410089
-0.0036948344,-0.003045013
-0.002449149,-0.0025949208
-0.003164624,-0.0056782276
-0.006388345,-0.0071824198
-0.0071410825,-0.004049904
-0.0035534967,-0.004089123
-0.0035867407,-0.010966301
-0.010187085,-0.011374955
-0.010706446,-0.014316001
-0.013847612,-0.012521552
-0.0108342,0.0072623375
0.010319627,0.015517356
0.017330157,0.012348212
0.010974419,0.013227861
0.010967842,0.018739779
0.017203284,0.01611119
0.013850702,0.020080252
0.017498054,0.014052198
0.0108122695,-0.023956815
-0.03050376,-0.04174313
-0.04650227,-0.043182574
-0.042978592,-0.049260575
-0.046248343,-0.05759607
-0.054323804,-0.0581061
-0.054332647,-0.065890305
-0.06009216,-0.062065724
-0.055159185,-0.024332909
-0.01596177,-0.0075374246
7.7592194e-05,-0.0031376954
-0.0004945458,0.0031830189
0.0031662004,0.0040158653
0.004181521,0.002938271
0.0021560711,0.006708648
0.005969052,0.006260036
0.005629434,0.0009014792
-0.0007790788,-0.0014773677
-0.004337178,-0.00047784133
-0.0016817943,-0.00094217807
-0.0009591871,-0.0035481986
-0.0036472904,-0.0033139952
-0.0034536242,-0.0049807974
-0.0052889837,-0.0035411688
-0.003631537,0.007544454
0.008103614,0.012290494
0.012133421,0.013607101
0.012711717,0.015064304
0.01319854,0.013900133
0.011659895,0.013275036
0.011001474,0.0143968435
0.011638673,0.013558447
0.01022134,0.009364062
0.005865126,0.007510785
0.0041585397,0.0035846424
0.00041908256,0.0019962778
2.3733463e-05,0.007408483
0.0059825177,0.0067336224
0.004876924,0.007479706
0.005225846,0.0043575503
0.001564287,-0.012303813
-0.017333707,-0.02008284
-0.023125693,-0.023005757
-0.023464851,-0.025233649
-0.024837257,-0.027025877
-0.02573755,-0.02883272
-0.026965287,-0.01655906
-0.014931958,-0.008974464
-0.006866669,-0.042096842
-0.04300626,-0.046991985
-0.046641104,0.023218315
0.032943737,0.04406944
0.051085774,0.00332602
-0.003236212,-0.0064191315
-0.014451124,0.005279009
0.004576267,0.0064533553
0.006816864,0.000595313
-0.0026498765,-0.0004025485
-0.003757644,-0.0032005934
-0.0060220733,-0.0024532147
-0.0062512653,0.006917877
0.006490037,0.00837101
0.00839735,0.018860396
0.018230649,0.018498916
0.016257953,-0.01031253
-0.015920423,-0.015346606
-0.019141234,-0.02969498
-0.03147783,-0.026305323
-0.026418248,0.034166116
0.040611446,0.053280327
0.05667943,0.06576321
0.06231471,0.0662307
0.059527602,0.016008148
0.0042079776,-0.0029538106
-0.012159408,-0.0075622136
-0.011142877,-0.01273966
-0.013708429,-0.0033123302
-0.0042097587,-0.0011144081
-0.004163563,-0.0038682395
-0.0068179946,-0.0041414765
-0.0059344415,-0.002585116
-0.0035905452,-0.002068241
-0.0021548434,-0.0019335647
-0.0023085475,-0.0016632874
-0.002581568,-0.0023673773
-0.0035515914,-0.0025623618
-0.0038070695,-0.00055886904
-0.00046725853,-0.0006408217
-0.0010819195,-0.0018216429
-0.0035120887,-0.000120801546
-0.0007478811,-0.011322786
-0.014054768,-0.01483676
-0.016829401,0.023501357
0.025081962,0.033554155
0.034171402,-0.014939062
-0.022470392,-0.027630255
-0.03428068,0.0034164824
0.005512781,0.012833268
0.01576846,-0.0012969979
-0.0046679433,-0.004618763
-0.010296738,0.021926869
0.021626938,0.028022444
0.027913101,-0.007923324
-0.015210503,-0.016253265
-0.020955723,-0.0008962994
0.0004946812,0.0047660186
0.00479899,0.016885761
0.015700992,0.022451513
0.021251203,0.01991098
0.017210467,0.015905846
0.011949243,0.02519406
0.023205705,0.020811535
0.01866191,-0.01958243
-0.02730908,-0.035128832
-0.041898716,-0.040080767
-0.042046756,-0.041724633
-0.040660117,-0.0300461
-0.026497947,-0.024652395
-0.02115105,-0.006574157
-0.0034555912,-3.5148994e-06
0.0022655476,-0.013694974
-0.013920017,-0.016806955
-0.015810046,-0.013845559
-0.011800003,-0.013210102
-0.012593734,-0.0121979965
-0.013392689,-0.01170295
-0.0132715795,-0.0109851705
-0.0120282965,-0.010562828
-0.010948599,-0.012345622
-0.012003496,-0.013061366
-0.012751424,-0.009668194
-0.009560357,-0.009749776
-0.010205852,-0.013491294
-0.013848835,-0.011298552
-0.011068144,-0.025968263
-0.025921231,-0.028816625
-0.027380744,0.0251578
0.03206208,0.040297028
0.043341562,-0.012324163
-0.020094734,-0.024223393
-0.031306285,-0.00072221935
0.00078894367,-0.010568563
-0.0132120075,0.0080654
0.009664338,0.0044607776
0.003956839,-0.022523476
-0.027030203,-0.03475773
-0.038425393,-0.034044575
-0.0312813,-0.03702817
-0.03148336,-0.044798505
-0.04213056,-0.044793878
-0.04294565,-0.04377271
-0.04073807,-0.03883557
-0.03514659,-0.01431045
-0.009104261,0.003287911
0.008036903,-0.009059746
-0.010063711,-0.0018971207
-0.004000061,0.064750925
0.070641465,0.08404587
0.08915026,0.06849299
0.06380202,0.05394057
0.04443279,0.03145317
0.020787813,-0.0036495756
-0.014284071,-0.038524963
-0.04497537,-0.05002886
-0.051266607,-0.24159995
-0.111503504,-0.3033399
-0.11488422,-0.12881866
-0.07789953,-0.05668867
-0.023487126,-0.18848594
-0.1107802,-0.17984408
-0.11129584,0.09836409
0.09584756,0.13471371
0.08326009,0.28248546
0.072376944,-0.18680008
-0.10065462,0.14477113
0.09700202,0.12663369
0.0930719,0.038115386
0.018156443,-0.084912755
-0.08355616,-0.05357891
-0.061307445,-0.05192043
-0.04630757,0.05236035
0.0611365,0.091337435
0.093082346,0.11300457
0.103364564,0.123721875
0.10451499,0.08393247
0.072482556,0.07012872
0.0644978,0.07258434
0.07244607,0.06781462
0.06261682,0.05960511
0.05339413,0.053025033
0.047929667,0.049092785
0.04239906,0.043602884
0.036762934,0.034281
0.026716081,0.028013194
0.02263542,0.023764236
0.017138327,0.019555422
0.016747639,0.016441034
0.014111553,0.01378673
0.008113688,0.0099965595
0.00519289,0.008081864
0.0059399894,0.009805645
0.009358905,0.00960807
0.005772994,0.009814524
0.0067386054,0.009460259
0.007747647,0.0061347946
0.00482919,0.0056044147
0.005000292,0.005280489
0.0051989555,0.0062121223
0.0059922724,0.012173577
0.012559737,0.01554344
0.016948149,0.015250964
0.015516321,0.017436491
0.014598514,0.022161257
0.015828127,0.023425326
0.019993491,0.03253502
0.03131053,0.03331033
0.027392507,0.015040625
0.006561226,0.013737337
0.009676855,0.00065247633
-0.005175815,0.0042182496
0.0012255072,0.058486447
0.059769567,0.07418251
0.0719525,0.0862573
0.07736945,0.08450688
0.07192586,0.02918717
0.014373872,0.0073761092
-0.0062344684,0.00095031783
-0.008922869,-0.0058206734
-0.013248039,0.0033376745
0.002452661,0.004869431
0.002203883,0.0010257957
-0.0028928365,0.00025584767
-0.004011695,0.0017541199
0.005239012,0.0019836982
0.0024913284,0.0034366467
0.003087679,0.0037622375
-0.00052504375,0.0004510171
-0.0040839235,0.0006458165
-0.003533017,-0.0001888796
-0.0051625865,0.0015517356
0.0008143244,0.011719599
0.01028206,0.01640903
0.013864376,0.018494846
0.01824446,0.020475585
0.019365808,0.019715626
0.01553147,0.020045286
0.016161837,0.021189108
0.019465994,0.02168138
0.023581864,0.021282716
0.019606207,0.021149151
0.013936719,0.021707835
0.017634617,0.021191329
0.020034784,0.02101799
0.016066076,0.021434043
0.014829021,0.013515714
0.006746584,0.009567002
0.0073691253,0.030714672
0.028485965,0.034765687
0.03041688,-0.0013458366
-0.010733125,-0.011718675
-0.016674059,0.009809899
0.0070566903,0.01416856
0.014473202,0.009379972
0.0047194045,0.0076058726
0.0040015597,0.0028429986
-0.00034584317,0.00015336061
-0.0058424636,-0.00034668008
0.0007956173,-0.0015443359
0.00076812814,-0.003669925
-0.003655354,-0.0016218487
-0.004554573,-0.021003375
-0.021340739,-0.025453977
-0.026215492,-0.014716699
-0.014991645,-0.0114102885
-0.011233674,-0.0011515921
0.0012682523,0.0024953936
0.0018966966,-0.009845973
-0.0100228,-0.011536085
-0.008288139,-0.0081551215
-0.0050365776,-0.0059546097
0.00069393707,0.0073183905
0.010979082,0.017366009
0.021913134,-0.0023251986
-0.001668818,-0.0042509935
-0.009383169,0.061558098
0.068312146,0.07520405
0.076157376,0.026848651
0.016801588,0.0074058934
-0.0049488884,-0.013567327
-0.020785473,-0.02276286
-0.023884933,-0.03529884
-0.03466752,-0.035947617
-0.03722432,0.0055742604
0.008880949,0.021014659
0.023468034,0.017982041
0.014189288,0.020078031
0.01972661,0.019377641
0.017244687,0.0136912735
0.010600199,0.02447369
0.023826407,0.017768187
0.014967353,-0.034113765
-0.04247412,-0.052223265
-0.057163935,-0.06882876
-0.06609745,-0.06856533
-0.061519817,-0.030010212
-0.020324856,-0.01346928
-0.00652412,0.03044051
0.036268085,0.044639222
0.04704707,0.0012868232
-0.0031208536,-0.013395652
-0.015072809,-0.006544373
-0.0032706421,-0.010213558
-0.0067237406,-0.026159916
-0.025622446,-0.034201637
-0.03449762,-0.03288577
-0.031326644,-0.035231132
-0.032403946,-0.04366948
-0.04032116,-0.043758832
-0.03888191,-0.04777322
-0.041698124,-0.044723764
-0.038918186,-0.012132138
-0.0041055405,0.007821391
0.013355753,-0.015594314
-0.015376174,0.030147849
0.032443866,0.010303466
0.010151714,0.013443936
0.010297128,0.02342921
0.021967074,0.025753668
0.023611274,0.012824758
0.008961702,0.011471707
0.006489244,0.002725342
0.0002791443,0.0025915909
0.0017297354,0.038489815
0.04122364,0.048748694
0.04940079,0.033484228
0.027803862,0.028282361
0.021839648,0.021992542
0.017644964,0.017949112
0.01517331,0.012347842
0.009632012,0.009671709
0.0065945988,0.014551869
0.012527023,0.014487306
0.012338097,0.014428107
0.0126371635,0.012700257
0.011470533,0.0041052178
0.0031615417,0.0006894753
0.0006363365,-0.0023577577
-0.0021543982,-0.0032422172
-0.004672708,0.0026039856
0.0015126984,0.0038748991
0.0033170152,0.007240693
0.006128802,0.006889573
0.005572234,-0.0016706872
-0.0040545682,-0.0021788676
-0.004215939,-0.014233123
-0.016521482,-0.012981079
-0.014117639,0.020514434
0.024904968,0.03314143
0.036670055,0.038922332
0.037874468,0.04210498
0.03881832,0.030107519
0.024989074,0.02759196
0.022773718,0.023616055
0.019028733,0.022384545
0.01869988,0.04002305
0.039417762,0.04433472
0.04205687,0.02968092
0.02315572,0.02485367
0.01857034,0.027682424
0.023697412,0.026980184
0.023973702,0.022308143
0.018781653,0.020158134
0.016661888,0.022115562
0.019173827,0.02082171
0.01738319,0.019788144
0.016658293,0.017223563
0.013615804,0.008569695
0.0038789911,0.003815516
-0.00010762471,0.002033647
-0.0010748602,-0.00046230177
-0.0024788498,-0.0031787641
-0.0052633137,-0.0046709315
-0.0068189004,-0.0068238997
-0.009024861,-0.007543344
-0.009014428,-0.003425547
-0.0047648246,-0.0017955586
-0.003148027,-0.0042722677
-0.0066550593,-0.0042045596
-0.006248813,0.0001504007
-0.0001524185,-2.3494327e-05
-0.0013468078,0.003565958
0.002849101,0.0020112626
0.0013465595,-0.015212115
-0.017447464,-0.021079037
-0.022616927,-0.02409593
-0.024103943,-0.02443299
-0.023666933,-0.01256558
-0.012119651,0.06498031
0.06650396,-0.005321003
-0.011221535,-0.0031691443
-0.012521737,0.014797727
0.015440522,0.02218179
0.022976458,0.024361398
0.022876445,0.025460452
0.021096962,0.023892991
0.019289147,0.023536507
0.018734511,0.011305027
0.006017145,0.0060609817
0.0026167282,0.02695299
0.02715436,0.02465924
0.022950385,0.008733785
0.0018138363,0.0003396503
-0.005757873,-0.05813033
-0.06212898,-0.076675124
-0.07277269,-0.012104943
-0.0032341918,0.0040010656
0.013306541,-0.025618622
-0.026267566,-0.02956197
-0.033113465,-0.036538307
-0.03495295,-0.039865434
-0.036749244,0.0072541977
0.014807338,0.018620273
0.025061155,-0.039520234
-0.043947194,-0.056152552
-0.060137387,-0.030174302
-0.0257071,-0.025980657
-0.0180987,-0.029805608
-0.02684797,-0.031509224
-0.030085204,-0.04155943
-0.038295735,-0.042430017
-0.0385581,-0.0462755
-0.040592324,-0.04264202
-0.035672616,-0.014983461
-0.007076114,-0.002164993
0.002526273,0.0021041299
0.0032139851,0.007823981
0.008187804,0.0085704345
0.008348719,0.009931071
0.008333645,0.01833242
0.017421212,0.01978389
0.018774057,0.008048194
0.0036073944,0.007559809
0.002745526,-0.0029593604
-0.005795646,-0.001153072
-0.0027646956,0.037789423
0.040785715,0.04723581
0.047817353,0.056184005
0.052479286,0.05230078
0.04713182,0.001433339
-0.007822854,-0.019826623
-0.026396241,-0.02777344
-0.028558169,-0.035489384
-0.03502632,-0.02816674
-0.027218293,-0.028110687
-0.026679138,-0.03187496
-0.03016895,-0.033674773
-0.030485896,-0.03586178
-0.0313722,-0.036902003
-0.031575944,-0.037151378
-0.03272538,-0.036930308
-0.033018567,-0.035326775
-0.03126017,-0.03345019
-0.029106162,-0.03333845
-0.029509474,-0.031241536
-0.027702784,-0.023683762
-0.019472431,-0.01952804
-0.016457895,-0.018051598
-0.015150233,-0.015834622
-0.012016015,-0.0133136995
-0.009909829,-0.011973413
-0.010007369,-0.009651544
-0.0083782915,-0.008973168
-0.0075581614,-0.013302229
-0.012425479,-0.014661386
-0.013081844,-0.013408972
-0.011446215,-0.013130184
-0.012113657,-0.013761017
-0.013549422,-0.012899681
-0.013268971,-0.013208622
-0.013549378,-0.011734399
-0.010871018,-0.004472062
-0.003422534,-0.00087705994
-0.00071111735,-0.0003283656
-0.0006950646,0.0011055283
-0.00020256631,0.0030810868
0.0018967148,0.00349751
0.003167288,0.005244415
0.0048725866,0.004815597
0.0028737339,-0.001963164
-0.005133787,-0.004788218
-0.008032285,-0.00523276
-0.0074856114,-0.0060902108
-0.0065397443,-0.005975514
-0.0052140476,-0.005792369
-0.005186227,-0.006751567
-0.007558276,-0.006429306
-0.0068279766,-0.0030673973
-0.0018402386,-0.001748015
-0.0004703813,-0.0007594033
-0.000120864286,-0.00029580653
-2.5130626e-05,-0.0020887752
-0.00316742,-0.0023457329
-0.0043222723,-0.0025743863
-0.004887589,-0.0023727422
-0.0032009436,0.00037165437
0.0010851303,0.0014836575
0.0010030824,0.00042474785
-0.0009747577,0.00032355575
-0.001629494,0.0018251578
-0.000956595,0.0012006157
-0.00019437687,0.001993503
0.0011300585,0.00040772834
-0.0008707971,-0.008188421
-0.011172703,-0.012102908
-0.014122808,-0.014478796
-0.016317341,-0.016213492
-0.018158525,-0.01417448
-0.014193502,-0.014277891
-0.014377459,-0.014964962
-0.016408147,-0.01556601
-0.016875694,-0.01836868
-0.018926213,-0.019795358
-0.020406984,-0.017738217
-0.017721873,-0.017620562
-0.017471027,-0.02188284
-0.02264563,0.055028528
0.059920672,0.003913933
0.0018775136,0.0023638625
-0.004599731,-0.011576784
-0.014297299,-0.017204508
-0.018730013,-0.018572545
-0.017727861,-0.019682882
-0.019492343,-0.017183974
-0.016207747,-0.015692916
-0.016234465,-0.013871458
-0.014755431,-0.011803772
-0.0112249665,-0.00961436
-0.009304368,-0.0057533355
-0.00604845,-0.00577387
-0.007155341,-0.0015792998
-0.0019505516,0.014744079
0.015797446,0.022410074
0.022715637,0.02639523
0.024828501,0.029135186
0.026694717,0.026637204
0.022686962,0.026399115
0.021895798,0.023837307
0.019597854,0.02291844
0.018562974,0.027488364
0.02377996,0.025562754
0.021250501,0.027723122
0.023431387,0.023163188
0.018599251,-0.0020556613
-0.008881701,-0.013348663
-0.018184634,-0.018751988
-0.020546988,-0.023124153
-0.023922732,-0.018444343
-0.01868578,-0.017798156
-0.018763777,-0.020194577
-0.021451738,-0.020588432
-0.021706272,-0.018822102
-0.018876873,-0.018048823
-0.017109277,-0.017573202
-0.01719621,-0.016948845
-0.017378964,-0.016635465
-0.016141403,-0.0157745
-0.015461136,-0.015287038
-0.015493612,-0.013967656
-0.01336114,-0.011297257
-0.010812486,-0.009728872
-0.009391847,-0.005709122
-0.00575335,-0.003951672
-0.0040913173,-0.008160671
-0.008256255,-0.0069341566
-0.0070345877,-0.00785913
-0.008125848,-0.004656502
-0.0041538947,0.012709507
0.014867695,0.02049353
0.021340135,0.022970608
0.021289844,0.02536925
0.022758247,0.024330134
0.020992436,0.023737226
0.020573745,0.022871636
0.019880591,0.021289745
0.018406672,0.017952442
0.014284358,0.013660564
0.009538678,0.014800872
0.011196599,0.010592797
0.007300856,-0.00770207
-0.013017017,-0.015471662
-0.02004252,-0.021323046
-0.022984229,-0.024046723
-0.025005734,-0.01380227
-0.012711368,-0.011084698
-0.011111387,-0.012009856
-0.013077608,-0.012329527
-0.0135722235,-0.015585064
-0.016276883,-0.017295895
-0.017080616,-0.017114045
-0.016837316,-0.017901383
-0.01775747,-0.020556612
-0.020478828,-0.021473631
-0.021201923,-0.022158852
-0.02148959,-0.022196036
-0.021090796,-0.019062595
-0.017793499,-0.017398382
-0.016339453,-0.019156571
-0.01844152,-0.017474046
-0.01647688,-0.015037665
-0.013555395,-0.016238835
-0.01537488,0.004943059
0.0071447054,0.011685005
0.012876442,-0.04481423
-0.049200527,-0.055272534
-0.056937795,0.00092201366
0.008407946,0.022299817
0.028784947,0.024387483
0.0232359,0.03227788
0.027519299,0.041909996
0.038887735,0.047638543
0.04408241,0.04963445
0.04642565,0.04821591
0.044559736,0.054113172
0.049358666,0.04998964
0.04331022,0.020607486
0.011088212,0.0073707444
0.0004997122,-0.00063823175
-0.004568254,-0.006993725
-0.010018899,-0.0013806155
-0.0021986908,-0.0032914258
-0.0041662483,-0.0062962947
-0.008220498,-0.010409838
-0.01224993,-0.024348633
-0.025578525,-0.03199909
-0.03196544,-0.0302816
-0.028436907,-0.033612244
-0.03100972,-0.042567283
-0.041593112,-0.042028576
-0.040797673,-0.05982988
-0.057194732,-0.06234858
-0.058077816,0.0039128233
0.013917894,0.024908243
0.032344133,-0.030016132
-0.034401696,-0.04134206
-0.044737186,-0.006363263
-0.0011439974,0.0029473356
0.008536631,-0.0004334426
0.00017263602,-0.00078067766
-0.0024718437,-0.008339192
-0.009800646,-0.011119662
-0.012694361,-0.011839291
-0.012037058,-0.0122501645
-0.010601164,-0.009758286
-0.0090294145,-0.05974404
-0.060576465,0.0051898416
0.008074923,0.007269552
0.0125471,0.016574971
0.015066962,0.021171905
0.019247895,0.023286764
0.020348758,0.025455642
0.02310362,0.025764028
0.021859283,0.026559321
0.02334031,0.027869454
0.023976406,0.02850713
0.02290405,0.027934201
0.022897504,0.027724972
0.024462393,0.028364684
0.025487004,0.02830382
0.025044538,0.026529536
0.024481967,0.025883906
0.023982495,0.026163617
0.023769343,0.025813792
0.023077935,0.026662918
0.02476648,0.027704252
0.026294155,0.02150767
0.019157356,0.02130547
0.019331144,0.034422707
0.033693086,0.03480287
0.032347642,0.043285247
0.0397861,0.039705046
0.035966348,-0.0024548797
-0.011010402,-0.017010449
-0.022923196,-0.021523949
-0.022991385,-0.020202348
-0.020205982,-0.0014757027
-0.0005049708,0.007592183
0.00687917,0.037807368
0.03742044,0.047757123
0.04676788,0.021157105
0.014126166,0.012044266
0.005118681,0.019836057
0.017645733,0.017676799
0.016216697,0.0009893517
-0.004182934,-0.004403799
-0.008913353,-0.00979103
-0.012440675,-0.010462375
-0.013256621,0.007894279
0.0079152025,0.014341529
0.014266357,0.012253495
0.009729577,0.012343402
0.008976793,0.01172441
0.00851264,0.008510127
0.005779436,0.01031919
0.008488115,0.005743901
0.003947407,-0.015305537
-0.02022315,-0.02500185
-0.029335039,-0.033230785
-0.034331474,-0.037867676
-0.037553795,-0.029771384
-0.029197026,-0.030668978
-0.030887835,-0.02730337
-0.026406657,-0.030079955
-0.029146448,-0.054995228
-0.054136127,-0.062797196
-0.059231255,-0.066375546
-0.05890287,-0.06642901
-0.058151774,-0.041713532
-0.0332607,-0.028223533
-0.021456838,-0.045445245
-0.043201078,-0.048231635
-0.04657625,0.014410348
0.021290949,0.03056205
0.036381427,-0.04641887
-0.051111124,-0.06715474
-0.06608415,-0.029091528
-0.022239218,-0.016895197
-0.007672593,-0.029571218
-0.02685354,-0.02622374
-0.026234828,0.0035555982
0.0057426044,0.016994908
0.01880467,0.017702328
0.01680713,0.022075789
0.02011781,0.027852803
0.025935842,0.028220758
0.024329023,0.03373286
0.029306123,0.031046553
0.027705967,0.0054776934
0.00016556734,-0.0055494714
-0.010369854,-0.010004699
-0.012266822,-0.01432599
-0.014535397,-0.010906918
-0.01071555,-0.011050289
-0.01131262,-0.014463811
-0.015231246,-0.014933143
-0.014292503,-0.015679782
-0.0133524155,-0.017737294
-0.015238539,-0.0037883217
-0.00057097006,0.0037478078
0.006538569,-0.04117982
-0.044149186,-0.052410852
-0.05296368,0.035070743
0.04702445,0.05547251
0.06455032,-0.016150039
-0.02402697,-0.037140094
-0.04455085,-0.03125467
-0.029116565,-0.032862645
-0.027470227,-0.024893442
-0.019833017,-0.022924544
-0.01902078,-0.022336077
-0.020755459,-0.022423578
-0.022594422,-0.029016975
-0.028516721,-0.031555288
-0.0277655,-0.028715989
-0.025221271,-0.028272556
-0.026391212,-0.03199613
-0.030186398,-0.03045938
-0.028443735,-0.031814836
-0.030175418,-0.027806925
-0.024587983,-0.007451587
-0.0021408158,0.0023239036
0.0050168056,0.0073650093
0.007016008,0.011990062
0.010758087,0.010696764
0.007937696,0.01206406
0.009204141,0.014975877
0.013028216,0.016725373
0.015062648,0.018474681
0.014998086,0.019960744
0.015795853,0.0188554
0.016416214,0.01924352
0.017154062,0.023588305
