time,open,high,low,close,tick_volume,spread,real_volume,signal
2017-08-03,113.947,114.298,113.44,113.576,89444,20,131403816000,-1
2017-08-04,113.56,114.07,113.358,113.731,83434,20,123707297000,-1
2017-08-07,113.724,114.014,113.57,113.736,70401,20,103688000000,-1
2017-08-08,113.798,113.843,113.155,113.188,76337,20,113333950000,-1
2017-08-09,113.149,114.247,112.955,114.175,88682,20,122359750000,-1
2017-08-10,114.148,114.29,113.276,113.43,83038,20,115424100000,-1
2017-08-11,113.368,113.616,113.212,113.441,89942,20,135304000000,-1
2017-08-14,113.339,113.722,112.649,112.707,78116,20,117081298000,-1
2017-08-15,112.771,113.814,112.685,113.765,80353,20,115743400000,1
2017-08-16,113.753,114.177,113.522,114.068,82188,20,124676250000,1
2017-08-17,114.066,114.245,113.67,113.735,95358,20,139263092000,1
2017-08-18,113.735,113.829,113.008,113.053,95556,20,138367700000,1
2017-08-21,113.152,113.34,112.556,113.271,77897,20,117560950000,1
2017-08-22,113.261,113.531,112.913,113.123,69385,20,97079850000,1
2017-08-23,113.159,113.323,112.832,112.882,77524,20,109298394000,1
2017-08-24,112.909,113.528,112.73,113.456,79845,20,103824072000,1
2017-08-25,113.429,114.414,113.388,114.397,82039,20,105353300000,1
2017-08-28,114.261,114.638,113.957,114.326,71112,20,94059200000,1
2017-08-29,114.343,115.07,113.909,114.755,106835,20,144279350000,1
2017-08-30,114.692,115.321,114.352,114.369,88700,20,122278400000,1
2017-08-31,114.371,114.815,114.201,114.677,96973,20,132472574000,1
2017-09-01,114.578,114.856,114.166,114.28,105083,19,57764750000,1
2017-09-04,114.076,114.724,113.939,114.42,72129,20,93825800000,1
2017-09-05,114.462,114.527,113.687,113.864,118927,20,98434250000,1
2017-09-06,113.838,114.28,113.687,114.105,93160,20,123392200000,1
2017-09-07,113.999,114.425,113.734,114.036,94637,20,131551620000,1
2017-09-08,114.047,114.493,113.438,114.113,102910,20,134220200000,1
2017-09-11,114.069,114.669,114.032,114.347,82307,20,114872500000,-1
2017-09-12,114.172,114.783,114.172,114.667,131022,20,46914250000,-1
2017-09-13,114.651,114.838,114.418,114.533,83723,20,114925523000,-1
2017-09-14,114.553,114.74,113.932,114.402,89280,20,120408000000,-1
2017-09-15,113.615,115.931,113.574,115.447,85702,20,111534492000,-1
2017-09-18,115.516,116.197,115.45,115.974,80359,20,115139050000,1
2017-09-19,115.987,116.461,115.554,115.914,87778,20,121559150000,1
2017-09-20,115.868,116.086,115.586,115.68,80115,20,111252932000,1
2017-09-21,115.699,115.948,115.366,115.842,84558,20,109515900000,1
2017-09-22,115.85,115.939,115.415,115.462,81761,20,105214408000,-1
2017-09-25,115.415,115.851,115.034,115.537,83287,20,122648550000,-1
2017-09-26,115.488,115.908,114.975,115.81,82207,20,120415600000,-1
2017-09-27,115.796,116.197,115.5,116.024,91984,20,132028200000,-1
2017-09-28,115.998,116.187,115.566,115.763,84774,20,120396650000,-1
2017-09-29,115.708,116.369,115.666,116.017,78461,20,110375200000,-1
2017-10-02,116.052,116.418,115.45,115.646,79528,20,113445700000,-1
2017-10-03,115.659,116.033,115.552,115.861,81912,20,111974650000,-1
2017-10-04,115.86,115.98,115.499,115.596,75476,20,105918300000,-1
2017-10-05,115.463,115.735,115.026,115.285,70065,20,118249400000,-1
2017-10-06,115.269,115.539,114.959,115.114,75979,20,107495750000,-1
2017-10-09,115.018,115.21,114.887,114.984,61405,20,84008450000,-1
2017-10-10,114.953,115.328,114.885,115.292,76567,20,115685400000,-1
2017-10-11,115.302,115.634,114.923,115.516,78703,20,121133450000,1
2017-10-12,115.369,115.653,115.001,115.073,79743,20,117665100000,1
2017-10-13,115.064,115.157,114.548,114.548,79283,20,112004850000,1
2017-10-16,114.535,115.023,114.422,114.969,72889,20,101846398000,1
2017-10-17,114.894,115.041,114.5,114.658,78068,20,124760950000,1
2017-10-18,114.648,115.155,114.589,115.028,77181,20,116908500000,1
2017-10-19,115.011,115.544,114.893,115.244,87497,20,135841198000,-1
2017-10-20,115.223,115.598,115.001,115.247,85870,20,138647150000,-1
2017-10-23,115.561,115.727,114.98,115.139,78964,20,124214382000,-1
2017-10-24,115.139,115.372,114.505,114.898,84434,20,132766550000,1
2017-10-25,114.878,115.124,114.726,114.895,94142,20,140098100000,1
2017-10-26,114.898,114.967,114.053,114.215,84644,20,124799300000,1
2017-10-27,114.211,114.395,113.709,113.822,86150,20,133606647000,1
2017-10-30,113.944,114.008,113.094,113.736,77872,20,113560650000,1
2017-10-31,113.713,114.106,113.393,113.937,77274,20,119269800000,-1
2017-11-01,113.957,114.097,113.702,113.786,78361,20,118600250000,-1
2017-11-02,113.796,114.258,113.742,114.13,83210,20,124249500000,-1
2017-11-03,114.108,114.252,113.936,113.942,68065,20,109611850000,1
2017-11-06,113.668,114.51,113.655,113.969,69173,20,103334300000,1
2017-11-07,113.957,114.392,113.835,113.998,69335,20,95485650000,1
2017-11-08,113.946,114.023,113.461,113.833,62397,20,86611000000,1
2017-11-09,113.845,114.152,113.276,114.134,79452,20,91968230000,1
2017-11-10,114.151,114.285,113.834,113.902,58369,20,54664150000,1
2017-11-13,113.688,114.085,113.512,114.03,52791,20,55958495000,1
2017-11-14,114.019,114.697,113.932,114.644,55817,20,53909450000,1
2017-11-15,114.643,114.678,114.102,114.16,69142,20,67192250000,1
2017-11-16,114.145,114.338,113.519,113.679,59489,20,62174300000,1
2017-11-17,113.659,113.804,113.119,113.321,64460,20,65363957000,1
2017-11-20,113.359,113.514,113.06,113.342,65629,20,71270500000,1
2017-11-21,113.305,113.449,113.104,113.393,58296,20,59738200000,1
2017-11-22,113.422,113.602,113.138,113.242,57473,20,57588400000,1
2017-11-23,113.174,113.491,113.131,113.209,52072,20,58557253000,1
2017-11-24,113.209,113.967,113.202,113.622,57137,20,58986500000,1
2017-11-27,113.829,113.954,113.059,113.11,60141,20,58261600000,-1
2017-11-28,113.216,113.412,112.963,113.197,62610,20,54272800000,-1
2017-11-29,113.154,113.754,113.114,113.656,65448,20,61940500000,-1
2017-11-30,113.58,114.538,113.507,114.364,66807,20,67095078000,-1
2017-12-01,114.319,114.953,114.093,114.72,81594,20,82380000000,-1
2017-12-04,114.85,115.157,114.037,114.105,69440,20,70584049000,-1
2017-12-05,114.115,114.385,113.892,113.988,61942,20,57429500000,-1
2017-12-06,114.052,114.088,113.286,113.411,63599,20,58277697000,-1
2017-12-07,113.377,113.783,113.347,113.69,59199,20,55038100000,-1
2017-12-08,113.666,114.39,113.661,114.287,183341,20,47699400000,-1
2017-12-11,114.082,114.554,114.082,114.455,248089,20,49686350000,-1
2017-12-12,114.465,114.676,114.289,114.48,224334,20,44885350000,-1
2017-12-13,114.477,114.54,113.973,114.149,261146,20,52265200000,-1
2017-12-14,114.162,114.458,113.431,113.573,274414,20,54904000000,-1
2017-12-15,113.576,113.797,113.284,113.659,273388,20,54704400000,-1
2017-12-18,113.755,114.227,113.358,114.144,258345,20,51692100000,-1
2017-12-19,114.161,114.723,114.009,114.562,250084,20,50082650000,-1
2017-12-20,114.553,115.151,114.449,114.879,238834,20,47785750000,-1
2017-12-21,114.836,115.171,114.457,114.593,186280,20,37421500000,-1
2017-12-22,114.575,114.674,114.327,114.613,192005,20,38420350000,-1
2017-12-26,114.476,114.569,114.249,114.398,154029,20,30829800000,-1
2017-12-27,114.371,114.901,114.223,114.89,250564,20,54709400000,-1
2017-12-28,114.851,115.501,114.732,115.257,215706,20,43818150000,-1
2017-12-29,115.258,115.746,114.995,115.424,189513,19,38064850000,-1
2018-01-02,115.129,115.83,115.129,115.521,212899,20,42758200000,-1
2018-01-03,115.497,115.578,114.711,115.081,234665,20,46966900000,1
2018-01-04,115.094,115.822,115.046,115.691,203195,20,40726400000,1
2018-01-05,115.616,116.149,115.571,115.981,201740,20,40385900000,1
2018-01-08,115.959,116.079,115.435,115.669,212181,20,42512000000,1
2018-01-09,115.556,115.781,114.286,114.555,256536,20,51325800000,1
2018-01-10,114.582,114.629,113.656,113.883,292281,20,58483500000,1
2018-01-11,113.873,114.494,113.727,113.964,281820,20,56675150000,1
2018-01-12,113.929,114.855,113.822,114.779,293143,20,58662950000,-1
2018-01-15,114.677,115.164,114.411,114.712,290601,20,58138800000,-1
2018-01-16,114.735,115.21,114.544,115.059,281780,20,56385100000,-1
2018-01-17,115.05,115.55,114.696,115.111,325495,20,65148250000,-1
2018-01-18,115.129,116.002,115.091,115.803,318288,20,63677750000,-1
2018-01-19,115.747,115.944,114.883,114.98,301000,20,60219950000,-1
2018-01-22,114.997,115.428,114.836,115.278,262211,20,52473500000,-1
2018-01-23,115.264,115.482,114.78,115.136,281247,20,56274050000,-1
2018-01-24,115.072,115.834,114.976,115.485,342219,20,68525500000,1
2018-01-25,115.481,117.002,115.329,116.199,412796,20,82580600000,1
2018-01-26,116.723,116.939,115.787,116.48,367394,20,73502400000,1
2018-01-29,116.129,116.537,116.024,116.192,354420,20,70931200000,1
2018-01-30,116.176,116.655,115.767,116.098,351233,20,70258700000,1
2018-01-31,116.298,117.501,116.066,117.197,369062,20,73834050000,1
2018-02-01,117.109,118.108,117.08,118.038,345455,20,69131150000,1
2018-02-02,117.422,118.546,117.422,118.258,380688,20,76164400000,1
2018-02-05,118.127,118.275,116.748,116.997,402572,20,80521500000,-1
2018-02-06,117.073,117.284,116.254,117.038,504863,20,100980150000,-1
2018-02-07,117.036,117.216,115.583,115.583,395503,20,79107500000,-1
2018-02-08,115.619,116.608,115.542,116.094,347625,20,69547750000,-1
2018-02-09,116.087,116.636,115.134,115.807,357647,20,71572700000,-1
2018-02-12,115.695,116.04,115.509,115.644,492333,20,98479900000,-1
2018-02-13,115.621,115.849,114.974,115.29,490387,20,98079800000,1
2018-02-14,115.276,115.404,114.337,115.087,516948,20,103391000000,1
2018-02-15,115.092,115.427,114.572,115.076,499837,20,99973250000,-1
2018-02-16,115.029,115.289,114.447,114.472,470491,20,94102100000,-1
2018-02-19,114.478,114.935,114.405,114.508,374028,20,74805600000,1
2018-02-20,114.636,114.92,114.394,114.629,411418,20,82287700000,1
2018-02-21,114.613,115.099,114.471,114.759,436362,20,87278600000,1
2018-02-22,114.756,114.763,114.07,114.389,431114,20,86234450000,1
2018-02-23,114.384,114.613,113.775,114.155,402530,20,80510100000,1
2018-02-26,114.225,114.301,113.838,113.942,435589,20,87117600000,1
2018-02-27,113.932,114.455,113.932,114.285,439278,20,87855500000,1
2018-02-28,114.298,114.431,112.806,112.898,448412,20,89682400000,1
2018-03-01,112.896,113.219,112.357,112.761,493552,20,98713800000,1
2018-03-02,112.73,112.906,112.34,112.756,496246,20,99250550000,1
2018-03-05,112.378,112.989,112.269,112.952,503883,20,100776600000,1
2018-03-06,112.949,113.478,112.593,112.777,487065,20,97413000000,-1
2018-03-07,112.773,112.878,112.11,112.373,521962,20,104392400000,1
2018-03-08,112.405,112.56,111.501,111.618,460433,20,92086600000,1
2018-03-09,111.666,112.719,111.538,112.212,463769,20,92753800000,-1
2018-03-12,112.215,112.506,112.027,112.301,362022,20,72404400000,-1
2018-03-13,112.302,113.239,112.16,112.78,413819,20,82763800000,1
2018-03-14,112.787,113.065,112.098,112.5,394632,20,78926400000,1
2018-03-15,112.506,112.543,111.562,111.727,409724,20,81944800000,1
2018-03-16,111.696,111.771,111.156,111.324,370084,20,74016800000,1
2018-03-19,111.232,111.685,110.808,111.433,385791,20,77158200000,-1
2018-03-20,111.425,112.095,111.309,111.327,384223,20,76844600000,1
2018-03-21,111.373,111.837,111.159,111.732,379221,20,75844200000,-1
2018-03-22,111.762,111.774,110.839,110.92,512472,20,102494400000,1
2018-03-23,110.948,111.038,110.43,110.54,537852,20,107570400000,1
2018-03-26,110.395,111.591,110.385,111.432,452582,20,90516400000,1
2018-03-27,111.43,111.962,111.219,111.237,453571,20,90714200000,1
2018-03-28,111.189,111.735,110.913,111.612,417843,20,83568600000,1
2018-03-29,111.606,111.684,110.969,111.227,332907,20,66581400000,1
2018-03-30,111.215,111.49,111.073,111.378,228327,20,45665400000,1
2018-04-02,111.257,111.625,110.644,110.82,311266,20,62253200000,1
2018-04-03,110.851,111.325,110.665,111.124,401790,20,80358000000,1
2018-04-04,111.13,111.276,110.6,111.106,415972,20,83194400000,1
2018-04-05,111.09,111.626,111.058,111.411,396849,20,79369800000,-1
2018-04-06,111.405,111.789,111.195,111.459,461606,20,92321200000,-1
2018-04-09,111.476,111.94,111.301,111.613,389497,20,77899400000,-1
2018-04-10,111.618,112.269,111.527,111.989,417744,20,83399550000,-1
2018-04-11,111.991,112.072,111.401,111.479,368323,20,73664600000,-1
2018-04-12,111.268,111.606,111.051,111.458,327574,20,65514800000,-1
2018-04-13,111.454,112.106,111.401,111.528,326010,20,65202000000,-1
2018-04-16,111.524,111.931,111.233,111.565,342380,20,65770200000,-1
2018-04-17,111.557,111.63,110.585,110.728,372333,20,74466600000,-1
2018-04-18,110.711,111.006,110.633,110.682,384520,20,76904000000,-1
2018-04-19,110.662,111.086,110.352,110.512,395635,20,79127000000,-1
2018-04-20,110.48,110.839,110.275,110.419,398657,20,79731400000,-1
2018-04-23,110.398,111.129,110.323,111.109,377003,20,75400600000,-1
2018-04-24,111.099,111.55,110.927,111.141,410061,20,82012200000,-1
2018-04-25,111.162,111.312,110.885,111.266,415397,20,83079400000,-1
2018-04-26,111.226,111.381,110.479,110.479,354693,20,70938600000,-1
2018-04-27,110.485,110.54,110.215,110.39,385245,20,77049000000,-1
2018-04-30,110.321,110.601,110.164,110.303,319239,18,63847800000,-1
2018-05-01,110.344,110.476,110.107,110.238,329431,20,65886200000,-1
2018-05-02,110.213,110.496,109.899,110.003,381763,20,76352600000,-1
2018-05-03,110.019,110.126,109.073,109.43,391025,20,78205000000,-1
2018-05-04,109.431,109.455,108.649,109.103,357041,20,71408200000,-1
2018-05-07,109.033,109.164,108.682,108.778,334307,20,66861400000,-1
2018-05-08,108.773,109.189,108.5,108.914,353270,20,70654000000,-1
2018-05-09,108.902,109.585,108.811,109.134,353969,20,70793800000,-1
2018-05-10,109.127,109.536,108.995,109.013,389445,20,77889000000,-1
2018-05-11,108.962,109.459,108.875,109.333,331696,20,66339200000,-1
2018-05-14,109.156,109.956,109.151,109.563,323087,20,64617400000,-1
2018-05-15,109.554,110.413,109.456,110.191,365183,20,73036600000,-1
2018-05-16,110.142,110.417,109.906,110.238,386547,20,77309400000,-1
2018-05-17,110.17,110.658,110.118,110.529,335199,20,67039800000,-1
2018-05-18,110.53,111.186,110.496,110.983,349649,20,69929800000,-1
2018-05-21,111.153,111.497,111.026,111.311,397099,20,79419800000,-1
2018-05-22,111.301,111.904,111.207,111.671,423962,20,84792400000,-1
2018-05-23,111.692,111.726,110.467,110.539,506994,20,101398800000,-1
2018-05-24,110.512,110.791,109.904,110.166,455250,20,91050000000,-1
2018-05-25,110.092,110.632,109.935,110.439,397400,20,79480000000,-1
2018-05-28,110.562,110.687,109.741,110.067,322784,20,64556800000,-1
2018-05-29,110.074,110.163,108.991,109.682,470206,20,94041200000,-1
2018-05-30,109.671,110.271,109.213,110.069,440139,20,88027800000,1
2018-05-31,110.043,110.606,109.79,110.343,433694,20,86738800000,1
2018-06-01,110.329,110.997,110.283,110.829,397144,20,79428800000,1
2018-06-04,110.566,111.419,110.566,111.104,360799,20,72159800000,1
2018-06-05,111.053,111.507,110.975,111.491,384057,20,76811400000,1
2018-06-06,111.508,111.917,111.347,111.638,369403,20,73880600000,1
2018-06-07,111.635,112.188,111.439,111.859,410115,20,82023000000,1
2018-06-08,111.819,111.999,110.746,111.165,399716,20,79943200000,1
2018-06-11,110.925,111.734,110.925,111.644,346711,20,69342200000,-1
2018-06-12,111.606,112.17,111.513,111.818,392372,20,78474400000,-1
2018-06-13,111.808,112.186,111.767,111.921,349458,20,69891600000,-1
2018-06-14,111.867,112.017,110.902,110.917,378230,20,75646000000,-1
2018-06-15,110.956,111.128,110.699,110.903,402911,20,80582200000,-1
2018-06-18,110.94,111.156,110.626,111.054,325580,20,65116000000,-1
2018-06-19,111.042,111.077,110.096,110.564,447542,20,89508400000,-1
2018-06-20,110.645,110.872,110.294,110.757,379243,20,75848600000,-1
2018-06-21,110.642,111.127,110.578,110.812,397374,20,79474800000,-1
2018-06-22,110.773,111.404,110.701,111.297,357493,20,71498600000,-1
2018-06-25,111.015,111.475,110.662,111.138,352692,20,70538400000,-1
2018-06-26,111.119,111.217,110.756,110.949,362933,20,72586600000,-1
2018-06-27,110.933,111.134,110.501,110.514,430523,20,86104600000,-1
2018-06-28,110.496,110.837,110.285,110.736,429246,20,85849200000,-1
2018-06-29,110.709,111.898,110.594,111.779,419033,20,83806600000,-1
2018-07-02,111.576,111.97,111.175,111.585,367344,20,73468800000,-1
2018-07-03,111.539,111.929,111.312,111.366,350023,20,70004600000,-1
2018-07-04,111.369,111.467,111.146,111.146,345849,20,69169800000,-1
2018-07-05,111.113,111.64,110.995,111.17,348585,20,69717000000,-1
2018-07-06,111.081,111.744,111.018,111.584,326243,20,65248600000,1
2018-07-09,111.346,112.026,111.346,111.752,324760,20,64952000000,-1
2018-07-10,111.723,112.161,111.633,111.86,344776,20,68955200000,-1
2018-07-11,111.846,112.565,111.583,112.415,436769,20,87353800000,1
2018-07-12,112.452,112.959,112.183,112.25,363963,20,72792600000,1
2018-07-13,112.191,112.45,111.839,112.166,338927,20,67785400000,1
2018-07-16,112.004,112.7,111.927,112.604,317107,20,63421400000,1
2018-07-17,112.583,113.245,112.524,112.837,379367,20,75873400000,1
2018-07-18,112.82,113.005,112.628,112.949,367491,20,73498200000,1
2018-07-19,112.905,112.99,112.444,112.527,417408,20,83481600000,1
2018-07-20,112.529,112.658,112.183,112.254,411022,20,82204400000,1
2018-07-23,112.154,112.367,111.832,112.165,349893,20,69978600000,-1
2018-07-24,112.158,112.281,111.73,111.88,363782,20,72756400000,-1
2018-07-25,111.835,112.156,111.504,111.85,373018,20,74603600000,-1
2018-07-26,111.832,111.99,111.477,111.847,323939,20,64787800000,-1
2018-07-27,111.832,111.903,111.318,111.61,316759,20,63351800000,1
2018-07-30,111.421,112.384,111.324,112.306,284718,20,56943600000,1
2018-07-31,112.299,113.169,112.119,112.872,348912,20,69782400000,1
2018-08-01,112.856,113.091,112.415,112.585,328480,20,65696000000,1
2018-08-02,112.55,112.628,111.909,112.143,340581,20,68116200000,1
2018-08-03,112.199,112.318,111.823,111.868,340888,20,68177600000,1
2018-08-06,111.814,111.938,111.622,111.737,263150,20,52630000000,1
2018-08-07,111.763,111.949,111.635,111.832,325544,20,65108800000,1
2018-08-08,111.816,112.014,111.322,111.685,338599,20,67719800000,-1
2018-08-09,111.691,112.081,111.439,111.757,381462,20,76292400000,-1
2018-08-10,111.743,111.892,111.069,111.427,447287,20,89457400000,-1
2018-08-13,110.954,111.624,110.695,111.376,435051,20,87010200000,-1
2018-08-14,111.364,112.075,111.263,111.76,384855,20,76971000000,-1
2018-08-15,111.728,111.933,110.941,111.435,427082,20,85416400000,-1
2018-08-16,111.385,111.796,111.183,111.22,412875,20,82575000000,-1
2018-08-17,111.176,111.303,110.804,110.979,399961,20,79992200000,-1
2018-08-20,111.034,111.227,110.888,110.943,337614,20,67522800000,-1
2018-08-21,110.88,112.135,110.877,111.826,391457,20,78291400000,1
2018-08-22,111.776,112.505,111.718,112.433,354917,20,70983400000,1
2018-08-23,112.43,112.956,112.374,112.76,366865,20,73373000000,1
2018-08-24,113.143,113.277,112.735,113.113,355692,20,71138400000,-1
2018-08-27,113.082,113.443,112.78,113.365,237622,20,47510800000,1
2018-08-28,113.337,113.956,113.21,113.808,287525,20,57505000000,-1
2018-08-29,113.873,115.108,113.707,115.053,315537,20,63107400000,-1
2018-08-30,115.057,115.284,114.428,114.467,308508,20,61701600000,1
2018-08-31,114.336,114.93,114.242,114.657,332472,20,66494400000,1
2018-09-03,114.389,114.673,114.269,114.498,244437,20,48887400000,1
2018-09-04,114.495,114.739,114.015,114.225,311286,20,62257200000,-1
2018-09-05,114.188,114.923,114.181,114.743,323248,20,64649600000,1
2018-09-06,114.706,114.927,114.392,114.72,336834,20,67366800000,1
2018-09-07,114.704,115.086,114.325,114.575,370468,20,74093600000,1
2018-09-10,114.531,114.617,113.928,113.969,309123,20,61824600000,1
2018-09-11,113.888,114.789,113.853,114.768,299350,20,59870000000,1
2018-09-12,114.741,114.795,114.31,114.517,325939,20,65187800000,1
2018-09-13,114.572,115.991,114.488,115.913,383898,20,76779600000,1
2018-09-14,115.883,116.091,115.721,115.834,368178,20,73635600000,1
2018-09-17,115.646,116.452,115.588,116.156,378288,20,75657600000,-1
2018-09-18,116.158,116.904,115.968,116.466,437568,20,87513600000,-1
2018-09-19,116.406,116.563,115.739,116.046,412646,20,82529200000,-1
2018-09-20,116.046,117.309,115.863,117.271,424445,20,84889000000,-1
2018-09-21,117.28,118.053,117.227,117.427,401478,20,80295600000,-1
2018-09-24,117.144,117.551,116.838,116.887,325103,20,65020600000,1
2018-09-25,116.883,117.165,116.699,117.041,375690,20,75138000000,-1
2018-09-26,117.041,117.175,116.446,116.604,405098,20,81019600000,-1
2018-09-27,116.604,116.907,115.895,115.973,438778,20,87755600000,1
2018-09-28,115.973,116.431,115.691,115.794,416331,20,83266200000,1
2018-10-01,115.82,116.165,115.645,115.645,368945,20,73789000000,1
2018-10-02,115.645,115.883,115.275,115.475,406166,20,81233200000,1
2018-10-03,115.465,115.72,115.086,115.392,417691,20,83538200000,-1
2018-10-04,115.392,115.596,114.548,114.832,452759,20,90551800000,-1
2018-10-05,114.808,114.977,114.391,114.617,368140,20,73628000000,-1
2018-10-08,114.505,114.852,113.627,114.027,308960,20,61792000000,-1
2018-10-09,114.027,114.095,113.656,113.797,415994,20,83198800000,-1
2018-10-10,113.783,114.213,113.337,113.355,410921,20,82184200000,-1
2018-10-11,113.355,113.821,113.059,113.325,543588,20,108717600000,-1
2018-10-12,113.325,113.664,112.902,112.952,435299,20,87059800000,-1
2018-10-15,113.173,113.496,112.758,113.136,427540,20,85508000000,-1
2018-10-16,113.116,113.681,113.061,113.287,385826,20,77165200000,-1
2018-10-17,113.287,113.471,112.825,113.153,404097,20,80819400000,-1
2018-10-18,113.152,113.452,112.513,112.647,457857,20,91571400000,-1
2018-10-19,112.647,113.091,112.576,112.956,445222,20,89044400000,1
2018-10-22,112.938,113.413,112.678,113.234,403637,20,80727400000,1
2018-10-23,113.234,113.283,112.47,112.993,456915,20,91383000000,1
2018-10-24,112.993,113.205,112.396,112.469,564204,20,112840800000,1
2018-10-25,112.469,112.622,112.166,112.453,679090,20,135818000000,1
2018-10-26,112.453,112.479,111.537,112.192,803512,20,160702400000,1
2018-10-29,111.969,112.527,111.885,112.108,682794,20,136558800000,1
2018-10-30,112.108,112.758,112.089,112.474,667996,20,133599200000,1
2018-10-31,112.473,112.725,111.835,111.965,576093,20,115218600000,1
2018-11-01,111.965,112.665,111.853,112.355,514533,20,102906600000,1
2018-11-02,112.355,113.221,112.262,112.792,541599,20,108319800000,1
2018-11-05,112.748,112.908,112.47,112.668,397861,20,79572200000,-1
2018-11-06,112.668,113.17,112.549,113.112,397939,20,79587800000,-1
2018-11-07,113.114,113.733,112.931,113.194,603781,20,120756200000,-1
2018-11-08,113.28,113.561,113.013,113.36,697839,20,139567800000,1
2018-11-09,113.36,113.411,112.835,113.151,918885,20,183777000000,1
2018-11-12,113.109,113.333,112.517,112.583,474995,20,94999000000,1
2018-11-13,112.583,113.077,112.441,112.976,548040,20,109608000000,1
2018-11-14,112.976,113.275,112.673,112.704,1294332,20,565877289600,1
2018-11-15,112.706,113.015,112.484,112.77,1554132,20,1039696263200,1
2018-11-16,112.77,112.913,112.183,112.82,1688762,20,927278713600,1
2018-11-19,112.553,113.311,112.551,113.262,596978,20,493653845600,1
2018-11-20,113.262,113.495,113.019,113.249,620346,20,232931513200,1
2018-11-21,113.233,113.847,113.106,113.609,622735,20,93410250000,1
2018-11-22,113.609,113.817,113.355,113.355,529622,20,79443300000,-1
2018-11-23,113.355,113.642,113.031,113.211,582774,20,87416100000,-1
2018-11-26,113.089,113.796,113.089,113.703,700914,20,105137100000,-1
2018-11-27,113.703,113.979,113.511,113.878,699967,20,104995050000,-1
2018-11-28,113.882,114.401,113.782,114.265,687528,20,103129200000,-1
2018-11-29,114.255,114.402,113.618,113.873,1418115,20,212717250000,-1
2018-11-30,113.873,113.998,113.508,113.79,1391264,20,208689600000,-1
2018-12-03,113.677,113.95,113.582,113.887,707984,20,106197600000,-1
2018-12-04,113.887,113.905,112.855,113.017,853073,20,127960950000,-1
2018-12-05,113.017,113.487,112.918,113.421,1167277,20,175091550000,-1
2018-12-06,113.421,113.498,112.891,113.453,2815168,20,422275200000,-1
2018-12-07,113.453,113.889,113.263,113.554,752464,20,112869600000,-1
2018-12-10,113.552,114.471,113.552,114.389,780061,20,117009150000,-1
2018-12-11,114.383,114.627,114.0,114.101,1499075,20,224861250000,-1
2018-12-12,114.094,114.379,113.813,113.988,2283611,20,342541650000,-1
2018-12-13,113.988,114.435,113.875,114.241,2758431,20,413764650000,-1
2018-12-14,114.241,114.349,113.47,113.572,3323816,20,498572400000,-1
2018-12-17,113.532,114.155,113.438,113.604,744987,20,111748050000,-1
2018-12-18,113.604,113.667,113.25,113.303,763878,20,114581700000,-1
2018-12-19,113.303,113.415,112.852,113.064,778401,20,116760150000,-1
2018-12-20,113.062,113.252,112.238,112.639,1898176,20,284726400000,1
2018-12-21,112.639,112.897,111.658,111.873,2656542,20,398481300000,-1
2018-12-24,111.488,111.928,111.4,111.714,667504,20,100125600000,-1
2018-12-26,111.97,112.027,111.375,111.806,413135,20,61970250000,-1
2018-12-27,111.806,112.535,111.698,112.327,862716,20,129407400000,-1
2018-12-28,112.327,112.731,111.976,112.028,1459839,20,218975850000,-1
2018-12-31,111.861,112.275,111.25,111.481,483127,20,72469050000,-1
2019-01-02,111.247,111.448,109.954,109.973,614899,20,92234850000,1
2019-01-03,109.971,109.971,105.07,109.068,489848,22,73477200000,1
2019-01-04,109.068,110.074,108.979,109.843,1210293,20,181543950000,1
2019-01-07,109.769,111.007,109.715,110.952,528976,20,79346400000,1
2019-01-08,110.946,111.17,110.587,110.761,536316,20,80447400000,1
2019-01-09,110.761,111.302,110.683,110.982,586657,20,87998550000,1
2019-01-10,110.982,111.179,110.07,110.122,1174416,20,176162400000,1
2019-01-11,110.122,110.378,110.039,110.292,1528766,20,229314900000,-1
2019-01-14,110.106,110.461,109.837,110.235,438347,20,65752050000,-1
2019-01-15,110.234,110.826,109.589,109.95,406722,20,61008300000,-1
2019-01-16,109.938,110.228,109.671,110.136,296065,20,44409750000,-1
2019-01-17,110.136,110.225,109.471,109.862,294881,20,44232150000,1
2019-01-18,109.862,110.352,109.694,110.253,276560,22,41484000000,1
2019-01-21,110.17,110.269,109.768,109.905,215967,22,32395050000,1
2019-01-22,109.891,109.951,109.455,109.638,280598,22,42089700000,1
2019-01-23,109.628,110.237,109.525,110.106,282509,22,42376350000,1
2019-01-24,110.051,110.432,109.835,109.996,299493,22,44923950000,1
2019-01-25,109.98,110.608,109.888,110.26,300781,22,45117150000,1
2019-01-28,110.248,110.4,110.075,110.156,251229,19,37684350000,1
2019-01-29,110.156,110.424,109.79,109.951,272332,22,40849800000,1
2019-01-30,109.936,110.005,109.466,109.638,284186,22,42627900000,1
2019-01-31,109.638,109.772,109.112,109.437,278278,22,41741700000,1
2019-02-01,109.435,110.232,109.299,109.967,259020,22,38853000000,1
2019-02-04,110.007,110.327,109.906,110.091,245107,22,36766050000,-1
2019-02-05,110.079,110.239,109.72,109.952,232839,22,34925850000,-1
2019-02-06,109.941,110.034,109.499,109.681,236550,22,35482500000,-1
2019-02-07,109.681,109.801,109.456,109.537,343954,20,51593100000,-1
2019-02-08,109.537,109.826,109.406,109.703,381062,20,57159300000,1
2019-02-11,109.586,110.122,108.722,109.928,407533,20,61129950000,1
2019-02-12,109.928,110.167,109.404,109.711,413931,20,62089650000,1
2019-02-13,109.698,110.142,109.656,109.966,403562,20,60534300000,1
2019-02-14,109.963,110.216,109.801,109.885,443228,20,66484200000,-1
2019-02-15,109.873,109.983,109.516,109.844,440337,20,66050550000,-1
2019-02-18,109.793,110.303,109.782,110.078,335279,20,50291850000,-1
2019-02-19,110.078,110.579,109.871,110.484,409148,20,61372200000,-1
2019-02-20,110.484,110.859,110.371,110.768,419692,20,62953800000,-1
2019-02-21,110.776,110.808,110.451,110.53,445593,20,66838950000,-1
2019-02-22,110.53,110.828,110.465,110.591,412945,20,61941750000,-1
2019-02-25,110.474,111.138,110.46,110.959,434096,20,65114400000,-1
2019-02-26,110.959,111.039,110.498,110.598,408955,20,61343250000,-1
2019-02-27,110.598,111.081,110.365,110.806,430219,20,64532850000,-1
2019-02-28,110.806,111.783,110.735,111.561,453888,20,68083200000,1
2019-03-01,111.559,112.156,111.458,111.941,429625,20,64443750000,1
2019-03-04,111.965,112.12,111.619,111.836,468325,20,70248750000,-1
2019-03-05,111.829,111.978,111.292,111.401,410780,20,61617000000,-1
2019-03-06,111.401,111.411,111.137,111.191,455124,20,68268600000,1
2019-03-07,111.189,111.278,110.164,110.288,512179,20,76826850000,1
2019-03-08,110.275,110.427,109.877,110.263,541181,20,81177150000,1
2019-03-11,110.187,110.4,109.924,110.048,492636,20,73895400000,1
2019-03-12,110.049,110.639,110.021,110.473,499775,20,74966250000,1
2019-03-13,110.473,110.848,110.309,110.842,492075,20,73811250000,-1
2019-03-14,110.842,111.324,110.771,111.209,523677,20,78551550000,1
2019-03-15,111.209,111.456,111.01,111.226,436963,20,65544450000,1
2019-03-18,111.213,111.509,111.188,111.268,437385,20,65607750000,-1
2019-03-19,111.268,111.538,111.091,111.472,394428,20,59164200000,-1
2019-03-20,111.472,111.922,111.446,111.596,479712,20,71956800000,-1
2019-03-21,111.594,111.762,111.071,111.733,561313,20,84196950000,-1
2019-03-22,111.733,111.753,110.405,110.603,621914,20,93287100000,-1
2019-03-25,110.686,111.003,110.361,110.793,605123,20,90768450000,-1
2019-03-26,110.793,111.263,110.79,111.216,552548,20,81087300000,-1
2019-03-27,111.216,111.347,110.848,111.028,648921,20,97090050000,-1
2019-03-28,111.028,111.207,110.476,111.195,1203859,20,180578850000,-1
2019-03-29,111.19,111.439,110.996,111.362,1601325,20,240198750000,-1
2019-04-01,111.507,111.725,111.32,111.442,515846,20,77376900000,-1
2019-04-02,111.435,111.634,111.317,111.502,457127,20,68569050000,-1
2019-04-03,111.491,111.941,111.374,111.652,470402,20,70560300000,-1
2019-04-04,111.652,111.783,111.479,111.618,367631,20,55144650000,-1
2019-04-05,111.618,111.761,111.553,111.699,354153,20,53122950000,-1
2019-04-08,111.551,111.705,111.407,111.571,364348,20,54652200000,-1
2019-04-09,111.571,111.645,111.03,111.104,382020,20,57303000000,-1
2019-04-10,111.079,111.203,110.578,110.702,398645,20,59796750000,1
2019-04-11,110.68,111.299,110.558,111.289,380849,20,57127350000,1
2019-04-12,111.289,111.962,111.252,111.706,384448,20,57667200000,1
2019-04-15,111.66,111.812,111.486,111.567,337046,20,50556900000,1
2019-04-16,111.556,111.596,111.044,111.044,403595,20,60539250000,1
2019-04-17,111.044,111.245,110.767,110.825,361009,20,54151350000,1
2019-04-18,110.825,110.868,110.166,110.187,366105,20,54915750000,1
2019-04-19,110.186,110.444,110.184,110.27,514958,20,77243700000,1
2019-04-22,110.273,110.377,110.15,110.195,246378,20,36956700000,1
2019-04-23,110.195,110.239,109.444,109.629,351618,20,52742700000,1
2019-04-24,109.614,109.998,109.453,109.943,419630,20,62944500000,1
2019-04-25,109.943,110.021,109.275,109.433,379900,20,56985000000,1
2019-04-26,109.424,109.645,109.312,109.495,369489,20,55423350000,1
2019-04-29,109.27,109.746,109.27,109.535,253448,20,38017200000,1
2019-04-30,109.535,109.597,109.135,109.351,347369,20,52105350000,1
2019-05-01,109.351,109.768,109.257,109.42,289663,20,43449450000,1
2019-05-02,109.405,109.689,109.316,109.399,351281,20,52692150000,1
2019-05-03,109.399,109.427,109.157,109.268,364928,20,54739200000,-1
2019-05-06,108.827,109.105,108.544,108.784,442677,20,66401550000,-1
2019-05-07,108.784,108.996,107.924,108.1,466727,20,70009050000,-1
2019-05-08,108.1,108.264,107.857,107.88,459130,20,68869500000,-1
2019-05-09,107.88,108.258,107.602,108.09,515569,20,77335350000,-1
2019-05-10,108.106,108.782,107.977,108.63,549076,20,82361400000,-1
2019-05-13,108.392,108.864,108.277,108.589,503337,20,75500550000,1
2019-05-14,108.583,108.992,108.532,108.633,438875,20,65831250000,1
2019-05-15,108.633,108.866,108.305,108.617,447051,20,67057650000,1
2019-05-16,108.617,108.89,108.468,108.743,410576,20,61586400000,1
2019-05-17,108.741,108.97,108.362,108.844,486051,20,72907650000,-1
2019-05-20,108.868,109.118,108.801,109.106,434043,20,65106450000,-1
2019-05-21,109.106,109.598,108.869,109.262,412322,20,61848300000,-1
2019-05-22,109.261,109.621,109.108,109.279,398193,20,59728950000,-1
2019-05-23,109.274,109.404,108.908,109.223,489907,18,73486050000,-1
2019-05-24,109.222,109.41,109.065,109.065,401295,18,60194250000,1
2019-05-27,108.886,109.261,108.8,109.039,286570,18,42985500000,1
2019-05-28,109.035,109.151,108.461,108.504,456228,18,68434200000,1
2019-05-29,108.502,108.751,108.37,108.674,481379,18,72206850000,1
2019-05-30,108.674,108.988,108.613,108.742,429083,18,64362450000,1
2019-05-31,108.737,108.76,107.913,108.167,587174,18,88076100000,1
2019-06-03,108.031,108.912,108.014,108.862,564617,18,84692550000,1
2019-06-04,108.862,109.089,108.636,108.977,532225,18,79833750000,1
2019-06-05,108.967,109.419,108.883,109.002,520884,18,78132600000,-1
2019-06-06,109.002,109.439,108.601,109.326,482133,18,72319950000,1
2019-06-07,109.326,109.632,109.102,109.502,458627,18,68794050000,1
2019-06-10,109.604,109.719,109.353,109.521,446928,18,67039200000,-1
2019-06-11,109.515,109.744,109.273,109.327,473750,18,71062500000,-1
2019-06-12,109.325,109.405,108.944,108.972,507188,18,76078200000,1
2019-06-13,108.972,109.312,108.734,108.993,484873,18,72730950000,1
2019-06-14,108.976,109.111,108.476,108.675,454051,18,68107650000,-1
2019-06-17,108.628,108.884,108.535,108.612,417122,18,62568300000,-1
2019-06-18,108.612,108.704,108.205,108.352,531209,18,79681350000,-1
2019-06-19,108.343,108.909,108.237,108.702,490970,18,73645500000,-1
2019-06-20,108.704,109.595,108.562,109.266,633760,18,95064000000,-1
2019-06-21,109.266,109.993,109.0,109.878,592653,18,88897950000,-1
2019-06-24,109.787,110.496,109.64,110.368,494742,18,74211300000,-1
2019-06-25,110.368,110.481,109.517,109.854,602191,18,90328650000,-1
2019-06-26,109.828,110.386,109.791,110.177,527346,18,79101900000,-1
2019-06-27,110.176,110.434,109.998,110.346,460956,18,69143400000,-1
2019-06-28,110.346,110.562,110.194,110.427,471329,18,70699350000,-1
2019-07-01,110.439,110.806,109.727,109.775,538507,18,80776050000,-1
2019-07-02,109.769,109.859,109.316,109.363,470764,18,70614600000,-1
2019-07-03,109.354,109.487,109.094,109.221,432790,18,64918500000,-1
2019-07-04,109.222,109.451,109.141,109.376,264358,18,39653700000,-1
2019-07-05,109.38,109.525,109.244,109.357,433657,18,65048550000,-1
2019-07-08,109.236,109.513,109.229,109.367,392339,18,58850850000,-1
2019-07-09,109.365,109.62,109.322,109.54,362818,18,54422700000,-1
2019-07-10,109.538,109.926,109.496,109.587,418612,18,62791800000,1
2019-07-11,109.584,109.751,109.358,109.557,389990,18,58498500000,1
2019-07-12,109.557,109.911,109.45,109.616,401828,18,60274200000,-1
2019-07-15,109.223,109.886,109.223,109.58,377597,18,56639550000,-1
2019-07-16,109.579,109.849,109.331,109.545,420934,17,63140100000,1
2019-07-17,109.536,109.611,109.28,109.299,344106,17,51615900000,1
2019-07-18,109.295,109.432,109.064,109.304,429214,17,64382100000,1
2019-07-19,109.303,109.764,109.224,109.696,433452,17,65017800000,1
2019-07-22,109.521,110.052,109.377,109.824,382888,17,57433200000,-1
2019-07-23,109.822,110.032,109.684,109.825,381498,17,57224700000,-1
2019-07-24,109.818,109.864,109.376,109.834,365277,17,54791550000,-1
2019-07-25,109.834,109.872,109.138,109.608,433964,17,65094600000,-1
2019-07-26,109.608,109.759,109.301,109.371,361638,17,54245700000,-1
2019-07-29,109.248,109.765,109.192,109.688,267799,17,40169850000,-1
2019-07-30,109.687,109.815,109.423,109.599,387324,17,58098600000,-1
2019-07-31,109.599,109.794,109.332,109.399,435971,17,65395650000,-1
2019-08-01,109.423,109.652,108.349,108.358,588200,17,88230000000,-1
2019-08-02,108.358,108.667,108.139,108.481,702593,17,105388950000,1
2019-08-05,108.268,109.134,108.013,108.822,718383,17,107757450000,1
2019-08-06,108.822,109.802,108.574,109.006,693109,17,103966350000,1
2019-08-07,109.006,109.114,108.444,108.926,709924,17,106488600000,1
2019-08-08,108.923,109.0,108.416,108.827,547242,17,82086300000,-1
2019-08-09,108.827,108.893,108.271,108.628,479216,17,71882400000,1
2019-08-12,108.335,108.703,107.974,108.606,509772,17,76465800000,1
2019-08-13,108.606,109.634,108.267,109.289,637811,17,95671650000,-1
2019-08-14,109.279,109.332,108.571,108.783,688330,17,103249500000,-1
2019-08-15,108.781,109.436,108.487,108.639,762073,17,114310950000,-1
2019-08-16,108.635,108.699,108.351,108.699,1196567,17,179485050000,-1
2019-08-19,108.366,109.015,108.366,108.615,442665,17,66399750000,1
2019-08-20,108.615,108.712,108.32,108.591,446271,17,66940650000,1
2019-08-21,108.591,108.919,108.424,108.473,404474,17,60671100000,1
2019-08-22,108.463,108.558,108.086,108.151,445530,17,66829500000,1
2019-08-23,108.152,108.297,107.825,108.147,534942,17,80241300000,1
2019-08-26,107.874,108.407,107.495,108.35,712071,17,106810650000,-1
2019-08-27,108.35,108.437,107.706,107.706,1090295,17,163544250000,1
2019-08-28,107.706,108.152,107.567,108.061,1520220,17,228033000000,-1
2019-08-29,108.03,108.269,107.902,107.927,1251348,17,187702200000,-1
2019-08-30,107.935,108.0,107.165,107.165,1486379,17,222956850000,-1
2019-09-02,107.073,107.344,106.944,107.126,353779,17,53066850000,-1
2019-09-03,107.126,107.435,106.846,107.298,510825,17,76623750000,-1
2019-09-04,107.295,108.557,107.209,108.437,477690,17,71653500000,-1
2019-09-05,108.437,108.785,108.194,108.409,623418,17,93512700000,1
2019-09-06,108.409,108.571,107.779,108.233,583034,17,87455100000,1
2019-09-09,107.878,108.246,107.878,108.074,523571,17,78535650000,1
2019-09-10,108.074,108.484,108.046,108.358,547334,17,82100100000,1
2019-09-11,108.358,108.695,108.318,108.558,535726,18,80358900000,1
2019-09-12,108.558,109.388,108.184,109.117,616469,18,92470350000,1
2019-09-13,109.117,109.573,109.074,109.136,510713,18,76606950000,1
2019-09-16,108.777,109.234,108.587,108.882,530675,18,79601250000,1
2019-09-17,108.882,109.157,108.576,108.854,465367,18,69805050000,-1
2019-09-18,108.854,108.981,108.55,108.706,446450,18,66967500000,-1
2019-09-19,108.706,109.03,108.153,108.768,447689,18,67153350000,-1
2019-09-20,108.768,109.01,108.477,108.477,392623,18,58893450000,1
2019-09-23,108.509,108.707,108.288,108.618,405222,18,60783300000,1
2019-09-24,108.618,108.966,108.48,108.596,504078,18,75611700000,1
2019-09-25,108.594,108.977,108.462,108.629,523078,18,78461700000,-1
2019-09-26,108.629,108.699,108.154,108.481,466374,18,69956100000,-1
2019-09-27,108.481,109.069,108.294,108.861,491700,18,73755000000,-1
2019-09-30,108.871,108.965,108.202,108.281,436358,18,65453700000,-1
2019-10-01,108.281,108.536,108.061,108.416,507767,18,76165050000,-1
2019-10-02,108.416,108.621,107.255,107.489,1092331,18,163849650000,-1
2019-10-03,107.489,107.527,106.784,106.989,1767540,18,265131000000,-1
2019-10-04,106.981,107.617,106.729,107.381,2015165,18,302274750000,-1
2019-10-07,107.233,107.905,107.105,107.787,435997,18,65399550000,1
2019-10-08,107.787,108.059,107.661,107.77,553532,18,83029800000,-1
2019-10-09,107.77,108.132,107.732,107.899,927889,18,139183350000,-1
2019-10-10,107.899,108.456,107.699,108.259,1942426,18,291363900000,-1
2019-10-11,108.259,108.958,108.089,108.536,2108602,18,316290300000,-1
2019-10-14,108.454,108.803,108.434,108.649,400654,18,60098100000,1
2019-10-15,108.649,109.054,108.378,108.961,506239,18,75935850000,-1
2019-10-16,108.961,109.33,108.783,109.26,1021044,18,153156600000,1
2019-10-17,109.26,110.041,109.207,109.94,1531587,18,229738050000,1
2019-10-18,109.94,110.153,109.787,110.057,1482450,18,222367500000,-1
2019-10-21,109.966,110.386,109.926,110.122,365045,18,54756750000,-1
2019-10-22,110.116,110.199,109.602,109.602,420538,18,63080700000,-1
2019-10-23,109.602,109.761,109.374,109.648,460686,18,69102900000,-1
2019-10-24,109.648,109.924,109.337,109.422,435140,18,65271000000,-1
2019-10-25,109.422,109.588,109.21,109.22,420106,18,63015900000,-1
2019-10-28,109.252,109.572,109.137,109.526,371513,18,55726950000,-1
2019-10-29,109.531,109.623,109.272,109.542,406541,18,60981150000,-1
2019-10-30,109.541,110.063,109.405,109.988,484650,18,72697500000,-1
2019-10-31,109.992,110.183,109.387,109.454,475284,18,71292600000,-1
2019-11-01,109.456,109.869,109.24,109.719,777597,18,116639550000,1
2019-11-04,109.53,110.053,109.53,109.885,381452,18,57217800000,1
2019-11-05,109.885,110.113,109.709,109.918,519463,18,77919450000,1
2019-11-06,109.908,109.975,109.67,109.748,879585,18,131937750000,1
2019-11-07,109.748,110.127,109.453,109.806,1691958,18,253793700000,1
2019-11-08,109.813,109.906,109.404,109.504,1847107,18,277066050000,-1
2019-11-11,109.545,109.79,109.321,109.749,329280,18,49392000000,1
2019-11-12,109.749,109.898,109.577,109.752,466287,18,69943050000,1
2019-11-13,109.752,110.166,109.656,109.893,488828,18,73324200000,1
2019-11-14,109.893,110.073,109.568,109.709,489917,18,73487550000,1
2019-11-15,109.709,109.966,109.617,109.859,420854,18,63128100000,1
2019-11-18,109.919,110.168,109.751,109.817,429490,18,64423500000,1
2019-11-19,109.817,109.882,109.483,109.57,436199,18,65429850000,-1
2019-11-20,109.57,109.613,109.232,109.581,520486,18,78072900000,-1
2019-11-21,109.581,109.699,109.312,109.359,541053,18,81157950000,1
2019-11-22,109.359,109.433,108.824,108.895,455291,18,68293650000,1
2019-11-25,108.875,109.363,108.781,109.271,425824,18,63873600000,-1
2019-11-26,109.271,109.468,109.034,109.3,459940,18,68991000000,-1
2019-11-27,109.302,109.634,109.261,109.585,446085,18,66912750000,-1
2019-11-28,109.585,109.699,109.472,109.613,332860,18,49929000000,-1
2019-11-29,109.613,109.713,109.362,109.453,431893,18,64783950000,-1
2019-12-02,109.472,110.004,109.427,109.92,441273,18,66190950000,-1
2019-12-03,109.92,110.225,109.831,110.034,515369,18,77305350000,-1
2019-12-04,110.034,110.169,109.841,110.087,519761,18,77964150000,-1
2019-12-05,110.088,110.236,109.952,110.146,460426,18,69063900000,1
2019-12-06,110.146,110.174,109.575,109.575,428980,18,64347000000,1
2019-12-09,109.584,109.956,109.498,109.768,333262,18,49989300000,1
2019-12-10,109.771,110.545,109.753,110.421,414705,18,62205750000,1
2019-12-11,110.421,110.557,110.169,110.439,443408,18,66511200000,1
2019-12-12,110.436,111.02,110.364,110.929,511781,18,76767150000,1
2019-12-13,110.93,111.77,110.174,111.097,629055,18,94358250000,1
2019-12-16,111.058,111.554,111.058,111.47,382876,18,57431400000,1
2019-12-17,111.47,111.812,111.326,111.653,390142,18,58521300000,1
2019-12-18,111.653,111.816,111.45,111.69,381225,18,57183750000,1
2019-12-19,111.69,111.844,111.552,111.771,688523,18,103278450000,1
2019-12-20,111.761,111.819,111.197,111.197,1039109,18,155866350000,1
2019-12-23,111.34,111.594,111.224,111.373,318481,18,47772150000,-1
2019-12-24,111.363,111.598,111.226,111.488,245479,18,36821850000,-1
2019-12-26,111.625,111.822,111.572,111.655,194124,18,29118600000,-1
2019-12-27,111.655,112.557,111.576,112.283,328342,18,49251300000,-1
2019-12-30,112.17,112.571,112.026,112.323,364966,18,54744900000,1
2019-12-31,112.323,112.474,112.06,112.294,308750,18,46312500000,1
2020-01-02,112.19,112.382,111.505,111.745,308076,18,46211400000,1
2020-01-03,111.74,111.808,110.922,111.117,543139,18,81470850000,1
2020-01-06,111.081,112.003,110.91,111.879,496934,18,74540100000,1
2020-01-07,111.879,111.987,111.525,111.751,499788,18,74968200000,1
2020-01-08,111.751,112.177,111.308,112.015,789459,18,118418850000,1
2020-01-09,112.015,112.698,111.983,112.505,937637,18,140645550000,1
2020-01-10,112.505,112.656,112.3,112.516,1166945,18,175041750000,-1
2020-01-13,112.57,113.338,112.444,113.234,398749,18,59812350000,-1
2020-01-14,113.234,113.778,113.096,113.691,470031,18,70504650000,-1
2020-01-15,113.691,114.15,113.53,113.978,449311,18,67396650000,-1
2020-01-16,113.978,114.377,113.922,114.144,417119,18,62567850000,-1
2020-01-17,114.144,114.284,113.62,113.731,398876,18,59831400000,-1
2020-01-20,113.695,113.86,113.572,113.749,285792,18,42868800000,-1
2020-01-21,113.749,113.883,113.354,113.395,486690,18,73003500000,-1
2020-01-22,113.395,113.519,113.015,113.468,440462,18,66069300000,-1
2020-01-23,113.468,113.501,112.695,112.958,488881,18,73332150000,-1
2020-01-24,112.958,113.075,112.473,112.476,441961,18,66294150000,-1
2020-01-27,112.158,112.562,112.066,112.274,562092,18,84313800000,-1
2020-01-28,112.274,112.416,111.99,112.162,918388,18,137758200000,1
2020-01-29,112.158,112.29,111.731,111.992,1319925,18,197988750000,1
2020-01-30,111.938,112.387,111.917,112.367,2414051,18,362107650000,1
2020-01-31,112.358,112.693,112.249,112.419,2232775,18,334916250000,1
2020-02-03,112.494,112.665,112.307,112.48,584074,18,87611100000,1
2020-02-04,112.48,112.996,112.339,112.973,1053764,18,158064600000,1
2020-02-05,112.962,113.09,112.633,112.789,1595030,18,239254500000,1
2020-02-06,112.789,112.896,112.656,112.835,1897603,18,284640450000,1
2020-02-07,112.801,112.852,112.219,112.222,2402536,18,360380400000,-1
2020-02-10,112.247,112.388,112.173,112.312,448685,18,67302750000,-1
2020-02-11,112.311,112.583,112.142,112.486,465078,18,69761700000,1
2020-02-12,112.485,112.901,112.472,112.532,464509,18,69676350000,1
2020-02-13,112.532,112.532,112.03,112.104,548666,18,82299900000,1
2020-02-14,112.104,112.147,111.733,111.736,859041,18,128856150000,1
2020-02-17,111.845,112.071,111.739,112.005,312931,18,46939650000,1
2020-02-18,112.005,112.009,111.619,111.716,482621,18,72393150000,1
2020-02-19,111.716,113.352,111.716,113.151,469450,18,70417500000,1
2020-02-20,113.152,114.235,113.031,113.885,566313,18,84946950000,1
2020-02-21,113.885,114.267,113.419,114.029,528397,18,79259550000,-1
2020-02-24,113.536,114.062,112.858,113.08,718385,18,107757750000,-1
2020-02-25,113.08,113.345,112.675,112.868,851272,18,127690800000,1
2020-02-26,112.868,113.507,112.801,113.028,888039,18,133205850000,1
2020-02-27,113.028,113.549,112.943,113.225,966913,18,145036950000,1
2020-02-28,113.223,113.245,111.316,111.647,1124839,18,168725850000,1
2020-03-02,111.473,112.967,111.331,112.875,989213,18,148381950000,-1
2020-03-03,112.875,113.235,111.756,111.974,911475,18,136721250000,-1
2020-03-04,111.974,112.774,111.836,112.351,836930,18,125539500000,-1
2020-03-05,112.351,112.604,111.979,112.231,790398,18,118559700000,-1
2020-03-06,112.236,112.851,111.943,112.332,1062365,18,159354750000,1
2020-03-09,112.01,112.252,109.541,110.34,1174163,18,176124450000,1
2020-03-10,110.34,112.617,110.148,111.975,1239550,18,185932500000,1
2020-03-11,111.975,112.461,110.979,111.138,1109465,18,166419750000,1
2020-03-12,111.151,111.829,110.25,110.765,1127722,18,169158300000,1
2020-03-13,110.762,113.721,110.578,113.22,1186986,18,178047900000,1
2020-03-16,113.071,113.164,111.097,111.88,1232342,18,184851300000,1
2020-03-17,111.879,112.855,111.105,111.995,1301052,18,195157800000,1
2020-03-18,112.002,112.166,110.944,111.586,1294415,18,194162250000,-1
2020-03-19,111.593,113.018,111.531,112.217,1284357,18,192653550000,-1
2020-03-20,112.217,113.141,111.835,112.313,1205293,18,180793950000,-1
2020-03-23,112.434,113.559,111.502,112.865,1197306,18,179595900000,-1
2020-03-24,112.865,113.761,112.436,113.293,1190938,18,178640700000,-1
2020-03-25,113.305,113.988,112.875,113.779,1176139,18,176420850000,-1
2020-03-26,113.779,113.937,112.902,113.434,1105443,18,165816450000,-1
2020-03-27,113.442,113.686,112.419,113.41,1025004,18,153750600000,-1
2020-03-30,112.742,113.281,112.295,112.401,889941,18,133491150000,1
2020-03-31,112.401,113.051,111.471,111.867,951132,18,142669800000,1
2020-04-01,111.867,112.157,110.524,110.961,847702,18,127155300000,1
2020-04-02,110.961,111.194,110.298,110.768,840632,18,126094800000,-1
2020-04-03,110.769,111.223,110.637,110.908,738888,18,110833200000,-1
2020-04-06,110.73,111.896,110.73,111.583,803471,18,120520650000,-1
2020-04-07,111.583,112.472,111.243,112.176,795037,18,119255550000,-1
2020-04-08,112.18,112.408,111.731,111.934,689188,18,103378200000,-1
2020-04-09,111.934,112.514,111.872,112.229,691315,19,103697250000,1
2020-04-10,112.229,112.393,111.835,112.099,350892,19,52633800000,1
2020-04-13,112.079,112.363,111.183,111.331,384969,19,57745350000,-1
2020-04-14,111.328,111.722,111.211,111.649,449425,19,67413750000,-1
2020-04-15,111.627,111.685,110.883,111.312,388690,19,58303500000,-1
2020-04-16,111.271,111.641,110.863,111.141,425093,19,63763950000,-1
2020-04-17,111.14,111.529,110.871,111.072,429485,19,64422750000,1
2020-04-20,110.831,111.488,110.828,111.167,433879,19,65081850000,1
2020-04-21,111.158,111.334,110.512,111.096,566138,19,84920700000,1
2020-04-22,111.034,111.382,110.71,110.889,441194,19,66179100000,1
2020-04-23,110.889,111.064,109.946,110.189,542752,19,81412800000,-1
2020-04-24,110.186,110.493,109.867,110.312,469959,19,70493850000,-1
2020-04-27,110.46,110.567,109.741,109.884,425427,19,63814050000,-1
2020-04-28,109.884,110.063,109.357,109.6,454886,19,68232900000,-1
2020-04-29,109.576,109.759,109.192,109.473,427359,19,64103850000,-1
2020-04-30,109.473,111.316,109.167,110.938,519961,19,77994150000,-1
2020-05-01,110.952,111.511,110.759,111.106,425582,19,63837300000,-1
2020-05-04,110.903,111.104,110.443,110.484,385452,19,57817800000,-1
2020-05-05,110.481,110.589,109.417,109.434,385120,19,57768000000,-1
2020-05-06,109.442,109.577,108.691,108.761,402693,19,60403950000,-1
2020-05-07,108.744,109.255,108.682,109.125,332156,19,49823400000,-1
2020-05-08,109.163,109.929,109.132,109.704,298068,19,44710200000,-1
2020-05-11,109.536,110.773,109.445,110.581,397828,19,59674200000,1
2020-05-12,110.571,111.048,110.243,110.465,413363,19,62004450000,-1
2020-05-13,110.466,110.652,110.005,110.061,426753,19,64012950000,-1
2020-05-14,110.061,110.251,109.674,110.184,431298,19,64694700000,1
2020-05-15,110.184,110.407,109.822,110.088,395122,19,59268300000,-1
2020-05-18,110.006,110.941,109.892,110.423,369369,19,55405350000,1
2020-05-19,110.423,111.285,110.237,110.842,377513,19,56626950000,-1
2020-05-20,110.842,111.485,110.785,111.351,326566,19,48984900000,1
2020-05-21,111.299,111.645,110.76,110.854,348319,19,52247850000,1
2020-05-22,110.854,110.967,110.433,110.701,326473,19,48970950000,1
2020-05-25,110.578,110.958,110.564,110.78,244555,19,36683250000,1
2020-05-26,110.792,111.481,110.687,111.307,367549,19,55132350000,1
2020-05-27,111.303,111.435,110.662,111.129,489580,19,73437000000,-1
2020-05-28,111.068,111.764,110.853,111.589,429231,19,64384650000,-1
2020-05-29,111.589,112.197,111.179,111.966,494509,19,74176350000,-1
2020-06-01,111.78,112.293,111.78,111.935,481453,19,72217950000,-1
2020-06-02,111.958,113.059,111.795,112.895,514775,19,77216250000,-1
2020-06-03,112.895,113.342,112.475,113.285,575053,19,86257950000,1
2020-06-04,113.286,114.323,113.085,114.229,567738,19,85160700000,1
2020-06-05,114.194,114.584,113.586,113.727,589733,19,88459950000,1
2020-06-08,113.747,114.061,113.054,113.215,472011,19,70801650000,-1
2020-06-09,113.215,113.627,112.596,113.301,543298,19,81494700000,-1
2020-06-10,113.301,113.672,113.063,113.478,583864,19,87579600000,-1
2020-06-11,113.478,113.733,113.125,113.176,668249,19,100237350000,-1
2020-06-12,113.175,113.682,112.464,112.708,671510,19,100726500000,-1
2020-06-15,112.67,113.255,112.36,113.08,603154,19,90473100000,-1
2020-06-16,113.08,113.433,112.709,112.796,597403,19,89610450000,-1
2020-06-17,112.796,113.199,112.522,112.777,500168,19,75025200000,-1
2020-06-18,112.778,112.87,112.102,112.433,524646,19,78696900000,-1
2020-06-19,112.417,112.592,112.099,112.099,463837,19,69575550000,-1
2020-06-22,111.839,112.88,111.839,112.79,444616,19,66692400000,-1
2020-06-23,112.789,113.423,112.423,112.72,514162,19,77095650000,-1
2020-06-24,112.72,113.004,112.497,112.908,516831,19,77524650000,-1
2020-06-25,112.908,113.128,112.679,113.001,492145,19,73821750000,-1
2020-06-26,113.001,113.141,112.658,112.926,468076,19,70211400000,-1
2020-06-29,112.797,113.607,112.797,113.08,436443,19,65466450000,-1
2020-06-30,113.08,114.002,112.889,113.921,499438,19,74915700000,1
2020-07-01,113.922,114.138,113.168,113.613,461181,19,69177150000,1
2020-07-02,113.613,113.989,113.477,113.7,434179,19,65126850000,-1
2020-07-03,113.7,113.809,113.469,113.469,290970,19,43645500000,-1
2020-07-06,113.472,114.534,113.472,113.891,396867,19,59530050000,-1
2020-07-07,113.891,114.338,113.79,114.066,402233,19,60334950000,-1
2020-07-08,114.066,114.619,113.957,114.292,391855,19,58778250000,1
2020-07-09,114.292,114.585,113.899,114.012,369008,19,55351200000,1
2020-07-10,114.012,114.047,113.301,113.509,322899,19,48434850000,1
2020-07-13,113.339,114.05,113.339,113.933,393017,19,58952550000,-1
2020-07-14,113.93,114.314,113.701,114.065,465945,19,69891750000,1
2020-07-15,114.065,114.215,113.074,113.217,445890,19,66883500000,1
2020-07-16,113.216,113.651,113.015,113.38,437128,19,65569200000,1
2020-07-17,113.37,114.074,113.301,113.986,352190,19,52828500000,1
2020-07-20,113.591,114.369,113.591,114.217,384596,19,57689400000,1
2020-07-21,114.216,114.504,113.961,114.448,380068,19,57010200000,1
2020-07-22,114.448,115.397,114.35,115.264,490468,19,73570200000,1
2020-07-23,115.264,115.668,115.164,115.459,470148,19,70522200000,1
2020-07-24,115.46,115.518,114.489,115.188,545151,19,81772650000,1
2020-07-27,114.977,115.273,114.113,114.523,525291,19,78793650000,1
2020-07-28,114.523,114.808,114.356,114.481,571881,19,85782150000,1
2020-07-29,114.481,115.035,114.27,114.955,554028,19,83104200000,1
2020-07-30,114.955,115.339,114.831,115.201,590343,19,88551450000,1
2020-07-31,115.201,116.299,114.888,115.832,694627,19,104194050000,1
2020-08-03,115.643,116.119,114.972,115.421,644433,18,96664950000,1
2020-08-04,115.424,116.015,115.298,115.744,525052,18,78757800000,1
2020-08-05,115.744,116.509,115.58,116.225,501993,18,75298950000,-1
2020-08-06,116.225,116.347,115.596,116.026,545601,18,81840150000,-1
2020-08-07,116.027,116.102,115.46,116.056,560243,18,84036450000,-1
2020-08-10,115.835,116.077,115.553,115.703,463001,18,69450150000,-1
2020-08-11,115.703,116.419,115.631,116.138,628178,18,94226700000,-1
2020-08-12,116.138,117.417,115.996,117.185,643191,18,96478650000,-1
2020-08-13,117.201,117.6,117.075,117.515,570411,18,85561650000,-1
2020-08-14,117.515,117.63,116.969,117.164,408759,18,61313850000,-1
2020-08-17,117.127,117.439,116.88,116.905,406135,18,60920250000,1
2020-08-18,116.906,117.005,116.457,116.62,492974,18,73946100000,1
2020-08-19,116.615,116.91,115.683,115.886,523553,18,78532950000,1
2020-08-20,115.886,116.586,115.79,116.55,541372,18,81205800000,1
2020-08-21,116.55,116.583,115.778,116.037,504028,18,75604200000,1
2020-08-24,115.808,116.61,115.808,116.2,420680,18,63102000000,1
2020-08-25,116.2,117.269,116.158,117.188,472829,18,70924350000,1
2020-08-26,117.188,117.374,116.616,116.671,457879,18,68681850000,1
2020-08-27,116.671,117.328,116.371,117.2,560485,18,84072750000,1
2020-08-28,117.2,117.875,116.324,116.412,599841,18,89976150000,1
2020-08-31,116.392,117.794,116.225,117.172,537043,18,80556450000,1
2020-09-01,117.173,117.489,116.451,116.501,582784,18,87417600000,1
2020-09-02,116.501,116.67,116.105,116.591,514377,18,77156550000,1
2020-09-03,116.593,117.005,116.244,116.745,531864,18,79779600000,1
2020-09-04,116.746,116.808,116.056,116.212,545111,18,81766650000,1
2020-09-07,116.128,116.467,115.892,115.915,448200,18,67230000000,1
2020-09-08,115.915,116.023,115.265,115.494,642465,18,96369750000,1
2020-09-09,115.501,116.434,115.146,116.355,589998,18,88499700000,1
2020-09-10,116.356,117.297,116.209,116.526,627769,18,94165350000,1
2020-09-11,116.526,116.978,116.493,116.71,544237,18,81635550000,1
2020-09-14,116.585,116.907,116.314,116.371,484526,18,72678900000,1
2020-09-15,116.374,116.764,115.986,116.094,503391,18,75508650000,1
2020-09-16,116.094,116.172,115.272,115.371,573342,18,86001300000,-1
2020-09-17,115.372,115.406,114.76,115.303,570263,18,85539450000,1
2020-09-18,115.297,115.455,114.535,114.616,463674,18,69551100000,1
2020-09-21,114.698,114.837,113.672,114.412,563400,18,84510000000,1
2020-09-22,114.412,114.501,114.027,114.062,542316,18,81347400000,1
2020-09-23,114.062,114.253,113.909,113.986,582431,18,87364650000,1
2020-09-24,113.986,114.371,113.641,113.709,597232,18,89584800000,1
2020-09-25,113.705,113.912,113.526,113.605,517091,18,77563650000,1
2020-09-28,113.516,114.219,113.266,113.959,518872,18,77830800000,1
2020-09-29,113.957,114.977,113.957,114.789,581059,18,87158850000,1
2020-09-30,114.789,115.024,114.356,114.5,676011,18,101401650000,1
2020-10-01,114.499,115.164,114.41,114.807,662907,18,99436050000,1
2020-10-02,114.807,114.897,114.036,114.33,681362,18,102204300000,1
2020-10-05,114.456,115.591,114.425,115.455,561811,18,84271650000,1
2020-10-06,115.45,115.695,114.959,114.997,589759,18,88463850000,1
2020-10-07,114.997,115.737,114.982,115.475,561377,18,84206550000,1
2020-10-08,115.475,115.732,115.216,115.596,520230,18,78034500000,1
2020-10-09,115.608,116.165,115.463,115.776,518613,18,77791950000,1
2020-10-12,115.981,116.195,115.701,115.805,516605,18,77490750000,1
2020-10-13,115.805,115.967,115.224,115.224,552687,18,82903050000,1
2020-10-14,115.224,115.395,115.034,115.07,522353,18,78352950000,1
2020-10-15,115.07,115.331,114.991,115.196,579509,18,86926350000,-1
2020-10-16,115.207,115.451,114.857,115.11,518387,18,77758050000,-1
2020-10-19,115.083,115.981,115.027,115.853,517333,18,77599950000,-1
2020-10-20,115.853,116.582,115.664,116.276,543966,18,81594900000,-1
2020-10-21,116.287,116.372,115.449,115.47,593401,18,89010150000,-1
2020-10-22,115.47,115.641,115.275,115.563,480533,18,72079950000,1
2020-10-23,115.562,115.908,115.221,115.683,461547,18,69232050000,1
2020-10-26,115.543,115.946,115.449,115.455,494643,18,74196450000,1
2020-10-27,115.455,115.568,114.829,114.881,463324,18,69498600000,1
2020-10-28,114.881,115.02,114.185,114.551,586101,18,87915150000,1
2020-10-29,114.551,114.893,114.07,114.202,589428,18,88414200000,-1
2020-10-30,114.202,114.464,113.775,113.975,561810,18,84271500000,-1
2020-11-02,113.959,114.334,113.807,113.886,511924,18,76788600000,-1
2020-11-03,113.872,114.64,113.803,114.353,585007,18,87751050000,-1
2020-11-04,114.354,114.972,114.239,114.564,837490,18,125623500000,-1
2020-11-05,114.569,114.966,114.258,114.285,656363,18,98454450000,-1
2020-11-06,114.285,115.057,114.207,114.793,664721,18,99708150000,-1
2020-11-09,114.728,116.097,114.624,115.33,737653,18,110647950000,-1
2020-11-10,115.33,115.36,114.828,114.985,731724,18,109758600000,-1
2020-11-11,114.985,115.209,114.751,114.886,555269,18,83290350000,-1
2020-11-12,114.884,115.333,114.705,114.873,561659,18,84248850000,-1
2020-11-13,114.873,114.962,114.487,114.55,527620,18,79143000000,-1
2020-11-16,114.612,114.999,114.411,114.537,534237,18,80135550000,-1
2020-11-17,114.554,114.655,114.251,114.288,518785,18,77817750000,-1
2020-11-18,114.276,114.32,113.819,113.863,528744,18,79311600000,-1
2020-11-19,113.863,114.106,113.728,113.867,562015,18,84302250000,-1
2020-11-20,113.867,114.189,113.707,113.852,516004,18,77400600000,-1
2020-11-23,113.803,114.605,113.79,114.369,576882,18,86532300000,-1
2020-11-24,114.418,114.842,114.153,114.572,586980,18,88047000000,-1
2020-11-25,114.572,115.008,114.212,114.897,593752,18,89062800000,-1
2020-11-26,114.897,115.098,114.628,114.91,469675,18,70451250000,1
2020-11-27,114.91,115.054,114.552,114.911,451341,18,67701150000,1
2020-11-30,114.937,115.636,114.716,114.721,594846,18,89226900000,1
2020-12-01,114.721,115.984,114.694,115.887,579238,18,86885700000,1
2020-12-02,115.887,116.803,115.844,116.656,615412,18,92311800000,1
2020-12-03,116.656,116.921,116.351,116.486,612678,18,91901700000,1
2020-12-04,116.486,117.035,116.323,116.627,553766,18,83064900000,1
2020-12-07,116.718,117.153,116.563,116.768,592711,18,88906650000,-1
2020-12-08,116.768,117.227,116.667,117.085,560073,18,84010950000,-1
2020-12-09,117.102,117.427,117.019,117.165,571663,18,85593750000,1
2020-12-10,117.16,117.752,117.064,117.613,601450,18,90217500000,1
2020-12-11,117.643,117.679,116.639,116.912,594670,18,89200500000,-1
2020-12-14,116.907,117.446,116.785,117.268,608289,18,91243350000,-1
2020-12-15,117.277,117.594,116.88,117.003,573961,18,86094150000,1
2020-12-16,117.001,117.099,116.72,116.822,614208,18,92131200000,1
2020-12-17,116.844,116.922,116.387,116.476,603730,18,90559500000,1
2020-12-18,116.476,117.17,116.374,116.535,609785,18,91467750000,1
2020-12-21,116.886,117.06,116.419,116.629,763379,18,114506850000,-1
2020-12-22,116.633,116.904,116.393,116.427,586947,18,88042050000,-1
2020-12-23,116.427,116.654,116.154,116.474,577235,18,86585250000,-1
2020-12-24,116.474,116.78,116.207,116.277,340012,18,51001800000,-1
2020-12-28,116.274,116.832,116.143,116.604,483052,18,72457800000,-1
2020-12-29,116.601,117.274,116.59,117.119,460514,18,69077100000,-1
2020-12-30,117.119,117.246,116.477,117.039,538245,18,80736750000,-1
2020-12-31,117.039,117.189,116.57,116.575,375208,18,56281200000,-1
2021-01-04,116.639,117.3,116.439,116.926,524025,18,78603750000,1
2021-01-05,116.907,117.129,116.733,116.918,443183,18,66477450000,1
2021-01-06,116.897,117.465,116.781,117.216,613050,18,91957500000,1
2021-01-07,117.216,117.511,117.14,117.196,529723,18,79458450000,1
2021-01-08,117.197,117.564,117.041,117.168,555469,18,83320350000,1
2021-01-11,117.247,117.39,116.879,117.081,439765,18,65964750000,1
2021-01-12,117.079,117.228,116.874,117.018,444734,18,66710100000,1
2021-01-13,117.018,117.207,116.853,116.965,428252,18,64237800000,1
2021-01-14,116.965,117.288,116.727,116.837,478287,18,71743050000,-1
2021-01-15,116.839,116.902,116.375,116.474,423946,18,63591900000,-1
2021-01-18,116.537,116.584,116.277,116.318,393821,18,59073150000,-1
2021-01-19,116.319,117.263,116.303,116.897,433881,18,65082150000,-1
2021-01-20,116.897,117.035,116.222,116.311,428415,18,64262250000,-1
2021-01-21,116.311,116.945,116.212,116.85,374384,18,56157600000,-1
2021-01-22,116.85,117.3,116.796,117.09,427426,18,64113900000,-1
2021-01-25,117.046,117.267,116.673,116.691,414480,18,62172000000,-1
2021-01-26,116.691,116.941,116.641,116.789,400489,18,60073350000,1
2021-01-27,116.801,117.225,116.729,117.06,487956,18,73193400000,1
2021-01-28,117.06,117.562,116.975,117.183,508801,18,76320150000,1
2021-01-29,117.183,118.001,117.174,117.431,544161,18,81624150000,1
2021-02-01,117.564,117.633,116.919,116.927,454709,18,68206350000,1
2021-02-02,116.927,117.212,116.841,116.949,440510,18,66076500000,1
2021-02-03,116.949,117.008,116.693,116.798,372502,18,55875300000,1
2021-02-04,116.798,116.872,116.585,116.673,420149,18,63022350000,1
2021-02-05,116.673,117.235,116.654,117.122,409657,18,61448550000,1
2021-02-08,117.031,117.335,116.969,116.997,394804,18,59220600000,1
2021-02-09,116.997,117.233,116.91,117.153,439630,18,65944500000,1
2021-02-10,117.153,117.725,117.095,117.425,397128,18,59569200000,1
2021-02-11,117.425,117.715,117.295,117.616,323656,18,48548400000,1
2021-02-12,117.616,117.878,117.368,117.368,342611,18,51391650000,1
2021-02-15,117.545,118.39,117.545,118.272,301326,18,45198900000,-1
2021-02-16,118.272,118.834,118.175,118.772,430542,18,64581300000,1
2021-02-17,118.772,118.859,117.718,117.718,436307,18,65446050000,-1
2021-02-18,117.718,117.987,117.665,117.931,405570,18,60835500000,-1
2021-02-19,117.931,118.073,117.498,117.498,394069,18,59110350000,-1
2021-02-22,117.408,117.791,117.116,117.166,443933,18,66589950000,-1
2021-02-23,117.165,117.403,116.185,116.212,413151,18,61972650000,-1
2021-02-24,116.217,116.847,116.164,116.745,513597,18,77039550000,-1
2021-02-25,116.745,117.647,116.65,117.307,621984,18,93297600000,-1
2021-02-26,117.307,117.778,117.022,117.21,691779,18,103766850000,-1
2021-03-01,117.19,117.436,116.376,116.579,481117,18,72167550000,1
2021-03-02,116.579,116.8,116.257,116.588,485818,18,72872700000,1
2021-03-03,116.591,116.853,116.281,116.284,490567,18,73585050000,-1
2021-03-04,116.28,116.568,115.956,116.22,572470,18,85870500000,-1
2021-03-05,116.22,116.936,116.016,116.335,659642,18,98946300000,1
2021-03-08,116.68,116.68,116.072,116.2,626747,18,94012050000,1
2021-03-09,116.2,116.976,116.174,116.888,688072,18,103210800000,1
2021-03-10,116.89,117.145,116.494,116.54,623597,18,93539550000,1
2021-03-11,116.536,117.407,116.367,117.334,630407,18,94561050000,-1
2021-03-12,117.334,117.535,116.997,117.122,622279,18,93341850000,-1
2021-03-15,117.237,117.685,117.169,117.653,554460,18,83169000000,-1
2021-03-16,117.652,118.074,117.455,117.761,526221,18,78933150000,-1
2021-03-17,117.761,118.061,117.479,117.954,543712,18,81556800000,-1
2021-03-18,117.954,118.173,117.218,117.386,656941,18,98541150000,-1
2021-03-19,117.386,117.622,116.9,117.036,537324,18,80598600000,-1
2021-03-22,116.652,117.901,116.652,117.899,501778,18,75266700000,-1
2021-03-23,117.899,117.899,116.169,116.274,521467,18,78220050000,-1
2021-03-24,116.274,116.367,115.901,116.17,503218,18,75482700000,1
2021-03-25,116.17,116.66,116.073,116.115,526607,18,78991050000,1
2021-03-26,116.115,116.851,116.08,116.642,476747,18,71512050000,1
2021-03-29,116.713,117.041,116.407,116.811,500075,18,75011250000,1
2021-03-30,116.811,117.202,116.765,117.026,416511,18,62476650000,1
2021-03-31,117.033,117.665,116.973,117.245,579426,18,86913900000,1
2021-04-01,117.246,117.549,116.924,117.334,544451,18,81667650000,1
2021-04-02,117.334,117.544,117.092,117.478,300574,18,45086100000,1
2021-04-05,117.265,117.723,117.169,117.558,420798,18,63119700000,-1
2021-04-06,117.558,117.993,117.365,117.855,507438,18,76115700000,-1
2021-04-07,117.855,118.354,117.628,118.005,480047,18,72007050000,-1
2021-04-08,118.007,118.298,117.617,118.06,446517,18,66977550000,-1
2021-04-09,118.06,118.625,117.98,118.529,464683,18,69702450000,-1
2021-04-12,118.302,118.706,118.137,118.469,411236,18,61685400000,-1
2021-04-13,118.469,118.733,118.015,118.402,479412,18,71911800000,1
2021-04-14,118.402,118.594,117.956,118.003,460007,18,69001050000,-1
2021-04-15,117.996,118.082,117.644,117.776,452797,18,67919550000,-1
2021-04-16,117.792,118.622,117.679,118.113,425957,18,63893550000,1
2021-04-19,118.342,118.461,117.819,118.159,491231,18,73684650000,-1
2021-04-20,118.159,118.636,117.887,118.005,491697,18,73754550000,-1
2021-04-21,118.005,118.039,117.562,117.787,446085,18,66912750000,-1
2021-04-22,117.787,118.14,117.576,117.597,474115,18,71117250000,-1
2021-04-23,117.597,118.214,117.487,117.964,447015,18,67052250000,-1
2021-04-26,118.021,118.307,117.731,118.138,443341,18,66501150000,-1
2021-04-27,118.139,119.012,118.084,118.925,418515,18,62777250000,-1
2021-04-28,118.923,119.499,118.729,119.24,496604,18,74490600000,-1
2021-04-29,119.24,120.112,119.21,119.832,436032,18,65404800000,-1
2021-04-30,119.83,119.973,119.577,119.682,459881,18,68982150000,1
2021-05-03,119.571,120.171,119.535,119.671,393474,18,59021100000,1
2021-05-04,119.671,119.818,119.452,119.569,478253,18,71737950000,-1
2021-05-05,119.569,119.752,119.259,119.52,393057,18,58958550000,-1
2021-05-06,119.516,120.403,119.501,120.212,426451,18,63967650000,-1
2021-05-07,120.213,120.607,120.019,120.566,517520,18,77628000000,-1
2021-05-10,120.268,121.069,120.202,120.728,505887,18,75883050000,1
2021-05-11,120.685,120.952,120.131,120.169,527357,18,79103550000,1
2021-05-12,120.161,120.694,120.04,120.593,569752,18,85462800000,1
2021-05-13,120.569,121.046,120.483,120.7,572904,18,85935600000,1
2021-05-14,120.702,121.336,120.627,121.123,461573,18,69235950000,1
2021-05-17,121.099,121.386,120.836,120.876,440323,18,66048450000,1
2021-05-18,120.861,121.512,120.835,121.221,452791,18,67918650000,1
2021-05-19,121.221,121.516,120.534,120.739,578669,18,86800350000,1
2021-05-20,120.739,121.22,120.637,121.182,495066,18,74259900000,-1
2021-05-21,121.184,121.45,120.961,121.124,462615,18,69392250000,-1
2021-05-24,121.182,121.417,121.016,121.139,430473,18,64570950000,-1
2021-05-25,121.149,121.814,121.074,121.34,508224,18,76233600000,-1
2021-05-26,121.34,121.767,121.34,121.529,489183,18,73377450000,1
2021-05-27,121.528,122.521,121.397,122.365,507514,18,76127100000,1
2021-05-28,122.367,122.503,121.894,121.937,487778,18,73166700000,1
2021-05-31,121.899,122.133,121.569,121.856,332184,18,49827600000,1
2021-06-01,121.856,122.252,121.674,121.939,441842,18,66276300000,1
2021-06-02,121.944,122.307,121.729,121.987,469022,18,70353300000,1
2021-06-03,121.987,122.13,121.747,122.032,411121,18,61668150000,1
2021-06-04,122.035,122.095,121.612,121.683,451575,18,67736250000,1
2021-06-07,121.678,121.898,121.459,121.672,398152,18,59722800000,1
2021-06-08,121.671,122.173,121.624,122.093,457753,18,68662950000,1
2021-06-09,122.086,122.45,121.974,122.355,358675,18,53801250000,1
2021-06-10,122.359,122.53,121.956,122.201,428321,18,64248150000,1
2021-06-11,122.194,122.47,121.963,122.033,406843,18,61026450000,-1
2021-06-14,121.843,122.375,121.822,122.272,381190,18,57178500000,-1
2021-06-15,122.274,122.76,122.231,122.501,371599,18,55739850000,-1
2021-06-16,122.501,122.572,121.782,121.825,426357,18,63953550000,-1
2021-06-17,121.822,121.93,119.928,120.031,607421,18,91113150000,-1
2021-06-18,120.031,120.211,119.275,119.338,578541,18,86781150000,-1
2021-06-21,119.606,120.188,118.859,119.992,575658,18,86348700000,-1
2021-06-22,120.049,120.571,119.87,120.462,481594,18,72239100000,-1
2021-06-23,120.452,120.981,120.353,120.76,451198,18,67679700000,1
2021-06-24,120.76,120.982,120.477,120.774,466491,18,69973650000,1
2021-06-25,120.762,120.94,120.498,120.498,442308,18,66346200000,1
2021-06-28,120.389,120.888,120.169,120.279,448528,18,67279200000,1
2021-06-29,120.297,120.337,119.8,119.892,441104,18,66165600000,1
2021-06-30,119.881,120.123,119.623,120.099,497810,18,74671500000,1
2021-07-01,120.102,120.677,119.91,120.409,493385,18,74007750000,1
2021-07-02,120.416,120.67,120.248,120.501,495185,18,74277750000,1
2021-07-05,120.167,120.609,119.982,120.251,292129,18,43819350000,1
2021-07-06,120.251,120.491,119.564,119.65,501175,18,75176250000,1
2021-07-07,119.65,120.031,119.383,119.408,441614,18,66242100000,1
2021-07-08,119.408,120.042,118.987,119.693,514048,18,77107200000,1
2021-07-09,119.693,120.537,119.665,120.352,405408,18,60811200000,1
2021-07-12,120.387,120.628,120.17,120.582,465188,18,69778200000,1
2021-07-13,120.598,120.721,120.03,120.383,523104,18,78465600000,1
2021-07-14,120.383,120.464,119.916,120.024,551867,18,82780050000,1
2021-07-15,120.024,120.425,119.545,119.627,554536,18,83180400000,1
2021-07-16,119.616,120.033,119.552,119.552,528791,18,79318650000,1
2021-07-19,119.541,119.71,118.926,119.19,631859,18,94778850000,1
2021-07-20,119.19,119.472,118.645,119.158,602034,18,90305100000,1
2021-07-21,119.148,120.262,118.999,120.184,530343,18,79551450000,1
2021-07-22,120.179,120.257,119.654,119.804,530233,18,79534950000,1
2021-07-23,119.809,120.226,119.696,120.183,348936,18,52340400000,1
2021-07-26,120.09,120.593,119.849,120.438,439176,18,65876400000,1
2021-07-27,120.438,120.542,119.876,120.025,521808,18,78271200000,1
2021-07-28,120.01,120.772,119.92,120.767,515565,18,77334750000,1
2021-07-29,120.767,121.037,120.544,120.792,483228,18,72484200000,1
2021-07-30,120.788,121.182,120.693,120.801,493980,18,74097000000,1
2021-08-02,120.999,121.199,120.587,120.682,474924,18,71238600000,1
2021-08-03,120.682,121.006,120.412,120.594,546536,18,81980400000,1
2021-08-04,120.594,120.936,120.366,120.733,498354,18,74753100000,1
2021-08-05,120.733,121.122,120.553,120.995,475188,18,71278200000,1
2021-08-06,120.995,121.105,120.353,120.421,455642,18,68346300000,1
2021-08-09,120.568,120.597,119.746,119.756,416168,18,62425200000,1
2021-08-10,119.756,120.027,119.638,119.803,411282,18,61692300000,1
2021-08-11,119.784,119.991,119.677,119.734,408610,18,61291500000,1
2021-08-12,119.74,119.831,119.449,119.475,356633,18,53494950000,1
2021-08-13,119.452,119.941,119.366,119.654,380359,18,57053850000,1
2021-08-16,119.521,119.854,119.32,119.621,422923,18,63438450000,1
2021-08-17,119.621,120.117,119.565,119.722,471408,18,70711200000,-1
2021-08-18,119.733,120.079,119.535,119.699,477392,18,71608800000,-1
2021-08-19,119.699,119.845,119.279,119.281,568428,18,85264200000,-1
2021-08-20,119.281,119.807,119.276,119.519,449034,18,67355100000,1
2021-08-23,119.57,120.303,119.453,120.211,444101,18,66615150000,1
2021-08-24,120.209,120.339,119.994,120.06,405331,18,60799650000,-1
2021-08-25,120.034,120.486,119.944,120.362,426294,18,63944100000,-1
2021-08-26,120.348,120.419,119.789,119.93,427537,18,64130550000,-1
2021-08-27,119.93,120.572,119.699,120.406,442163,18,66324450000,-1
2021-08-30,120.39,120.595,119.682,119.837,334745,18,50211750000,-1
2021-08-31,119.83,120.405,119.739,120.19,484981,18,72747150000,-1
2021-09-01,120.191,120.405,119.944,120.042,471140,18,70671000000,1
2021-09-02,120.042,120.305,119.992,120.215,313491,18,47023650000,1
2021-09-03,120.218,120.411,119.934,119.999,378082,18,56712300000,-1
2021-09-06,120.089,120.186,119.809,119.988,206864,18,29391750000,-1
2021-09-07,119.988,120.35,119.843,119.887,387988,18,57171900000,1
2021-09-08,119.881,120.017,119.499,119.558,403032,18,60454800000,1
2021-09-09,119.54,119.834,119.428,119.541,401311,18,60196650000,1
2021-09-10,119.541,120.089,119.522,119.628,349156,18,52373400000,1
2021-09-13,119.844,119.844,119.128,119.215,386145,18,57921750000,-1
2021-09-14,119.215,119.641,119.092,119.118,389707,18,58456050000,-1
2021-09-15,119.108,119.265,118.815,118.895,382445,18,57366750000,-1
2021-09-16,118.894,118.965,118.106,118.26,389069,18,58360350000,-1
2021-09-17,118.258,118.686,117.814,117.817,411010,18,61651500000,1
2021-09-20,117.793,118.072,117.529,117.902,423232,18,63484800000,1
2021-09-21,117.893,118.48,117.761,118.247,380342,18,57051300000,1
2021-09-22,118.244,118.854,118.023,118.515,469678,18,70451700000,1
2021-09-23,118.515,119.445,118.369,119.336,417799,18,62669850000,1
2021-09-24,119.336,119.841,119.151,119.564,383421,18,57513150000,1
2021-09-27,119.539,119.943,119.225,119.894,417739,18,62660850000,1
2021-09-28,119.887,120.2,119.752,119.937,515899,18,77384850000,1
2021-09-29,119.912,120.155,119.658,119.785,397651,18,59647650000,1
2021-09-30,119.785,119.941,119.173,119.398,502746,18,74701800000,1
2021-10-01,119.374,119.618,119.015,119.087,503114,18,75467100000,1
2021-10-04,119.031,120.26,118.946,119.813,499743,18,74961450000,1
2021-10-05,119.815,120.258,119.694,120.08,457043,18,68556450000,-1
2021-10-06,120.07,120.243,119.744,120.117,520932,18,78139800000,-1
2021-10-07,120.117,120.374,119.94,120.175,420588,18,63088200000,-1
2021-10-08,120.177,121.099,120.1,120.863,456851,18,68527650000,-1
2021-10-11,120.755,122.336,120.692,122.07,378576,18,56786400000,-1
2021-10-12,122.07,122.323,121.915,121.916,457228,18,68584200000,-1
2021-10-13,121.886,122.707,121.868,122.512,473400,18,71010000000,-1
2021-10-14,122.508,123.288,122.432,123.07,316043,18,47406450000,-1
2021-10-15,123.07,123.873,122.971,123.612,449438,18,67415700000,1
2021-10-18,123.442,123.868,123.231,123.723,479664,18,71949600000,1
2021-10-19,123.723,124.287,123.574,123.892,414074,18,62111100000,1
2021-10-20,123.892,124.422,123.613,124.309,450096,18,67514400000,1
2021-10-21,124.317,124.538,123.784,124.101,441123,18,66168450000,1
2021-10-22,124.061,124.376,123.716,123.833,465251,18,69787650000,1
2021-10-25,123.868,124.195,123.527,123.599,425725,18,63858750000,1
2021-10-26,123.601,124.209,123.476,123.945,373768,18,56065200000,1
2021-10-27,123.912,124.208,123.569,123.947,485956,18,72893400000,1
2021-10-28,123.942,124.535,123.51,124.528,552757,18,82913550000,-1
2021-10-29,124.528,125.027,124.228,124.273,531342,18,79701300000,-1
2021-11-01,124.403,125.466,124.388,125.269,478185,18,71727750000,-1
2021-11-02,125.269,125.501,124.323,124.535,433913,18,65086950000,1
2021-11-03,124.535,125.14,124.463,124.967,433168,18,64975200000,-1
2021-11-04,124.967,125.224,124.266,124.55,462170,18,69325500000,-1
2021-11-05,124.551,124.75,123.94,124.18,444935,18,66740250000,-1
2021-11-08,124.186,124.517,123.588,123.922,381560,18,57234000000,-1
2021-11-09,123.908,124.01,123.408,123.808,507524,18,76128600000,-1
2021-11-10,123.797,124.487,123.621,123.876,537899,18,80684850000,-1
2021-11-11,123.883,124.229,123.411,123.835,410353,18,61552950000,-1
2021-11-12,123.833,123.939,123.371,123.617,445907,18,66886050000,-1
2021-11-15,123.678,123.94,123.321,123.337,456296,18,68444400000,-1
2021-11-16,123.334,123.637,123.004,123.434,504329,18,75649350000,-1
2021-11-17,123.434,123.515,122.715,122.752,525332,18,78799800000,-1
2021-11-18,122.788,123.465,122.659,123.408,507002,18,76050300000,1
2021-11-19,123.377,123.503,122.419,122.703,590357,18,88553550000,1
2021-11-22,122.639,123.422,122.506,123.086,566065,18,84909750000,1
2021-11-23,123.096,123.498,122.98,123.377,583863,18,87579450000,1
2021-11-24,123.376,123.604,122.759,123.434,569596,18,85439400000,1
2021-11-25,123.401,123.698,123.155,123.155,353169,18,52975350000,1
2021-11-26,123.155,123.346,122.23,122.656,754034,18,113105100000,1
2021-11-29,122.922,123.147,122.125,122.863,668586,18,100287900000,1
2021-11-30,122.851,123.357,122.577,122.629,758016,18,113702400000,-1
2021-12-01,122.631,123.533,122.481,122.505,642304,18,96345600000,-1
2021-12-02,122.509,123.055,122.306,122.695,639027,18,95854050000,-1
2021-12-03,122.701,123.518,122.586,122.849,642564,18,96384600000,1
2021-12-06,122.885,123.073,122.379,122.549,524009,18,78601350000,1
2021-12-07,122.536,123.107,122.328,122.661,476146,18,71421900000,1
2021-12-08,122.661,123.573,122.361,123.207,518039,18,77705850000,1
2021-12-09,123.185,123.653,122.479,122.689,405264,18,60789600000,1
2021-12-10,122.693,123.206,122.618,123.13,431585,18,64737750000,1
2021-12-13,122.831,123.269,122.797,122.92,390836,18,58625400000,1
2021-12-14,122.86,123.549,122.85,122.949,390209,18,58531350000,1
2021-12-15,122.947,123.375,122.818,123.003,445227,18,66784050000,1
2021-12-16,122.998,123.963,122.998,123.561,489781,18,73467150000,1
2021-12-17,123.559,123.797,122.934,122.934,487143,18,73071450000,1
2021-12-20,122.991,123.375,122.656,123.109,488550,18,73282500000,1
2021-12-21,123.109,123.567,123.094,123.248,396659,18,59498850000,1
2021-12-22,123.245,124.191,123.221,123.876,351543,18,52731450000,-1
2021-12-23,123.863,124.69,123.743,124.173,294032,18,44104800000,-1
2021-12-24,124.174,124.74,124.113,124.451,293124,18,43968600000,1
2021-12-27,124.305,125.24,124.168,125.117,247229,18,37084350000,1
2021-12-28,125.099,125.388,124.917,125.087,256490,18,38473500000,1
2021-12-29,125.06,125.871,124.968,125.643,292107,18,43816050000,1
2021-12-30,125.618,126.044,125.423,125.909,294371,18,44155650000,1
2021-12-31,125.896,126.456,125.74,126.207,225278,18,33791700000,1
2022-01-03,125.998,126.309,125.3,125.361,324584,18,48687600000,1
2022-01-04,125.345,127.067,125.227,126.625,389507,18,58426050000,1
2022-01-05,126.648,126.819,126.307,126.535,417522,18,62628300000,-1
2022-01-06,126.504,126.596,125.661,125.708,458685,18,68802750000,-1
2022-01-07,125.708,125.89,125.438,125.709,397355,18,59603250000,-1
2022-01-10,125.683,125.9,124.162,124.168,431488,18,64723200000,-1
2022-01-11,124.13,124.945,124.103,124.827,418018,18,62702700000,-1
2022-01-12,124.829,125.614,124.713,125.335,430678,18,64601700000,-1
2022-01-13,125.32,125.647,125.179,125.295,423435,18,63515250000,-1
2022-01-14,125.287,125.358,124.512,124.916,480580,18,72087000000,-1
2022-01-17,124.956,125.454,124.735,125.307,292826,18,43923900000,-1
2022-01-18,125.097,125.662,124.835,124.878,526256,18,78938400000,-1
2022-01-19,124.874,125.151,124.659,124.659,489721,18,73458150000,-1
2022-01-20,124.629,125.159,124.342,124.367,471390,18,70708500000,-1
2022-01-21,124.36,125.003,124.017,124.676,545712,18,81856800000,-1
2022-01-24,124.554,124.844,124.353,124.659,575046,18,86256900000,-1
2022-01-25,124.446,124.784,123.762,123.924,540535,18,81080250000,-1
2022-01-26,123.918,124.339,123.811,123.938,508415,18,76262250000,-1
2022-01-27,124.022,124.184,123.578,123.909,613301,18,91995150000,-1
2022-01-28,123.896,124.211,123.678,123.684,530421,18,79563150000,-1
2022-01-31,123.62,124.299,123.54,124.039,498015,18,74702250000,-1
2022-02-01,124.039,124.549,123.888,124.323,466192,18,69928800000,-1
2022-02-02,124.3,124.599,124.184,124.525,423153,18,63472950000,-1
2022-02-03,124.524,125.126,124.251,124.937,528360,18,79254000000,-1
2022-02-04,124.937,125.096,124.217,124.376,524863,18,78729450000,1
2022-02-07,124.514,124.726,124.235,124.499,488214,18,73232100000,1
2022-02-08,124.48,125.07,124.303,124.888,478826,18,71823900000,-1
2022-02-09,124.888,125.179,124.743,124.824,437384,18,65607600000,-1
2022-02-10,124.791,125.578,124.791,125.322,593617,18,89042550000,1
2022-02-11,125.323,125.414,124.287,124.582,617380,18,92607000000,1
2022-02-14,124.578,125.005,124.316,124.955,727693,18,109153950000,-1
2022-02-15,124.941,125.325,124.681,124.691,595584,18,89337600000,-1
2022-02-16,124.72,125.364,124.649,125.106,556824,18,83523600000,-1
2022-02-17,125.106,125.388,124.659,124.781,648526,18,97278900000,1
2022-02-18,124.796,125.174,124.678,124.732,588675,18,88301250000,1
2022-02-21,124.822,125.474,124.575,125.249,421997,18,63299550000,1
2022-02-22,125.257,125.312,124.737,124.83,697441,18,104616150000,1
2022-02-23,124.83,125.513,124.76,125.173,492547,18,73882050000,1
2022-02-24,125.173,125.322,123.998,124.667,985065,18,147759750000,1
2022-02-25,124.49,125.047,124.422,124.793,703540,18,105531000000,1
2022-02-28,124.336,125.647,124.336,125.387,799918,18,119987700000,1
2022-03-01,125.385,125.655,124.736,125.057,703793,18,105568950000,1
2022-03-02,125.056,125.641,124.922,125.498,700454,18,105068100000,1
2022-03-03,125.51,125.906,125.381,125.837,609769,18,91465350000,1
2022-03-04,125.84,125.884,124.813,125.084,740776,18,111116400000,-1
2022-03-07,125.241,125.286,124.247,124.522,818556,18,122783400000,1
2022-03-08,124.5,124.99,124.274,124.274,796731,18,119509650000,-1
2022-03-09,124.376,125.14,124.359,124.963,635142,18,95271300000,-1
2022-03-10,124.962,125.274,124.676,124.84,622672,18,93400800000,-1
2022-03-11,124.836,125.689,124.715,125.418,605264,18,90789600000,-1
2022-03-14,125.558,126.452,125.464,125.905,565023,18,84753450000,-1
2022-03-15,125.905,126.141,125.38,125.58,601502,18,90225300000,-1
2022-03-16,125.58,126.267,125.573,126.196,649355,18,97403250000,-1
2022-03-17,126.196,126.821,126.071,126.513,565831,18,84874650000,-1
2022-03-18,126.513,127.895,126.487,127.82,512530,18,76879500000,-1
2022-03-21,127.68,128.212,127.513,127.935,440977,18,66146550000,-1
2022-03-22,127.935,129.598,127.924,129.499,583180,18,87477000000,-1
2022-03-23,129.501,130.211,129.02,130.093,556064,18,83409600000,-1
2022-03-24,130.093,131.555,129.868,131.513,580691,18,87103650000,-1
2022-03-25,131.513,131.676,130.845,131.012,616024,18,92403600000,-1
2022-03-28,130.952,133.558,130.896,132.303,741521,18,111228150000,-1
2022-03-29,132.122,132.864,131.092,131.861,768536,18,115280400000,-1
2022-03-30,131.642,132.354,130.749,131.837,734391,18,110158650000,-1
2022-03-31,131.837,132.665,131.418,131.726,745888,18,111883200000,1
2022-04-01,131.736,132.87,131.607,131.998,643823,18,96573450000,1
2022-04-04,132.281,132.742,132.104,132.526,554645,18,83196750000,1
2022-04-05,132.503,133.075,132.169,132.94,560116,18,84017400000,1
2022-04-06,132.94,133.287,132.499,132.607,672736,18,100910400000,1
2022-04-07,132.584,132.948,132.342,132.646,593596,18,89039400000,1
2022-04-08,132.646,133.255,132.367,132.97,542894,18,81434100000,1
2022-04-11,133.013,134.898,132.704,134.608,603915,18,90587250000,1
2022-04-12,134.608,134.871,134.226,134.226,674868,18,101230200000,1
2022-04-13,134.191,135.418,134.147,134.147,622274,18,93341100000,1
2022-04-14,134.255,134.442,133.4,133.534,619591,18,92938650000,1
2022-04-15,133.532,134.36,133.431,133.916,368289,45,55243350000,1
2022-04-18,133.882,134.454,133.84,134.397,472662,18,70899300000,-1
2022-04-19,134.397,136.18,134.364,135.374,686115,18,102917250000,-1
2022-04-20,135.372,135.845,134.478,134.478,769773,18,115465950000,-1
2022-04-21,134.546,135.358,134.435,134.594,739877,18,110981550000,-1
2022-04-22,134.594,134.876,133.911,134.021,628849,18,94327350000,-1
2022-04-25,134.185,134.675,133.059,133.58,787233,18,118084950000,-1
2022-04-26,133.58,133.672,132.127,132.173,757989,18,113698350000,1
2022-04-27,132.173,132.83,131.907,132.52,748933,18,112339950000,1
2022-04-28,132.52,135.04,132.418,134.414,828637,18,124295550000,1
2022-04-29,134.414,134.685,132.985,133.32,679276,18,101891400000,-1
2022-05-02,133.523,134.053,132.863,132.929,623363,18,93504450000,-1
2022-05-03,132.909,133.625,132.737,133.016,580520,18,87078000000,-1
2022-05-04,133.016,133.045,131.987,132.74,590301,18,88545150000,-1
2022-05-05,132.74,132.968,131.843,132.013,747160,18,112074000000,-1
2022-05-06,131.952,132.71,131.819,131.899,751106,18,112665900000,-1
2022-05-09,131.998,132.359,130.818,131.0,736875,18,110531250000,-1
2022-05-10,130.975,131.627,130.426,130.867,726919,18,109037850000,-1
2022-05-11,130.833,131.802,130.383,130.619,738996,18,110849400000,1
2022-05-12,130.576,130.787,127.494,127.754,843368,18,126505200000,1
2022-05-13,127.754,129.213,127.63,128.823,669629,18,100444350000,1
2022-05-16,128.884,129.266,128.244,128.647,581143,18,87171450000,1
2022-05-17,128.614,130.602,128.58,130.134,667245,18,100086750000,1
2022-05-18,130.103,130.372,129.023,129.49,657089,18,98563350000,1
2022-05-19,129.357,131.634,129.354,131.335,834189,18,125128350000,1
2022-05-20,131.259,132.021,130.856,130.996,768977,18,115346550000,1
2022-05-23,131.126,132.598,130.821,132.353,628407,18,94261050000,1
2022-05-24,132.321,132.479,131.673,131.967,682698,18,102404700000,1
2022-05-25,131.965,132.444,131.667,132.175,723315,18,108497250000,1
2022-05-26,132.115,132.715,131.783,132.31,667586,18,100137900000,1
2022-05-27,132.205,132.955,132.12,132.677,579947,18,86992050000,1
2022-05-30,132.638,133.309,132.377,133.037,505727,18,75859050000,1
2022-05-31,133.016,134.428,132.792,133.907,727996,18,109199400000,1
2022-06-01,133.906,135.245,133.906,134.884,703555,18,105533250000,1
2022-06-02,134.863,135.606,134.863,135.266,616708,18,92506200000,1
2022-06-03,135.208,135.971,135.208,135.887,595963,18,89394450000,1
2022-06-06,135.851,136.154,135.624,135.8,624070,18,93610500000,1
2022-06-07,135.791,136.796,135.769,136.022,760178,18,114026700000,1
2022-06-08,136.038,137.786,136.01,137.154,782977,18,117446550000,1
2022-06-09,137.154,137.61,136.194,136.87,814737,18,122210550000,1
2022-06-10,136.858,137.116,135.451,135.868,809763,18,121464450000,1
2022-06-13,135.808,136.61,134.166,134.573,923205,18,138480750000,1
2022-06-14,134.56,135.91,134.396,135.228,995958,18,149393700000,1
2022-06-15,135.228,135.409,134.04,134.45,1014585,18,152187750000,1
2022-06-16,134.45,137.195,134.186,136.499,1028543,18,154281450000,-1
2022-06-17,136.502,139.976,136.502,138.985,1064897,18,159734550000,-1
2022-06-20,138.743,140.161,138.743,139.287,783423,18,117513450000,-1
2022-06-21,139.219,141.443,139.219,140.993,871714,18,130757100000,-1
2022-06-22,141.293,141.879,140.623,141.606,820768,18,123115200000,1
2022-06-23,141.596,141.724,139.849,140.373,974616,18,146192400000,1
2022-06-24,140.34,141.678,139.856,141.009,783142,18,117471300000,-1
2022-06-27,140.888,141.751,140.499,141.539,752880,18,112932000000,-1
2022-06-28,141.53,142.748,141.325,142.124,804874,18,120731100000,-1
2022-06-29,142.109,143.748,141.865,142.93,831213,18,124681950000,1
2022-06-30,142.92,143.256,141.812,142.061,783409,18,117511350000,-1
2022-07-01,142.039,142.311,140.063,140.394,777000,18,116550000000,-1
2022-07-04,140.688,141.575,140.387,141.017,690214,18,103532100000,-1
2022-07-05,140.789,142.016,139.929,139.945,856526,18,128478900000,-1
2022-07-06,139.93,140.239,138.856,139.952,802673,18,120400950000,-1
2022-07-07,139.952,140.36,139.388,139.498,516713,18,77506950000,-1
2022-07-08,139.532,139.843,138.663,139.188,526675,18,79001250000,-1
2022-07-11,139.087,140.352,138.942,139.598,530693,16,121172100000,-1
2022-07-12,139.598,139.865,138.759,139.044,546764,22,164029200000,-1
2022-07-13,138.887,140.678,138.887,140.112,565616,22,169684800000,-1
2022-07-14,140.168,141.493,140.155,141.172,610692,22,183207600000,-1
2022-07-15,141.175,141.915,140.995,141.781,516701,17,155010300000,-1
2022-07-18,141.685,142.025,141.12,141.163,499443,17,149832900000,1
2022-07-19,141.151,142.682,140.926,142.523,532334,17,159700200000,1
2022-07-20,142.523,142.814,141.867,141.891,521744,17,156523200000,1
2022-07-21,141.874,143.089,141.861,142.043,583293,17,174987900000,1
2022-07-22,142.018,142.425,141.188,141.468,550410,17,165123000000,1
2022-07-25,141.249,141.787,140.811,141.674,500649,17,150194700000,1
2022-07-26,141.671,142.197,141.296,142.037,469357,17,140807100000,1
2022-07-27,142.038,142.557,141.887,141.967,496600,17,148980000000,1
2022-07-28,141.968,142.29,140.39,140.447,558119,17,167435700000,1
2022-07-29,140.407,141.045,139.311,139.979,560453,17,168135900000,1
2022-08-01,139.846,140.119,138.489,138.523,539298,17,161789400000,1
2022-08-02,138.491,139.098,137.146,139.046,584658,17,175397400000,1
2022-08-03,139.045,139.659,138.597,139.288,580006,17,174001800000,1
2022-08-04,139.277,139.987,138.825,138.966,521371,17,156411300000,1
2022-08-05,138.953,140.669,138.885,140.355,527398,17,158219400000,1
2022-08-08,140.04,141.34,140.04,141.195,509731,17,152919300000,1
2022-08-09,140.852,141.889,140.852,141.431,444131,17,133239300000,-1
2022-08-10,141.442,142.391,140.447,140.862,496163,17,148848900000,-1
2022-08-11,140.862,141.367,140.389,141.094,528556,17,158566800000,-1
2022-08-12,141.083,142.128,140.967,141.783,497332,17,149199600000,-1
2022-08-15,141.719,141.834,140.516,140.792,481766,17,144529800000,1
2022-08-16,140.793,141.81,140.475,141.166,496858,17,149057400000,1
2022-08-17,141.069,142.313,141.069,141.664,522299,17,156689700000,1
2022-08-18,141.663,142.17,141.468,142.039,503941,17,151182300000,1
2022-08-19,142.039,143.304,141.853,142.688,480058,17,144017400000,1
2022-08-22,142.772,143.246,142.367,142.488,491080,17,147324000000,1
2022-08-23,142.488,142.7,141.375,141.812,463150,17,138945000000,1
2022-08-24,141.811,141.965,141.313,141.717,437240,17,131172000000,1
2022-08-25,141.717,142.025,141.335,141.469,479733,17,143919900000,1
2022-08-26,141.425,142.685,141.395,142.341,465498,17,139649400000,1
2022-08-29,142.371,143.419,142.232,143.159,480483,17,144144900000,1
2022-08-30,143.159,143.347,142.209,142.281,449673,17,134901900000,-1
2022-08-31,142.24,142.531,141.413,142.017,516997,17,155099100000,-1
2022-09-01,142.017,142.859,141.907,142.738,531751,17,159525300000,-1
2022-09-02,142.738,143.257,142.456,142.775,487886,17,146365800000,-1
2022-09-05,142.581,143.48,142.35,143.257,456048,17,136814400000,-1
2022-09-06,143.209,145.339,143.12,145.049,554916,17,166474800000,-1
2022-09-07,145.049,147.365,144.779,147.045,595004,17,178501200000,-1
2022-09-08,147.045,148.5,146.714,148.392,565983,17,169794900000,1
2022-09-09,148.392,148.807,147.499,148.42,558105,17,167431500000,1
2022-09-12,148.123,149.807,147.96,149.747,547039,17,164111700000,1
2022-09-13,149.747,150.484,148.793,150.299,544806,17,163441800000,1
2022-09-14,150.301,150.695,148.329,148.364,572381,17,171714300000,1
2022-09-15,148.527,150.136,148.446,149.097,545436,17,163630800000,1
2022-09-16,149.083,149.232,148.031,148.156,531650,17,159495000000,1
2022-09-19,148.244,148.681,147.919,148.404,484106,17,145231800000,1
2022-09-20,148.404,149.238,148.186,149.037,539068,17,161720400000,1
2022-09-21,149.037,149.678,148.416,149.008,576683,17,173004900000,1
2022-09-22,148.97,151.455,143.507,145.383,625661,17,187698300000,1
2022-09-23,145.412,146.586,144.986,145.888,566596,17,169978800000,1
2022-09-26,146.175,146.578,145.15,145.493,637309,17,191192700000,-1
2022-09-27,145.118,146.566,145.118,145.878,625275,17,187582500000,-1
2022-09-28,145.736,147.841,145.284,147.566,641897,17,192569100000,-1
2022-09-29,147.53,148.068,146.779,147.815,615355,17,184606500000,-1
2022-09-30,147.92,148.545,146.513,146.556,592751,17,177825300000,-1
2022-10-03,146.525,147.365,145.197,145.547,558498,17,167549400000,-1
2022-10-04,145.539,147.426,145.357,146.742,556959,17,167087700000,-1
2022-10-05,146.733,147.244,146.426,146.848,539653,17,161895900000,1
2022-10-06,146.765,147.801,146.199,146.455,567157,17,170147100000,1
2022-10-07,146.453,146.608,145.508,146.066,495106,22,148531800000,1
2022-10-10,146.111,146.47,145.557,145.662,484339,22,145301700000,1
2022-10-11,145.61,146.79,145.422,146.134,546325,22,163897500000,1
2022-10-12,146.134,147.494,145.804,147.029,542084,22,162625200000,1
2022-10-13,147.029,147.399,145.746,146.852,535987,22,160796100000,1
2022-10-14,147.015,148.051,146.897,147.887,563197,22,168959100000,1
2022-10-17,147.696,149.647,147.39,149.401,529400,22,158820000000,1
2022-10-18,149.28,150.129,148.768,149.931,536253,22,160875900000,-1
2022-10-19,149.842,150.207,148.905,149.219,551100,22,165330000000,-1
2022-10-20,149.188,149.856,148.651,149.419,563138,22,168941400000,-1
2022-10-21,149.419,150.543,146.414,147.857,663899,22,199169700000,-1
2022-10-24,148.06,149.608,146.056,148.514,615216,22,184564800000,-1
2022-10-25,148.614,149.19,148.182,148.564,479694,22,143908200000,-1
2022-10-26,148.564,149.092,148.124,148.334,595288,22,178586400000,1
2022-10-27,148.295,148.57,147.214,147.441,608412,22,182523600000,1
2022-10-28,147.43,148.512,147.203,147.988,580896,22,174268800000,1
2022-10-31,148.138,148.789,147.714,148.463,555802,22,166740600000,1
2022-11-01,148.447,148.669,147.865,148.066,583524,22,175057200000,1
2022-11-02,148.062,148.264,146.686,147.237,546399,22,163919700000,1
2022-11-03,147.227,147.745,145.828,146.136,516949,22,155084700000,1
2022-11-04,146.132,147.639,145.993,147.408,545022,22,163506600000,1
2022-11-07,147.247,148.371,146.768,148.135,564184,22,169255200000,1
2022-11-08,148.142,148.39,147.447,147.607,521092,22,150626400000,1
2022-11-09,147.559,148.869,147.424,148.583,569508,22,170852400000,1
2022-11-10,148.514,148.788,145.469,146.131,582119,22,174635700000,1
2022-11-11,146.133,147.478,144.565,147.177,635518,22,190655400000,1
2022-11-14,147.503,149.08,146.923,148.031,599496,22,179848800000,1
2022-11-15,147.69,148.776,146.985,147.356,574672,22,172401600000,1
2022-11-16,147.333,148.487,147.049,147.49,604787,22,181436100000,-1
2022-11-17,147.49,147.721,147.083,147.153,557312,22,167193600000,-1
2022-11-18,147.19,147.436,146.521,147.004,543766,22,163129800000,-1
2022-11-21,146.983,148.312,146.777,148.184,509353,22,152805900000,-1
2022-11-22,148.216,148.647,147.647,148.32,441201,22,132360300000,-1
2022-11-23,148.291,148.848,147.827,147.931,503441,22,151032300000,-1
2022-11-24,147.931,148.115,146.33,146.609,447811,22,134343300000,-1
2022-11-25,146.508,147.687,146.494,146.889,467450,22,140235000000,-1
2022-11-28,147.021,147.184,145.79,146.323,534800,22,160440000000,1
2022-11-29,146.323,146.663,145.021,145.108,568212,22,170463600000,1
2022-11-30,145.261,146.891,145.14,145.839,586516,22,175954800000,1
2022-12-01,145.826,146.047,143.979,144.274,594276,22,178282800000,-1
2022-12-02,144.261,144.501,142.886,143.301,555360,22,166608000000,-1
2022-12-05,143.167,145.277,143.05,144.889,532502,22,159750600000,1
2022-12-06,144.946,145.497,144.716,145.302,552067,22,165620100000,1
2022-12-07,145.303,146.257,144.89,145.171,459699,22,137909700000,-1
2022-12-08,145.171,146.039,144.842,145.653,517552,22,140863550000,-1
2022-12-09,145.723,146.539,145.009,146.104,537108,22,134277000000,-1
2022-12-12,145.998,147.086,145.893,146.915,456077,22,114019250000,-1
2022-12-13,146.914,147.288,145.279,145.964,524413,22,131103250000,1
2022-12-14,145.631,146.729,145.199,146.514,584524,22,146131000000,1
2022-12-15,146.467,148.47,146.272,148.327,566791,22,141697750000,1
2022-12-16,148.311,148.525,146.161,146.305,518484,22,129621000000,1
2022-12-19,145.513,147.411,145.436,147.392,538726,22,134681500000,1
2022-12-20,147.384,147.771,141.025,142.181,619798,22,154949500000,-1
2022-12-21,142.183,143.215,141.844,142.918,532081,22,133020250000,-1
2022-12-22,142.915,143.02,141.986,142.106,523299,22,130824750000,-1
2022-12-23,142.091,142.856,141.873,141.995,509429,22,127357250000,-1
2022-12-26,141.845,142.818,141.816,142.345,71253,99,17813250000,1
2022-12-27,142.344,143.787,142.239,143.622,402835,22,100708750000,1
2022-12-28,143.627,144.853,143.331,144.543,413588,22,103397000000,-1
2022-12-29,144.552,144.763,143.753,144.038,479003,22,119750750000,-1
2022-12-30,143.719,144.139,141.613,141.717,487672,22,121918000000,-1
