Predicted,Actual
0.5359725,0.5269144
0.53464895,0.5266729
0.53531766,0.5245595
0.5311908,0.5257013
0.5305768,0.52885765
0.5289584,0.5296097
0.5289547,0.5290553
0.5304155,0.5269693
0.53091407,0.52880824
0.5307074,0.5300653
0.52940273,0.52876985
0.53054065,0.52984023
0.53154993,0.5308229
0.53114486,0.52814955
0.5319677,0.52818793
0.5325785,0.52406543
0.5310453,0.5244936
0.5306686,0.5220947
0.52775776,0.5187188
0.52735615,0.51931715
0.52527964,0.52273154
0.5226921,0.52186966
0.52205735,0.5295164
0.52358556,0.5315749
0.5230302,0.5306307
0.52775735,0.5300049
0.5301551,0.5327935
0.5306104,0.5315859
0.5310507,0.53371024
0.53301984,0.5339518
0.532597,0.5346709
0.53370893,0.5288741
0.53409725,0.5283197
0.5345042,0.52772135
0.5312795,0.53340286
0.53029495,0.53367734
0.5295162,0.53004336
0.53266674,0.5285228
0.5334687,0.5292419
0.53184646,0.5279409
0.5312402,0.5312675
0.5313823,0.5298458
0.5305904,0.52985126
0.5321272,0.5246693
0.5313381,0.52427953
0.5311471,0.5244881
0.52777976,0.5288357
0.52679896,0.5261843
0.52648467,0.52950543
0.52862006,0.52557504
0.5275013,0.5241807
0.52959645,0.52487785
0.52779627,0.5216446
0.52663374,0.5178954
0.52699083,0.52489436
0.52473533,0.52684855
0.5221564,0.5290498
0.5254712,0.5284899
0.52711165,0.5266509
0.5287984,0.52757865
0.5294128,0.52834713
0.52882564,0.5321952
0.52934927,0.5327057
0.5297382,0.5320086
0.53244334,0.5304331
0.53301394,0.53161883
0.53275424,0.5335895
0.53180027,0.53237635
0.53237855,0.531037
0.53326535,0.53497285
0.5327177,0.5343196
0.53205246,0.535121
0.53430694,0.5368008
0.5344644,0.5369161
0.53553414,0.5376681
0.5367907,0.5351759
0.53706264,0.5341604
0.5376536,0.5353461
0.53635174,0.5341549
0.5357165,0.53530216
0.53620124,0.53697646
0.53537834,0.5387276
0.5359846,0.5357523
0.5369717,0.540303
0.5383534,0.54063785
0.5370062,0.5439754
0.5398714,0.5431575
0.5407786,0.54762036
0.54308265,0.5472361
0.54322755,0.5459351
0.5461656,0.5471757
0.5464402,0.55035955
0.54585564,0.54851514
0.5469597,0.54912996
0.5490397,0.5474941
0.54868144,0.5486633
0.54930496,0.54886645
0.54846156,0.54545754
0.5489175,0.5465609
0.54895437,0.546775
0.5468154,0.5429983
0.5472187,0.542389
0.54710954,0.5456387
0.54487294,0.5424933
0.543869,0.5453148
0.5455301,0.54416203
0.5435839,0.5389197
0.5450901,0.5385025
0.54469615,0.53655374
0.54170024,0.5386562
0.541117,0.53995717
0.5395649,0.5404073
0.5403168,0.5397486
0.5408981,0.53590053
0.5413003,0.54055005
0.5410643,0.5419114
0.5388873,0.54334414
0.5414978,0.5457924
0.5424847,0.54488117
0.5437901,0.5441785
0.54599077,0.5442279
0.54609805,0.54085743
0.54583055,0.54291594
0.54579234,0.5436625
0.5439699,0.5410057
0.5445978,0.54058295
0.5448416,0.5416589
0.5433039,0.5425372
0.54249406,0.5424054
0.5428295,0.54304224
0.54337674,0.5414009
0.54350907,0.53700936
0.54427266,0.534907
0.54335237,0.533326
0.54047847,0.53630126
0.5386089,0.5342318
0.53688645,0.5349344
0.5378271,0.5362134
0.53629446,0.53926
0.53634864,0.5368392
0.5369825,0.53541195
0.53891253,0.53096557
0.53788203,0.5285448
0.5371808,0.5265411
0.53450435,0.52985674
0.53243846,0.52612394
0.5306691,0.52834713
0.53196055,0.5279245
0.52953583,0.5256464
0.5300981,0.5184388
0.5297595,0.51631445
0.52808785,0.5115881
0.52337426,0.5145798
0.5209683,0.5127244
0.51715773,0.5109952
0.5176848,0.50827247
0.5163413,0.5111874
0.5147112,0.5112916
0.5124996,0.5135862
0.5134722,0.5177966
0.51337224,0.51366854
0.51444453,0.5155514
0.51749355,0.515491
0.51555306,0.51298237
0.5168946,0.51000166
0.51723045,0.5060438
0.51603174,0.50911784
0.5139309,0.50997967
0.51090354,0.51371247
0.5118404,0.51536477
0.51183766,0.51198334
0.5140785,0.5138168
0.51542234,0.5148433
0.51369965,0.51537025
0.5149539,0.5182961
0.51588655,0.5168524
0.51657873,0.51453584
0.51851976,0.5158423
0.5180935,0.5163254
0.5165599,0.517846
0.5173173,0.5219575
0.51756287,0.5223967
0.5184065,0.5200911
0.52101755,0.517813
0.5220855,0.51853764
0.521206,0.5221222
0.5200385,0.5225778
0.520316,0.5221551
0.52230424,0.5249712
0.522842,0.52085966
0.5228865,0.52078825
0.52489114,0.5199649
0.52279264,0.51888347
0.52256376,0.5195806
0.52176476,0.5249602
0.5208511,0.5248669
0.52088726,0.5236592
0.5240685,0.52400506
0.5244744,0.5261294
0.5240124,0.527381
0.52454334,0.5288851
0.52573556,0.52638197
0.5270831,0.52479005
0.5283366,0.5252127
0.5271231,0.5255805
0.5261341,0.52807266
0.5263519,0.52817696
0.52653587,0.526865
0.5282284,0.53037274
0.52851,0.53165174
0.5280502,0.5330406
0.53018934,0.53505516
0.5313395,0.5368886
0.53287745,0.5372674
0.5346204,0.53965527
0.53614515,0.54295987
0.53706235,0.5421365
0.53889126,0.5437833
0.54150766,0.54691774
0.54172593,0.548043
0.5433503,0.5473459
0.5456625,0.5488774
0.54709125,0.5503321
0.54724497,0.5497447
0.548635,0.55146295
0.5497838,0.5502607
0.54979146,0.54906404
0.5512628,0.54912996
0.5507656,0.5495526
0.5502852,0.5495032
0.550328,0.5495581
0.55068564,0.5476917
0.55072814,0.54729646
0.5510095,0.5448208
0.5500672,0.5464127
0.54959655,0.54405224
0.5478741,0.5436625
0.5481741,0.5451227
0.54653513,0.5440962
0.5457493,0.54282814
0.5463097,0.54098916
0.545405,0.54239994
0.5446751,0.5422682
0.5436875,0.54028106
0.5446843,0.5412527
0.544661,0.5380798
0.5436355,0.540808
0.54390365,0.5407916
0.5417365,0.54156005
0.54275894,0.54080254
0.54247177,0.5471263
0.54279554,0.5476039
0.5421787,0.5461986
0.54599816,0.5454246
0.5471404,0.54673105
0.54696006,0.54426634
0.54686445,0.5422463
0.5476046,0.5415107
0.5464439,0.5436625
0.5450315,0.5472032
0.5444602,0.54740626
0.5452443,0.5437394
0.5471866,0.54534227
0.5476236,0.5447
0.545889,0.54445845
0.54670453,0.5446835
0.5465045,0.54337704
0.5466212,0.54415107
0.5468418,0.54442555
0.5459095,0.5466103
0.5462317,0.5501729
0.5463244,0.54983807
0.5476219,0.5469671
0.5498353,0.54892135
0.5501456,0.5483065
0.5486993,0.5482352
0.5498374,0.5447659
0.5496524,0.54457927
0.5494726,0.5453642
0.5473782,0.5442828
0.5469468,0.54564965
0.5470105,0.5458912
0.5461075,0.542356
0.5467428,0.5432947
0.5468404,0.5444969
0.544656,0.5462096
0.5449107,0.5458528
0.54561776,0.54715925
0.54644567,0.54643464
0.54639405,0.5451666
0.54722756,0.54534227
0.54705405,0.546248
0.5462342,0.5451227
0.5461226,0.54569906
0.5463919,0.5453148
0.5457444,0.5471263
0.5460757,0.5466103
0.5457825,0.54416203
0.5470738,0.5407202
0.54721344,0.5395455
0.5460391,0.54123074
0.54399025,0.5398474
0.5427193,0.5378273
0.54316163,0.5358786
0.54196304,0.53269476
0.5406316,0.53180546
0.5390724,0.5318219
0.536898,0.53188777
0.5356664,0.53473127
0.5350731,0.53335345
0.5344315,0.5297634
0.5359364,0.5320305
0.5354554,0.5350881
0.53347707,0.53362244
0.5347432,0.5327386
0.5365939,0.5298677
0.5360203,0.53164625
0.5356783,0.52831423
0.5341052,0.5293846
0.53477633,0.5308503
0.5327374,0.5262502
0.53304553,0.5263161
0.53362054,0.52923095
0.5307631,0.5295932
0.5301428,0.5300598
0.5314813,0.5363671
0.5317763,0.5388648
0.5319279,0.53987485
0.5358603,0.5399407
0.53799915,0.54462314
0.5393755,0.5442883
0.5400813,0.54450786
0.543394,0.54457927
0.5441914,0.5442993
0.54507065,0.54339904
0.5454723,0.5428665
0.54562634,0.5450568
0.5451527,0.54168636
0.54467094,0.54375035
0.5460172,0.54627544
0.54405856,0.5464676
0.54511523,0.5467201
0.54670763,0.5464511
0.5470336,0.546012
0.5476115,0.5476917
0.54776776,0.5475764
0.54765743,0.54727453
0.54867107,0.54992586
0.54881334,0.55174285
0.54865694,0.5531317
0.5502271,0.5501345
0.55153394,0.5507438
0.5528693,0.5512928
0.55168635,0.55022234
0.55221254,0.5497447
0.5527451,0.5520777
0.55226827,0.5519844
0.55211174,0.55484986
0.5534007,0.5525937
0.5534,0.55241805
0.5550973,0.55191857
0.55424225,0.548839
0.5540567,0.54529285
0.55353695,0.54616016
0.5514667,0.5458418
0.5489974,0.54583085
0.5487881,0.5474996
0.5482286,0.5474721
0.54774714,0.547796
0.54853594,0.5452819
0.5488155,0.5466103
0.54922587,0.5477411
0.54799753,0.5476094
0.5488131,0.5474502
0.54962313,0.5475929
0.549586,0.5448757
0.5495656,0.5445737
0.54982585,0.5435472
0.5481817,0.5451776
0.54762274,0.545216
0.5467941,0.5456332
0.54743767,0.547829
0.5475861,0.54499096
0.5481008,0.54439807
0.5494807,0.5458363
0.548093,0.5421749
0.5477195,0.5455344
0.54834485,0.5418894
0.54624516,0.5464621
0.5478914,0.5422243
0.54566556,0.5404018
0.5480959,0.54008895
0.5455935,0.54341
0.54428375,0.5415436
0.5438151,0.54213095
0.5450761,0.53769004
0.5441309,0.53849155
0.5443993,0.53478616
0.5420612,0.540314
0.5419864,0.539809
0.53961515,0.5384037
0.5423152,0.542142
0.5423064,0.5434594
0.54118764,0.5456222
0.54371136,0.54637426
0.5446634,0.5471428
0.5464947,0.5473294
0.5473096,0.5459077
0.54824156,0.5467256
0.54851574,0.545216
0.5479193,0.5441126
0.5484147,0.545732
0.5476588,0.5456771
0.54669654,0.54545754
0.5473223,0.54643464
0.5474136,0.5476368
0.5472199,0.5487347
0.5477643,0.55009055
0.5485898,0.5500412
0.5493516,0.5490366
0.5505421,0.550914
0.55073565,0.55246747
0.55041015,0.5539112
0.5514948,0.55149585
0.55269927,0.5518362
0.55399495,0.55098534
0.5528837,0.549355
0.5531575,0.5492342
0.5527559,0.5492123
0.5519202,0.54924524
0.55161965,0.54921776
0.55136424,0.5485535
0.55133694,0.5496404
0.5514414,0.5478564
0.55133355,0.54848766
0.5518939,0.5482571
0.5507487,0.55103475
0.55087125,0.5516221
0.5505841,0.5550475
0.5522472,0.5533019
0.55297136,0.5545425
0.55512464,0.5530878
0.5547248,0.55084264
0.5557677,0.5509359
0.5552047,0.5500247
0.5540041,0.5495856
0.55399275,0.5485206
0.5532688,0.5439754
0.55277187,0.54434866
0.55181587,0.5453368
0.5487711,0.5446561
0.5481993,0.54580337
0.5482945,0.5456277
0.5477713,0.5459516
0.54857695,0.546259
0.54850256,0.54792774
0.5488142,0.5477466
0.54900587,0.54783446
0.5502851,0.54856455
0.55026484,0.5490202
0.5505184,0.5482297
0.551054,0.54861945
0.5512358,0.5502827
0.5509428,0.5506505
0.5512674,0.5503925
0.5524141,0.5510787
0.552971,0.55312073
0.55314,0.55460286
0.5537583,0.5572597
0.5551292,0.5568919
0.5562966,0.55715543
0.55814373,0.55982876
0.5583527,0.5600428
0.558635,0.5599495
0.56049967,0.5597409
0.56107324,0.5596641
0.5614077,0.55935663
0.561616,0.55862105
0.5617341,0.5594719
0.56167114,0.5579898
0.5612317,0.55861557
0.56152886,0.5594939
0.56059235,0.56002086
0.5606203,0.5570511
0.56103563,0.5553549
0.5614515,0.5523577
0.5597813,0.5535873
0.5586347,0.5536202
0.55647635,0.5543174
0.55661803,0.55495965
0.55639535,0.5535653
0.5565091,0.5549322
0.55684626,0.5541637
0.55603456,0.5506944
0.5568111,0.5501565
0.5562737,0.55092496
0.5541298,0.5530493
0.5534531,0.5531866
0.55353546,0.55314815
0.5547289,0.5492836
0.5550288,0.5447055
0.55518925,0.54446393
0.5528725,0.5459955
0.5497488,0.5440358
0.5489658,0.54212
0.549179,0.54326177
0.5477067,0.54467803
0.54623187,0.5464072
0.54643404,0.5454795
0.54706645,0.5482242
0.5481262,0.54838884
0.5478222,0.5489323
0.54948044,0.5456607
0.5499048,0.53879344
0.5507489,0.535906
0.54917634,0.53348523
0.5448498,0.5353187
0.5421919,0.53670746
0.53953326,0.5359884
0.5395905,0.5358511
0.5399402,0.5421035
0.53942144,0.54131854
0.5392492,0.54142284
0.54293627,0.5402975
0.543121,0.5443542
0.54366606,0.5455015
0.5434135,0.5453313
0.5459341,0.5430806
0.5472271,0.5434649
0.54741305,0.54017675
0.546359,0.5403634
0.5462197,0.54219687
0.544088,0.54199374
0.5435493,0.53867817
0.5442369,0.53895265
0.5441135,0.539002
0.542371,0.54076964
0.5422559,0.54047316
0.54209924,0.5437943
0.54286253,0.5453642
0.5427627,0.5442389
0.54479855,0.54344845
0.5461555,0.5455509
0.5457192,0.54353076
0.5453808,0.5391667
0.54656166,0.5342867
0.54532236,0.5357249
0.5423709,0.53532416
0.5387234,0.53491247
0.53865784,0.5339353
0.5379806,0.5319262
0.537432,0.53605425
0.5365861,0.534122
0.5351056,0.5358786
0.53750426,0.5370533
0.5365033,0.53877145
0.53784955,0.5366142
0.53911567,0.5391722
0.54053265,0.53988034
0.5397407,0.5351046
0.54125494,0.53711915
0.5419519,0.53852445
0.53880537,0.53862876
0.53961045,0.54141736
0.5405277,0.54344296
0.54060894,0.54361314
0.5423857,0.5415491
0.5441722,0.5382994
0.54484576,0.54110444
0.5440023,0.54198825
0.5426297,0.54448044
0.54421365,0.54437065
0.54491115,0.5449196
0.5467455,0.5436021
0.5469375,0.54347587
0.5473903,0.54478234
0.5466274,0.54504585
0.5465047,0.5473953
0.5470613,0.5447165
0.54733694,0.54401934
0.54888463,0.54326177
0.5475824,0.54076964
0.5471986,0.54412365
0.54660195,0.545227
0.5449567,0.54390955
0.54640144,0.5475545
0.5473706,0.5450568
0.5469375,0.5471538
0.54918754,0.5481528
0.5479817,0.5463413
0.5491999,0.54599
0.5500572,0.54489213
0.5493677,0.5466323
0.54916,0.5471538
0.54835296,0.54730195
0.54932743,0.54726356
0.5498517,0.5481803
0.5504104,0.546012
0.55034304,0.5421694
0.55094606,0.5405775
0.54968625,0.5410002
0.54742795,0.5430587
0.54623955,0.54359114
0.54583883,0.5445737
0.5466235,0.5459571
0.54687744,0.5460339
0.5474555,0.54553986
0.54830426,0.5430587
0.5487424,0.5415491
0.5487864,0.5410057
0.5475442,0.542142
0.5465012,0.54483175
0.5457143,0.54489213
0.54608977,0.5460065
0.5475212,0.54737335
0.54771477,0.5452215
0.5486776,0.54508424
0.54977244,0.5434649
0.5490259,0.5422243
0.54897743,0.54337704
0.5478083,0.5431355
0.54667777,0.54366803
0.54701865,0.54383266
0.54697835,0.5451227
0.54736793,0.54737884
0.5474005,0.54685736
0.5483113,0.5472251
0.54974943,0.54835045
0.5499312,0.5479881
0.5504277,0.54900366
0.5513442,0.5440907
0.5513465,0.5417577
0.55213916,0.54250425
0.54943264,0.54174674
0.54752535,0.5437284
0.54738474,0.54212546
0.5463958,0.540325
0.54731286,0.53941375
0.5462647,0.5403799
0.54509217,0.53992975
0.5444252,0.53919965
0.5448761,0.53809077
0.54463917,0.53811824
0.5439633,0.5370423
0.54290503,0.53966075
0.5424594,0.5386617
0.54143745,0.5381347
0.5427274,0.53828293
0.54214895,0.53491247
0.54182255,0.53205246
0.5421125,0.5308723
0.54016554,0.53310645
0.5380409,0.5337926
0.536552,0.53124005
0.53714275,0.53248614
0.5370962,0.5345611
0.5355588,0.53416586
0.53610456,0.5340067
0.5373418,0.53280455
0.5374638,0.5308448
0.5377455,0.5291925
0.5372318,0.5294615
0.5360527,0.5313663
0.53470165,0.53143215
0.5344298,0.5317121
0.5350169,0.5312181
0.5348135,0.5319317
0.5348996,0.53305155
0.5347076,0.53210735
0.5351623,0.5341
0.5358346,0.534111
0.53534764,0.53210735
0.53678596,0.5288137
0.5372002,0.5300873
0.5362655,0.53196466
0.53428596,0.53432506
0.5344586,0.53496736
0.5355162,0.53667456
0.5369981,0.53635615
0.53769946,0.53563154
0.53891367,0.5368392
0.53909636,0.5375803
0.53887826,0.53911734
0.53978914,0.53833234
0.5403593,0.53963333
0.54144263,0.54006696
0.5412388,0.54017675
0.5421365,0.5370588
0.5426271,0.5373223
0.5428003,0.5357194
0.5410043,0.5360817
0.54085505,0.53104794
0.5397286,0.52974695
0.5393872,0.52636546
0.53607684,0.5246748
0.53435034,0.5249218
0.53169787,0.51899874
0.52978116,0.5145743
0.5294612,0.50789374
0.52543503,0.51526594
0.5220361,0.51541966
0.5164479,0.5188725
0.5193364,0.5223473
0.5190211,0.51889443
0.520619,0.5275128
0.5229221,0.5309107
0.52119124,0.54204315
0.52646667,0.5414009
0.52852184,0.54014933
0.53671837,0.53904593
0.53894055,0.53541744
0.5398507,0.52907175
0.54092234,0.52199596
0.5392617,0.52590984
0.5356115,0.52750725
0.5305128,0.5298951
0.5311893,0.5344184
0.5307964,0.5363452
0.5316207,0.5372125
0.5345395,0.532036
0.53633076,0.5332546
0.5380909,0.5302465
0.53606445,0.53025746
0.53707117,0.5305703
0.5356465,0.526887
0.53519994,0.5293791
0.5349851,0.532552
0.532235,0.53075147
0.53291667,0.53124005
0.53425986,0.5320415
0.5336184,0.5332876
0.5340109,0.5356645
0.5346686,0.53408355
0.5358756,0.535401
0.5378379,0.5351759
0.5375885,0.53434706
0.53849244,0.52947795
0.5385821,0.5277268
0.53827304,0.5295932
0.5353938,0.5335566
0.5334666,0.53506064
0.53358024,0.5340396
0.5353857,0.5329253
0.53640723,0.5339902
0.53627783,0.53207994
0.5359598,0.53350717
0.5365739,0.53407806
0.5354997,0.53343034
0.53615516,0.5329308
0.53634787,0.53300214
0.53570396,0.5294121
0.5356899,0.5326563
0.5360422,0.53319424
0.534257,0.53326565
0.53621507,0.52999943
0.53678125,0.5313279
0.5369762,0.52909917
0.5352596,0.52782565
0.53526473,0.5274085
0.53381467,0.52814406
0.5325896,0.52756214
0.53241944,0.5244332
0.5327316,0.52823734
0.5324179,0.525586
0.5303864,0.5218477
0.532459,0.51800513
0.53085804,0.5181918
0.5283696,0.5228084
0.5253861,0.520931
0.52425796,0.5221332
0.5262668,0.5206565
0.5253438,0.5221826
0.52607065,0.522737
0.52503645,0.5201241
0.5257174,0.518576
0.5261156,0.5202668
0.5249443,0.5205632
0.5241274,0.5203656
0.5249516,0.52205086
0.5253691,0.51992095
0.52520084,0.51909757
0.52623993,0.5188121
0.5248611,0.5184169
0.5239863,0.5171214
0.5232954,0.5172806
0.52267146,0.51501346
0.5215287,0.516007
0.52129334,0.5165889
0.5198266,0.51680297
0.5201399,0.5159137
0.52032965,0.5183455
0.5204054,0.5189603
0.5202133,0.5152165
0.5217964,0.5153318
0.52241945,0.5121645
0.52020204,0.5102377
0.5200468,0.50794315
0.5175717,0.5053192
0.51576436,0.504924
0.51366764,0.50383157
0.51154196,0.5008893
0.5105817,0.49889114
0.5094096,0.5010759
0.50747454,0.5037273
0.50555986,0.5012735
0.5063273,0.49862766
0.5075929,0.4993248
0.5062278,0.50085634
0.5045635,0.50255257
0.50435466,0.5032058
0.5047522,0.5005599
0.5055389,0.49931383
0.5060475,0.49898994
0.5046002,0.4976176
0.5037759,0.4960147
0.5034462,0.50212985
0.50246084,0.49817753
0.501204,0.5003458
0.5041465,0.50048304
0.5020144,0.49821046
0.50288725,0.4984959
0.5030208,0.49888566
0.501769,0.4962892
0.50194675,0.49600375
0.50239515,0.49909973
0.5012591,0.49981886
0.50074565,0.49912718
0.5025356,0.501268
0.50289243,0.5027118
0.5025147,0.5036889
0.50362855,0.500785
0.50443786,0.4997969
0.5050612,0.49885273
0.5036902,0.49849042
0.502992,0.49840808
0.5022834,0.49915463
0.5018823,0.49852884
0.50184876,0.50038975
0.502185,0.5019487
0.5017662,0.50483066
0.50269395,0.50704837
0.50371164,0.5086403
0.50561255,0.5097217
0.5075474,0.50721306
0.50903904,0.5043805
0.51033074,0.5054235
0.50942796,0.504139
0.5078931,0.5051655
0.5083503,0.5022232
0.5074265,0.5036614
0.5076385,0.50339246
0.50574267,0.5032552
0.50597537,0.50017565
0.50557697,0.49883625
0.5055984,0.5020146
0.5039078,0.50141627
0.50277966,0.50168526
0.5043093,0.50204206
0.5039767,0.49936873
0.5040048,0.4978317
0.5040661,0.4969479
0.5025505,0.49785915
0.5013322,0.4964264
0.50087005,0.49826536
0.50120825,0.49895152
0.50026035,0.49974748
0.50114155,0.5024922
0.50165206,0.50338143
0.5022052,0.5043256
0.5039198,0.50064224
0.5049129,0.5001098
0.505851,0.4961849
0.50423735,0.49358842
0.503954,0.5007905
0.5014048,0.50231653
0.4992696,0.50318384
0.5030634,0.5020201
0.50426114,0.5009826
0.5051329,0.50079596
0.50479347,0.5002141
0.5042387,0.5000274
0.50395185,0.4996871
0.5034573,0.50020313
0.5033542,0.5007026
0.502743,0.5001043
0.50296324,0.49808422
0.50334895,0.49751332
0.5032154,0.49613547
0.5020966,0.49858922
0.501491,0.49367076
0.500443,0.49094254
0.50153947,0.48894438
0.49852648,0.48963606
0.4962357,0.4885766
0.49438128,0.48790142
0.49407512,0.4881704
0.49282104,0.48634243
0.4918881,0.4883241
0.49166822,0.4864577
0.49016976,0.48617774
0.4911452,0.48576054
0.49016932,0.48539826
0.4901262,0.48483834
0.48975015,0.4860515
0.4893966,0.48818138
0.48872867,0.4873909
0.48906773,0.48929024
0.4901925,0.4879069
0.48983207,0.48494264
0.4911537,0.48378986
0.4904127,0.48606795
0.4887125,0.48365262
0.48792034,0.48209366
0.48916453,0.48200032
0.48778054,0.4855245
0.48654976,0.4858868
0.48602435,0.48862052
0.48760283,0.4864577
0.48783684,0.48705056
0.48961487,0.48748422
0.48867396,0.48920238
0.48903242,0.48859307
0.48953542,0.48746225
0.49064857,0.4881265
0.49065438,0.48581544
0.49011278,0.48595816
0.49064228,0.4874897
0.48927718,0.4866663
0.48927894,0.48781908
0.4899122,0.48776966
0.48942083,0.48885655
0.49008325,0.49228743
0.4901762,0.49246857
0.49089184,0.4933908
0.49306303,0.4962892
0.49378142,0.49342373
0.49490008,0.4933359
0.49707162,0.4897623
0.4959148,0.48859856
0.49582115,0.4885327
0.49359792,0.48938903
0.49240014,0.48835155
0.49166209,0.48972937
0.49178907,0.49333042
0.49098063,0.49166164
0.4914064,0.49202394
0.4936484,0.49178788
0.49304095,0.49670088
0.49364093,0.49755722
0.49375623,0.49662954
0.49699396,0.49809518
0.49803308,0.50214636
0.49802828,0.5021628
0.49906328,0.50488555
0.5015674,0.50967777
0.502085,0.510084
0.50403476,0.51345444
0.5076488,0.5091563
0.5088124,0.5102596
0.5118696,0.5068288
0.51030344,0.51077014
0.5112163,0.5089861
0.50929505,0.50756437
0.5112839,0.5062579
0.5105503,0.50895864
0.5096007,0.50998515
0.5085845,0.5064665
0.50973994,0.5125103
0.51049215,0.5133557
0.50842404,0.51567215
0.5121468,0.5154361
0.51289237,0.51537573
0.5150678,0.5170116
0.51577294,0.51785696
0.51628256,0.51682496
0.5175,0.5171927
0.5185056,0.51392657
0.51834995,0.5109074
0.518508,0.5104847
0.5166952,0.5070209
0.5144126,0.50732285
0.51363707,0.5061481
0.51100224,0.5053137
0.51053804,0.50621396
0.50928354,0.5063567
0.50820315,0.5051161
0.50836116,0.5018719
0.5083718,0.5027392
0.507522,0.5032772
0.5054015,0.50323874
0.5055186,0.5016962
0.5054156,0.5013065
0.5052731,0.50142175
0.50426865,0.49940166
0.503916,0.49858373
0.5038192,0.5012461
0.5025175,0.49973652
0.5016708,0.5013778
0.5028542,0.5009442
0.50186366,0.49800187
0.50282127,0.4947357
0.5029161,0.49460945
0.5011471,0.4959653
0.49909467,0.49895152
0.49863297,0.49718395
0.49916697,0.49475217
0.5007355,0.4958006
0.4997126,0.49279246
0.49809,0.49599823
0.49846095,0.49251798
0.49629748,0.4929736
0.4977299,0.4923094
0.49557486,0.49120054
0.49549487,0.49288577
0.49478304,0.4922435
0.493927,0.49391776
0.4949028,0.49331942
0.49456793,0.4925015
0.49580872,0.4928089
0.49550697,0.49593785
0.49510834,0.49340177
0.49515063,0.49274305
0.4969808,0.49221605
0.49566752,0.49149695
0.49508765,0.49097
0.49457067,0.4930834
0.49381873,0.49372014
0.49325642,0.4928089
0.49427304,0.49872646
0.49480006,0.5036559
0.49424133,0.5062524
0.49791867,0.5036834
0.5013038,0.5035187
0.5037428,0.50410604
0.50321966,0.5037163
0.5036586,0.50378215
0.504322,0.5044958
0.5042757,0.50540155
0.504318,0.5077126
0.50464195,0.50800353
0.50521153,0.5053192
0.5066456,0.50591207
0.50737,0.5071197
0.50609,0.5079706
0.50660896,0.5022836
0.5073415,0.50204754
0.50812304,0.5022836
0.50485766,0.5041335
0.5041629,0.5019981
0.5039163,0.50378215
0.50478065,0.50467145
0.50380856,0.5032607
0.5047767,0.50571996
0.5054044,0.5037053
0.504442,0.5043092
0.5061191,0.5043421
0.5052236,0.50280505
0.5058031,0.5018719
0.50599146,0.4994895
0.505367,0.4973596
0.50471336,0.4976176
0.5028793,0.49696985
0.5011207,0.49598727
0.50058466,0.49765053
0.49991396,0.49766153
0.49902168,0.50193775
0.4999055,0.50456715
0.50010264,0.50599986
0.50285006,0.50605476
0.50494945,0.506708
0.5064283,0.50245374
0.50716364,0.50065875
0.5077978,0.50144917
0.50553584,0.50328267
0.5041128,0.5040292
0.50410175,0.50338143
0.5048009,0.5007905
0.50530845,0.50049955
0.50505656,0.5015151
0.5037758,0.50363946
0.50357556,0.5001537
0.5042153,0.5030137
0.505475,0.5022232
0.5037856,0.5019597
0.5052465,0.5018389
0.5047326,0.50142175
0.50444585,0.50210243
0.5043677,0.5046934
0.50409836,0.5054784
0.50442857,0.50317836
0.5059847,0.5038261
0.5069442,0.50565404
0.5056465,0.50502825
0.5060335,0.5047977
0.5071917,0.5091233
0.5069646,0.5117034
0.50685394,0.5089312
0.50945026,0.5069221
0.51139456,0.5076028
0.5102755,0.5063018
0.50930035,0.50762475
0.5096856,0.5081188
0.5089665,0.5100236
0.50969803,0.5124883
0.51020676,0.511374
0.5113057,0.5108141
0.5126549,0.50748754
0.5122167,0.50933194
0.5118723,0.5089861
0.50970405,0.50911784
0.51045346,0.50932646
0.5102471,0.5091837
0.51062846,0.51070976
0.5109877,0.5070978
0.51105195,0.50657076
0.5123036,0.5066147
0.5102169,0.5070374
0.509702,0.50659823
0.5094,0.5043092
0.50933707,0.50401825
0.50901395,0.5027831
0.50747645,0.50491846
0.50693303,0.5048691
0.50579166,0.50394136
0.506861,0.50044465
0.506957,0.50285447
0.5064763,0.49885273
0.5044633,0.50163037
0.50566584,0.5004117
0.5031777,0.5009222
0.5042132,0.5010265
0.50334966,0.5008838
0.5031344,0.50018114
0.5030694,0.50391394
0.5030644,0.5053796
0.5027848,0.50565404
0.504891,0.5078059
0.5063228,0.51035297
0.5068864,0.5093759
0.50885123,0.5077126
0.5109496,0.50895864
0.5111108,0.51125324
0.5103898,0.5121315
0.5110942,0.5125597
0.5122489,0.51361364
0.51296437,0.50681233
0.5135035,0.5064116
0.5143934,0.5040347
0.5104891,0.50440794
0.5098602,0.5051271
0.5080787,0.5034748
0.5075973,0.50748754
0.5077457,0.50765216
0.5065436,0.504655
0.50874203,0.50670254
0.5091494,0.5053576
0.5077383,0.50632924
0.5087896,0.5067629
0.5081653,0.50735027
0.50864214,0.5044135
0.50881934,0.5070319
0.5093706,0.5045507
0.50760585,0.5065049
0.5088815,0.5046056
0.507406,0.5035736
0.50833976,0.50353515
0.50743496,0.5034912
0.50655776,0.5035461
0.5063888,0.5018938
0.5060955,0.5012735
0.5061063,0.50031286
0.5048127,0.5043256
0.5042794,0.50272274
0.5032606,0.5029258
0.5054628,0.5055004
0.50462735,0.5043311
0.5048585,0.50884336
0.50655675,0.50665313
0.50591874,0.5017566
0.50864244,0.49997804
0.5078815,0.50163037
0.5051683,0.50120765
0.5037305,0.5034089
0.50427157,0.5027063
0.50376236,0.5032552
0.50486904,0.5003184
0.5046131,0.50074655
0.50509447,0.50391394
0.50371593,0.5067465
0.50374883,0.51068234
0.50577515,0.5108031
0.50771487,0.5088269
0.5106632,0.5057419
0.51146007,0.50416094
0.5110317,0.5046001
0.50920105,0.507987
0.50803596,0.5070264
0.5080024,0.50725144
0.50980866,0.50730085
0.5093889,0.50776196
0.5093803,0.50854695
0.5094192,0.5072295
0.5098325,0.50716364
0.5104641,0.5062634
0.50977886,0.504924
0.50976384,0.5057144
0.5090646,0.50256354
0.5082471,0.50550586
0.50837743,0.5036504
0.5062676,0.507987
0.5076113,0.5080474
0.50626904,0.50312346
0.5087127,0.50399625
0.5092876,0.50497335
0.50646615,0.5033321
0.5066597,0.50315636
0.50709236,0.5078992
0.5061035,0.5093539
0.50562185,0.5082835
0.5082497,0.5095021
0.5095289,0.51273537
0.5094315,0.51484877
0.51049966,0.5167591
0.51292986,0.51620466
0.5146992,0.5142998
0.5164115,0.5114289
0.51695037,0.5122523
0.5162576,0.5117253
0.5146489,0.5104243
0.5149942,0.5103969
0.51425034,0.5102651
0.5130682,0.512406
0.5124867,0.5109733
0.5120624,0.50673544
0.5130889,0.50638413
0.51244545,0.5086293
0.5099807,0.5084701
0.50947464,0.51019377
0.5105404,0.51220286
0.51030964,0.51190096
0.5111704,0.5126201
0.5126425,0.5107811
0.5128897,0.51201075
0.513543,0.5121809
0.5125422,0.51702803
0.51315403,0.5176868
0.5133598,0.5175989
0.51640534,0.52219355
0.51765716,0.5205632
0.5181641,0.5230499
0.5212466,0.525328
0.5208575,0.52600867
0.522672,0.5283032
0.5244813,0.5318768
0.5251566,0.5334687
0.526626,0.53435254
0.5291948,0.5367184
0.5310311,0.5366855
0.5325792,0.53361696
0.534762,0.5403634
0.53565925,0.54291046
0.53442,0.5454795
0.5384113,0.546517
0.54049474,0.5456771
0.54274935,0.55046386
0.54396033,0.54948676
0.5440579,0.54919034
0.54726964,0.5449635
0.5474474,0.5416479
0.5481719,0.5325465
0.54614127,0.53497833
0.5440331,0.52991164
0.5379934,0.5263161
0.53803176,0.52711207
0.53390247,0.5263545
0.5305298,0.52533346
0.5299313,0.52503705
0.5286332,0.5262941
0.5276698,0.5277104
0.5269721,0.52520174
0.52755123,0.527897
0.5280913,0.53251356
0.5271664,0.5334413
0.5286556,0.53696
0.5316995,0.5376242
0.5326883,0.5424878
0.5352184,0.5469616
0.53616494,0.5497502
0.5394281,0.5452599
0.54283375,0.53015316
0.5452454,0.53226656
0.5439766,0.53023
0.5353671,0.52983475
0.53531444,0.5273481
0.53292334,0.52622825
0.53178746,0.52535546
0.5295547,0.5246473
0.52797234,0.5251688
0.5267302,0.52384037
0.5254754,0.5237196
0.52560097,0.5265686
0.52437454,0.52747434
0.5244036,0.5311193
0.525893,0.5327716
0.52687067,0.5335511
0.5293126,0.53616405
0.531036,0.5391063
0.53227115,0.5389416
0.53460455,0.53661966
0.53724223,0.53945214
0.53792983,0.53579074
0.53713524,0.53641653
0.53907126,0.53113574
0.53717184,0.5330241
0.53764474,0.5305374
0.53414625,0.5277543
0.5346436,0.52896196
0.5326599,0.5282209
0.53020716,0.5264533
0.5299595,0.5237855
0.52873546,0.5222045
0.52726114,0.5208322
0.52524596,0.52544874
0.52369344,0.52706814
0.522216,0.52390075
0.52436244,0.527919
0.5255207,0.5238239
0.5240175,0.52322555
0.5263254,0.5173904
0.52416444,0.51661086
0.523671,0.5166877
0.5202615,0.51872426
0.5188777,0.5210463
0.5181106,0.5224186
0.51881766,0.5243509
0.52029747,0.5263984
0.5213958,0.5289784
0.52278566,0.5287918
0.52430946,0.5303288
0.5266979,0.5285283
0.52738667,0.53023547
0.52873623,0.5313224
0.5281472,0.53427017
0.5291431,0.5359335
0.52957195,0.53873307
0.5315044,0.5383488
0.5329801,0.5374485
0.53531986,0.53909534
0.535905,0.5359719
0.5359023,0.532552
0.53712714,0.5270242
0.5354764,0.5231981
0.5333453,0.5275347
0.5296572,0.5278696
0.52617943,0.52766645
0.52735126,0.52939564
0.5273317,0.52928036
0.5269064,0.52912664
0.52797526,0.53026843
0.52808917,0.53635067
0.52835286,0.53898555
0.529311,0.54519403
0.5335156,0.54394245
0.5353477,0.53530216
0.53951716,0.5352912
0.5398676,0.54188395
0.5351702,0.54400283
0.5350942,0.5372729
0.53870916,0.53979796
0.540797,0.5435527
0.53746,0.5459626
0.53878856,0.54830104
0.5409186,0.54721415
0.5426996,0.547527
0.5449073,0.54846025
0.544518,0.55197895
0.5451268,0.54640174
0.5461534,0.5453752
0.5485261,0.5505956
0.54580754,0.55055165
0.5450726,0.5477521
0.54787654,0.5492342
0.54813206,0.5459296
0.5472408,0.54096174
0.54770416,0.5437613
0.5458543,0.5467091
0.5427758,0.54943734
0.5439856,0.54849315
0.54533225,0.5502662
0.5468332,0.5560136
0.5467698,0.5455728
0.5482941,0.5422188
0.55206084,0.5409178
0.5468191,0.53995717
0.5446403,0.5287369
0.5431992,0.5167865
0.54159606,0.5177087
0.53445786,0.5175166
0.52550614,0.51820827
0.5233017,0.52205634
0.521117,0.5240435
0.5204904,0.52573967
0.5222904,0.52213866
0.5237086,0.5172202
0.5248576,0.5173849
0.5233817,0.5194983
0.52088284,0.52089804
0.52080244,0.523017
0.52159077,0.5188286
0.52240765,0.5140309
0.5236107,0.5142175
0.5212201,0.5169786
0.517923,0.5166822
0.5168309,0.51634735
0.51782346,0.5140802
0.51753813,0.51294947
0.51716715,0.5137838
0.51613754,0.5093155
0.51544946,0.5074491
0.5155963,0.5092002
0.51277876,0.5126475
0.5109971,0.5096723
0.5109744,0.5081298
0.512553,0.5085744
0.51056564,0.5110611
0.5097196,0.51238954
0.5094223,0.5108031
0.5107315,0.50981504
0.51165277,0.5095625
0.51120245,0.5066916
0.5109717,0.5076577
