Place,Name,Sex,BirthDate,Age,Country,Equipment,Division,BodyweightKg,WeightClassKg,Squat1Kg,Squat2Kg,Squat3Kg,Squat4Kg,Best3SquatKg,Bench1Kg,Bench2Kg,Bench3Kg,Bench4Kg,Best3BenchKg,Deadlift1Kg,Deadlift2Kg,Deadlift3Kg,Deadlift4Kg,Best3DeadliftKg,TotalKg,Event
1,Anni Husu,F,1979-05-21,43,Finland,Raw,F_MR_1_WPC,86.6,90,125,140,150,,150,75,80,-85,,80,165,180,-190,,180,410,SBD
1,Amra Halilovic,F,1992-12-25,30,Finland,Raw,F_OR_WPC,82.2,82.5,140,-150,152.5,,152.5,80,87.5,-92.5,,87.5,160,172.5,180,,180,420,SBD
1,Mirva Halen,F,1990-06-29,32,Finland,Raw,F_OR_WPC,84.6,90,120,127.5,-135,,127.5,57.5,-62.5,62.5,,62.5,115,120,125,,125,315,SBD
1,Vivian Ihamäki,F,2007-07-27,15,Finland,Raw,F_TR_1_WPC,46.5,48,63,67.5,70,,70,35.5,40,-42.5,,40,86,90,-92.5,,90,200,SBD
1,Sara Honkakangas,F,2009-03-12,14,Finland,Raw,F_TR_1_WPC,57.9,60,70,75,80,-85.5,80,40,45.5,47.5,-50,47.5,80,90,95,105,95,222.5,SBD
1,Oona Kuusisto,F,2009-08-25,13,Finland,Raw,F_TR_1_WPC,62.9,67.5,60,65,-70,,65,40,-45,-45,,40,80,92.5,100,,100,205,SBD
1,Tiina Puolakka,F,1968-02-19,55,Finland,Wraps,F_MCR_4_WPC,66.9,67.5,90,95,100,,100,47.5,50,52.5,-55,52.5,110,120,127.5,,127.5,280,SBD
1,Eija Pesonen,F,1991-12-03,31,Finland,Raw,F_OCR_WPC,66.7,67.5,90,100,110,,110,52.5,-57.5,,,52.5,145,152.5,157.5,,157.5,320,SBD
1,Emma Lahti,F,1997-10-21,25,Finland,Wraps,F_OCR_WPC,71.8,75,180,190.5,-200,,190.5,-115,-121,121,,121,182.5,197.5,207.5,220.5,207.5,519,SBD
1,Vilhelmiina Sillanpää,F,1995-09-16,27,Finland,Single-ply,F_OES_WPC,65.6,67.5,155,175,195,,195,75,85,95,100,95,140,157.5,165,170,165,455,SBD
1,Anna Nyyssönen,F,1989-01-21,34,Finland,Raw,F_OR_WPC,73.7,75,,,,,,72.5,77.5,80,,80,,,,,,80,B
1,Emma Ylitalo-James,F,1969-11-24,53,UK,Unlimited,F_MEM_3_WPC,88.9,90,,,,,,-270,275,-282.5,,275,,,,,,275,B
1,Emma Ylitalo-James,F,1969-11-24,53,UK,Unlimited,F_OEM_WPC,88.9,90,,,,,,-270,275,-282.5,,275,,,,,,275,B
1,Jimi Kujanpää,M,1999-06-07,23,Finland,Raw,M_JR_WPC,73.3,75,155,160,165,,165,107.5,112.5,120.5,,120.5,185,195,205,,205,490.5,SBD
1,Aaro Mäki-Jouppila,M,1999-05-01,23,Finland,Raw,M_JR_WPC,107.8,110,180,190,-200,,190,130,135,-140,,135,200,220,-230,,220,545,SBD
1,Miika Kajavalta,M,1979-03-30,44,Finland,Raw,M_MR_1_WPC,91.4,100,145,150,-160,,150,130,135,-140,,135,180,190,-195,,190,475,SBD
1,Harri Korhonen,M,1979-01-04,44,Finland,Raw,M_MR_1_WPC,104.7,110,185,195,205,,205,-145,145,-160,,145,230,-255,-255,,230,580,SBD
1,Ville Suominen,M,1982-07-01,40,Finland,Raw,M_MR_1_WPC,117.5,125,265,275,-285,,275,170,-182.5,-182.5,,170,305,330,,,330,775,SBD
1,Antti Tietäväinen,M,1977-11-10,45,Finland,Raw,M_MR_2_WPC,88.9,90,185,195,200,,200,155,-160,,,155,220,-230,,,220,575,SBD
2,Markus Auvinen,M,1975-08-18,47,Finland,Raw,M_MR_2_WPC,86.5,90,-180,-180,180,,180,125,-135,-135,,125,225,-235,235,,235,540,SBD
1,Juha-Pekka Kinnunen,M,1973-08-17,49,Finland,Raw,M_MR_2_WPC,108.4,110,-215,-215,215,,215,132.5,137.5,142.5,,142.5,215,225,232.5,,232.5,590,SBD
1,Klaus Renfors,M,1973-01-16,50,Finland,Raw,M_MR_3_WPC,89.9,90,167.5,-180.5,180.5,,180.5,155,165,-170.5,,165,195,212.5,220,,220,565.5,SBD
2,Valeri Astaptsev,M,1973-02-02,50,Finland,Raw,M_MR_3_WPC,89.9,90,150,160,167.5,,167.5,102.5,-107.5,-107.5,,102.5,190,200,210,,210,480,SBD
1,Vesa Nissilä,M,1963-01-01,60,Finland,Raw,M_MR_5_WPC,110.8,125,170,190.5,-200,,190.5,110,120,-130,,120,180,205,210,,210,520.5,SBD
1,Jussi Jaakkola,M,1988-09-08,34,Finland,Raw,M_OR_WPC,82.2,82.5,190,205,-220,,205,155,-162.5,-162.5,,155,255,265,-277.5,,265,625,SBD
1,Antti Tietäväinen,M,1977-11-10,45,Finland,Raw,M_OR_WPC,88.9,90,185,195,200,,200,155,-160,,,155,220,-230,,,220,575,SBD
2,Klaus Renfors,M,1973-01-16,50,Finland,Raw,M_OR_WPC,89.9,90,167.5,-180.5,180.5,,180.5,155,165,-170.5,,165,195,212.5,220,,220,565.5,SBD
1,Oskari Simonen,M,1998-06-13,24,Finland,Raw,M_OR_WPC,98.1,100,-230,240,255,,255,140,-150,150,,150,300,320,330,,330,735,SBD
2,Jere Kettula,M,1996-05-08,26,Finland,Raw,M_OR_WPC,97.6,100,170,177.5,185,,185,145,-150,150,,150,210,225,240,,240,575,SBD
1,Juha-Pekka Kinnunen,M,1973-08-17,49,Finland,Raw,M_OR_WPC,108.4,110,-215,-215,215,,215,132.5,137.5,142.5,,142.5,215,225,232.5,,232.5,590,SBD
1,Tatu Kuusinen,M,1987-05-24,35,Finland,Raw,M_OR_WPC,112.3,125,285,302.5,,,302.5,180,190,-200,,190,290,300,-310,,300,792.5,SBD
2,Ville Suominen,M,1982-07-01,40,Finland,Raw,M_OR_WPC,117.5,125,265,275,-285,,275,170,-182.5,-182.5,,170,305,330,,,330,775,SBD
1,Kari Toivonen,M,1990-12-29,32,Finland,Raw,M_OR_WPC,130.6,140,-250,275,300,,300,180,-190,,,180,-300,300,320,,320,800,SBD
2,Tero Soini,M,1985-12-28,37,Finland,Raw,M_OR_WPC,126.9,140,190,210,215,,215,130,140,147.5,,147.5,200,220,240,,240,602.5,SBD
1,Valto Astaptsev,M,2010-07-19,12,Finland,Raw,M_TR_1_WPC,53.9,56,47.5,55,60,,60,25,27.5,30,,30,75,80,-82.5,,80,170,SBD
1,Noel Henriksson,M,2007-01-01,16,Finland,Raw,M_TR_2_WPC,109.2,110,165,175,185,,185,-100,100,110.5,,110.5,190,-210,-210,,190,485.5,SBD
1,Markus Kovanen,M,2002-05-31,20,Finland,Wraps,M_JCR_WPC,74.4,75,152.5,157.5,-162.5,,157.5,90,95,100,,100,175,-190,190,,190,447.5,SBD
1,Harri Kaasinen,M,2000-02-19,23,Finland,Wraps,M_JCR_WPC,89.1,90,220,-230,-230,,220,160,-170,-170,,160,300,310,-320,,310,690,SBD
2,Vilho Pakkanen,M,1999-05-10,23,Finland,Wraps,M_JCR_WPC,87.8,90,-170,-170,170,,170,110,-122.5,-122.5,,110,200,220,,,220,500,SBD
1,Jeremia Saloniemi,M,2001-10-15,21,Finland,Wraps,M_JCR_WPC,98,100,195,205,215,,215,-125,125,130,,130,250,-260,265,,265,610,SBD
1,Tommi Läntinen,M,1980-07-25,42,Finland,Wraps,M_MCR_1_WPC,89.1,90,-190,190,210,,210,115,-125,-125,,115,240,-260,-260,,240,565,SBD
2,Tuomas Siivonen,M,1979-11-04,43,Finland,Wraps,M_MCR_1_WPC,89.6,90,160,172.5,-180,,172.5,105,110,-112.5,,110,-170,170,192.5,,192.5,475,SBD
DQ,Tero Manner,M,1980-08-24,42,Finland,Wraps,M_MCR_1_WPC,90,90,-180,-180,-180,,,,,,,,,,,,,,SBD
1,Jari Koskinen,M,1982-09-05,40,Finland,Wraps,M_MCR_1_WPC,110,110,270,285,300,,300,190,205,212.5,,212.5,275,295,302.5,,302.5,815,SBD
2,Tero Pitkänen,M,1980-10-03,42,Finland,Wraps,M_MCR_1_WPC,109.2,110,255,-275,285,,285,175,182.5,-187.5,,182.5,270,282.5,,,282.5,750,SBD
1,Toni Mikkola,M,1977-01-29,46,Finland,Wraps,M_MCR_2_WPC,80.1,82.5,160,170,182.5,,182.5,120,127.5,132.5,,132.5,180,190,202.5,,202.5,517.5,SBD
1,Jorma Mäkeläinen,M,1976-05-23,46,Finland,Wraps,M_MCR_2_WPC,101.9,110,215,225,-232.5,,225,157.5,-165.5,-165.5,,157.5,225,240.5,,,240.5,623,SBD
1,Hannu Niemelä,M,1971-01-28,52,Finland,Wraps,M_MCR_3_WPC,80.6,82.5,140,-150,-150,,140,115,120,125,,125,170,180,190,,190,455,SBD
1,Petri Paatelainen,M,,52,Finland,Wraps,M_MCR_3_WPC,92.1,100,160,175,185,,185,110,115,117.5,,117.5,160,175,-187.5,,175,477.5,SBD
1,Juha Harilainen,M,1970-04-17,53,Finland,Wraps,M_MCR_3_WPC,136.6,140,-220,-220,220,,220,150,160,-170,,160,220,240,-260,,240,620,SBD
1,Vladlen Astaptsev,M,1965-02-01,58,Finland,Wraps,M_MCR_4_WPC,74.5,75,165,176,-180,,176,105,-110,110,,110,200,210,-212.5,,210,496,SBD
1,Pekka Anttila,M,1965-04-19,58,Finland,Wraps,M_MCR_4_WPC,81.8,82.5,160,170,180,195.5,180,75,,,,75,160,170,180,,180,435,SBD
1,Juha Järvisalo,M,1968-02-17,55,Finland,Wraps,M_MCR_4_WPC,99.4,100,190,200.5,205,,205,120,125,130,,130,210,-225.5,225.5,-232.5,225.5,560.5,SBD
1,Vilho Määttä,M,1952-08-05,70,Finland,Wraps,M_MCR_7_WPC,87,90,110,120,130,,130,90,100,102.5,,102.5,150,160,170,,170,402.5,SBD
1,Jukka Lindström,M,1952-09-03,70,Finland,Wraps,M_MCR_7_WPC,98.2,100,-180,180,-221,,180,-80,80,-100,,80,130,170,-200,,170,430,SBD
1,Henri Toukometsä,M,1993-10-30,29,Finland,Wraps,M_OCR_WPC,74.8,75,185,200,210,,210,132.5,140,-145,,140,220,230,235,,235,585,SBD
1,Joni Laiho,M,1993-04-09,30,Finland,Wraps,M_OCR_WPC,81.4,82.5,240,256,260,,260,157.5,165.5,167.5,,167.5,235,245,255,,255,682.5,SBD
1,Ville Saranpää,M,1999-03-01,24,Finland,Wraps,M_OCR_WPC,88.7,90,200,220,-230,,220,120,130,-135,,130,200,-220,220,,220,570,SBD
DQ,Tero Manner,M,1980-08-24,42,Finland,Wraps,M_OCR_WPC,90,90,-180,-180,-180,,,,,,,,,,,,,,SBD
1,Roope Lankila,M,1992-03-02,31,Finland,Wraps,M_OCR_WPC,100,100,260,275,290,,290,180,190,195,,195,260,280,285,,285,770,SBD
2,Jani Lantiainen,M,1986-09-03,36,Finland,Wraps,M_OCR_WPC,98.9,100,250,275,285,,285,155,165,-175,,165,280,310,-320,,310,760,SBD
3,Raul Kivine,M,1983-09-16,39,Finland,Wraps,M_OCR_WPC,98.7,100,220,240,250,,250,155,165,-170,,165,270,285,-300,,285,700,SBD
4,Henry Hyytiäinen,M,1999-03-29,24,Finland,Wraps,M_OCR_WPC,99.3,100,235,250,-260,,250,120,130,-135,,130,240,255,-262.5,,255,635,SBD
1,Jari Koskinen,M,1982-09-05,40,Finland,Wraps,M_OCR_WPC,110,110,270,285,300,,300,190,205,212.5,,212.5,275,295,302.5,,302.5,815,SBD
1,Jani Varha,M,1992-09-24,30,Finland,Wraps,M_OCR_WPC,118.5,125,295,-307.5,312.5,,312.5,-190,195,205,,205,300,320,-325,,320,837.5,SBD
2,Jan-Erik Maantila,M,1985-06-24,37,Finland,Wraps,M_OCR_WPC,122.7,125,290,310,327.5,,327.5,200,-215,215,,215,250,275,-297.5,,275,817.5,SBD
3,Kari Heikkilä,M,1988-01-29,35,Finland,Wraps,M_OCR_WPC,124.9,125,275,287.5,300,,300,170,-185,,,170,260,280,,,280,750,SBD
1,Seppo Honkanen,M,1987-10-06,35,Finland,Wraps,M_OCR_WPC,137.4,140,220,235,250,,250,135,150,-165,,150,235,250,-260,,250,650,SBD
2,Tuomas Uotila,M,1996-06-10,26,Finland,Wraps,M_OCR_WPC,132.7,140,220,,,,220,150,157.5,-165,,157.5,230,-245,-250,,230,607.5,SBD
1,Miika Pesonen,M,2009-05-20,13,Finland,Raw,M_TCR_1_WPC,42.6,52,50,60,70,,70,27.5,30,32.5,,32.5,-80,90,100,105,100,202.5,SBD
1,Max Hyttilä,M,2005-11-24,17,Finland,Wraps,M_TCR_2_WPC,85.4,90,160,170,180,-185,180,115,-120,120,,120,205,210,,,210,510,SBD
1,Veeti Toivonen,M,2004-03-14,19,Finland,Wraps,M_TCR_3_WPC,73.6,75,160,170,180,,180,90,95,-100,,95,-190,190,200,-205.5,200,475,SBD
2,Jani Lindberg,M,2004-12-06,18,Finland,Wraps,M_TCR_3_WPC,72.3,75,145,-152.5,-152.5,,145,92.5,95,100,-103,100,145,155,162.5,,162.5,407.5,SBD
1,Kari Markku Kalliola,M,1963-01-24,60,Finland,Multi-ply,M_MEM_5_WPC,157,140+,280,300,-320,,300,-230,-230,230,-250,230,200,222.5,240,,240,770,SBD
1,Dennis Riihimäki,M,1983-09-14,39,Finland,Multi-ply,M_OEM_WPC,109.9,110,-385,385,395,,395,250,255,260,,260,330,347.5,355,,355,1010,SBD
2,Henri Kotkansalo,M,1996-11-10,26,Finland,Multi-ply,M_OEM_WPC,107.9,110,255,270,-280,,270,150,165,-175,,165,245,265,270,,270,705,SBD
1,Kari Markku Kalliola,M,1963-01-24,60,Finland,Multi-ply,M_OEM_WPC,157,140+,280,300,-320,,300,-230,-230,230,-250,230,200,222.5,240,,240,770,SBD
1,Marko Hyytinen,M,1986-06-13,36,Finland,Single-ply,M_OES_WPC,99,100,-275,275,-300,,275,160,170,180,,180,215,230,240,,240,695,SBD
DQ,Johan Frisk,M,1991-09-26,31,Finland,Single-ply,M_OES_WPC,106.4,110,-360,-360,,,,,,,,,,,,,,,SBD
1,Janne Peltoniemi,M,1983-11-03,39,Finland,Single-ply,M_OES_WPC,126.9,140,-225,230,245,,245,195,-215,-215,,195,230,,,,230,670,SBD
1,Janne Tukia,M,1981-12-30,41,Finland,Raw,M_MR_1_WPC,81.7,82.5,,,,,,127.5,135,142.5,,142.5,,,,,,142.5,B
2,Timo Saarela,M,1979-04-18,44,Finland,Raw,M_MR_1_WPC,81,82.5,,,,,,112.5,-117.5,122.5,,122.5,,,,,,122.5,B
1,Toni Helminen,M,1978-07-06,44,Finland,Raw,M_MR_1_WPC,99.4,100,,,,,,140,150,160,,160,,,,,,160,B
1,Sakari Kuusisto,M,1981-01-16,42,Finland,Raw,M_MR_1_WPC,105,110,,,,,,-185,185,-190,,185,,,,,,185,B
1,Janne Hihnala,M,1976-04-22,47,Finland,Raw,M_MR_2_WPC,109,110,,,,,,150,-170,-170,,150,,,,,,150,B
1,Raimo Mannelin,M,1971-09-14,51,Finland,Raw,M_MR_3_WPC,129.6,140,,,,,,152.5,-160,-160,,152.5,,,,,,152.5,B
1,Marcus Young,M,1964-09-12,58,Finland,Raw,M_MR_4_WPC,85.9,90,,,,,,130,135,-140,,135,,,,,,135,B
1,Raimo Lehtonen,M,1960-08-21,62,Finland,Raw,M_MR_5_WPC,82,82.5,,,,,,115,-120,120,,120,,,,,,120,B
1,Joni Tuomainen,M,1982-03-17,41,Finland,Raw,M_OR_WPC,107.8,110,,,,,,205,210,,,210,,,,,,210,B
DQ,Marko Loponen,M,1981-12-16,41,Finland,Multi-ply,M_MEM_1_WPC,106.7,110,,,,,,-290,-305,-305,,,,,,,,,B
1,Marcus Young,M,1964-09-12,58,Finland,Single-ply,M_MES_4_WPC,85.9,90,,,,,,170,178,-180,,178,,,,,,178,B
DQ,Vili Muhonen,M,1998-08-21,24,Finland,Single-ply,M_OES_WPC,74.1,75,,,,,,-181.5,-181.5,-181.5,,,,,,,,,B
1,Timo Saarela,M,1979-04-18,44,Finland,Raw,M_MR_1_WPC,81,82.5,,,,,,,,,,,210,220,-230,,220,220,D
1,Mauritz Varha,M,1981-03-01,42,Finland,Raw,M_MR_1_WPC,109,110,,,,,,,,,,,260,270,287.5,,287.5,287.5,D
2,Kaj Österberg,M,1980-07-07,42,Finland,Raw,M_MR_1_WPC,109.6,110,,,,,,,,,,,255,265,-272.5,,265,265,D
1,Rane Ovaska,M,1960-06-24,62,Finland,Raw,M_MR_5_WPC,78.8,82.5,,,,,,,,,,,150,170,180,,180,180,D
1,Raine Mäkinen,M,1957-11-28,65,Finland,Raw,M_MR_6_WPC,72.6,75,,,,,,,,,,,180,190,-195,,190,190,D
1,Sami Vaskelainen,M,1984-05-12,38,Finland,Raw,M_OR_WPC,73.2,75,,,,,,,,,,,260,270,275,-280,275,275,D
1,Tuomas Kiander,M,1992-02-13,31,Finland,Raw,M_OR_WPC,80.2,82.5,,,,,,,,,,,160,180,200,,200,200,D
1,Mikko Järvenpää,M,1986-06-04,36,Finland,Raw,M_OR_WPC,108.3,110,,,,,,,,,,,280,300,-310,,300,300,D
2,Mauritz Varha,M,1981-03-01,42,Finland,Raw,M_OR_WPC,109,110,,,,,,,,,,,260,270,287.5,,287.5,287.5,D
1,Atte Anttila,M,1993-08-27,29,Finland,Raw,M_OR_WPC,110.7,125,,,,,,,,,,,260,280,-300,,280,280,D
