Division,WeightClassKg,Place,Name,Team,BodyweightKg,Best3SquatKg,Best3BenchKg,Best3DeadliftKg,TotalKg,Equipment,Event,Sex
Boys,51.71,1,Jesus Leon,Wolfe City,51.71,142.88,65.77,140.61,349.27,Single-ply,SBD,M
Boys,51.71,2,Jaden Brown #1,Paris North Lamar,51.44,117.93,72.57,142.88,333.39,Single-ply,SBD,M
Boys,51.71,3,Jace Lindsay,Beckville,51.07,106.59,72.57,117.93,297.1,Single-ply,SBD,M
Boys,51.71,4,Jacob Semler,Sulphur Springs,51.62,113.4,54.43,120.2,288.03,Single-ply,SBD,M
Boys,51.71,5,Jesse Ribble,Daingerfield,49.44,117.93,47.63,115.67,281.23,Single-ply,SBD,M
Boys,51.71,6,Heath Schlottman,Mount Vernon,47.45,104.33,61.23,111.13,276.69,Single-ply,SBD,M
Boys,51.71,7,Nate Brower,Maud,51.53,104.33,56.7,92.99,254.01,Single-ply,SBD,M
Boys,55.79,1,Aaron Butler,Celeste,55.07,147.42,92.99,154.22,394.63,Single-ply,SBD,M
Boys,55.79,2,Kadin Daniels,Maud,55.61,129.27,77.11,147.42,353.8,Single-ply,SBD,M
Boys,55.79,3,Elijah Webster,Queen City,55.16,124.74,74.84,145.15,344.73,Single-ply,SBD,M
Boys,55.79,4,Gavin Rhea,Simms Bowie,55.79,131.54,77.11,136.08,344.73,Single-ply,SBD,M
Boys,55.79,5,Sam Shankles,Longview Spring Hill,55.79,113.4,58.97,136.08,308.44,Single-ply,SBD,M
Boys,55.79,6,Dylan Collins,Beckville,54.79,86.18,45.36,108.86,240.4,Single-ply,SBD,M
Boys,55.79,DQ,Kile Stripland,Gladewater Sabine,55.79,124.74,86.18,,,Single-ply,SBD,M
Boys,59.87,1,Ben Harris #2,Queen City,59.78,165.56,115.67,183.7,464.93,Single-ply,SBD,M
Boys,59.87,2,Justyn Simmons,Honey Grove,59.78,154.22,90.72,165.56,410.5,Single-ply,SBD,M
Boys,59.87,3,Malique Fields,Texarkana Texas,56.52,124.74,65.77,158.76,349.27,Single-ply,SBD,M
Boys,59.87,DQ,Blayce Lassiter,Paris North Lamar,56.61,,,,,Single-ply,SBD,M
Boys,67.13,1,Jason Jackson #5,De Kalb,67.13,226.8,113.4,213.19,553.38,Single-ply,SBD,M
Boys,67.13,2,River Chaney,Quitman,66.41,195.04,99.79,188.24,483.08,Single-ply,SBD,M
Boys,67.13,3,Dalton Johnson,Atlanta,64.32,199.58,95.25,181.44,476.27,Single-ply,SBD,M
Boys,67.13,4,Xavier Coleman,Atlanta,65.95,179.17,106.59,183.7,469.47,Single-ply,SBD,M
Boys,67.13,5,Patrick Dreesen,Linden-Kildare,62.6,192.78,99.79,172.37,464.93,Single-ply,SBD,M
Boys,67.13,6,Jesse Carillo,Sulphur Springs,65.86,183.7,113.4,165.56,462.66,Single-ply,SBD,M
Boys,67.13,7,Alec Morriss,Gladewater Sabine,66.86,176.9,111.13,161.03,449.06,Single-ply,SBD,M
Boys,67.13,8,Ashton Strange #2,Beckville,64.5,151.95,97.52,195.04,444.52,Single-ply,SBD,M
Boys,67.13,9,Antonio Landaverde,Mount Pleasant,65.23,161.03,95.25,183.7,439.98,Single-ply,SBD,M
Boys,67.13,10,Jose Arzola,Mount Vernon,66.22,156.49,104.33,158.76,419.57,Single-ply,SBD,M
Boys,67.13,11,Hunter Hart,Fruitvale,65.05,136.08,92.99,156.49,385.55,Single-ply,SBD,M
Boys,67.13,12,Cody Maxie,Atlanta,61.14,147.42,77.11,151.95,376.48,Single-ply,SBD,M
Boys,67.13,13,Juan Muñoz,Quinlan Ford,64.95,142.88,68.04,158.76,369.68,Single-ply,SBD,M
Boys,67.13,14,Hunter Robinson,Fruitvale,62.69,61.23,86.18,156.49,303.91,Single-ply,SBD,M
Boys,67.13,15,Jace Bramlett,Maud,62.87,104.33,49.9,104.33,258.55,Single-ply,SBD,M
Boys,67.13,16,McKaven Hurd,Clarksville,64.41,65.77,52.16,108.86,226.8,Single-ply,SBD,M
Boys,67.13,DQ,Hugo Ramirez,Quitman,66.68,170.1,,,,Single-ply,SBD,M
Boys,74.84,1,Bryce Jurca,Celeste,74.75,208.65,120.2,226.8,555.65,Single-ply,SBD,M
Boys,74.84,2,Cole Morris,Lone Oak,74.21,199.58,117.93,181.44,498.95,Single-ply,SBD,M
Boys,74.84,3,Logan Shelton,Atlanta,74.84,195.04,113.4,190.51,498.95,Single-ply,SBD,M
Boys,74.84,4,Garrett Davis,Quinlan Ford,69.49,183.7,127.01,185.97,496.68,Single-ply,SBD,M
Boys,74.84,5,Dustin Newman,Mount Pleasant Chapel Hill,74.66,192.78,97.52,199.58,489.88,Single-ply,SBD,M
Boys,74.84,6,Jerome Martin,Quinlan Ford,74.84,185.97,95.25,195.04,476.27,Single-ply,SBD,M
Boys,74.84,7,Kaman Seals,Celeste,73.94,181.44,117.93,172.37,471.74,Single-ply,SBD,M
Boys,74.84,8,Zeb Garrett,Paris North Lamar,71.21,165.56,83.91,197.31,446.79,Single-ply,SBD,M
Boys,74.84,9,JD Prince,Beckville,67.86,158.76,99.79,181.44,439.98,Single-ply,SBD,M
Boys,74.84,10,Aaron Carrillo,Quinlan Ford,72.21,147.42,102.06,181.44,430.91,Single-ply,SBD,M
Boys,74.84,11,Milo Morrison,Beckville,71.21,158.76,95.25,165.56,419.57,Single-ply,SBD,M
Boys,74.84,12,Paul Leal,De Kalb,73.75,142.88,92.99,165.56,401.43,Single-ply,SBD,M
Boys,74.84,13,Kadin Finney,Mount Vernon,73.66,124.74,74.84,142.88,342.46,Single-ply,SBD,M
Boys,74.84,14,Lucas Hendrix,Fruitvale,73.3,70.31,56.7,97.52,224.53,Single-ply,SBD,M
Boys,82.1,1,Gage Mauch,Lone Oak,82.1,208.65,122.47,201.85,532.97,Single-ply,SBD,M
Boys,82.1,2,Dillon Kizer,De Kalb,79.92,201.85,117.93,199.58,519.36,Single-ply,SBD,M
Boys,82.1,3,Tyler Williams,Lone Oak,81.74,201.85,106.59,185.97,494.42,Single-ply,SBD,M
Boys,82.1,4,Steven Gipson,Gladewater Union Grove,79.11,170.1,136.08,185.97,492.15,Single-ply,SBD,M
Boys,82.1,5,Daniel Bautista,Mount Pleasant,81.74,190.51,95.25,204.12,489.88,Single-ply,SBD,M
Boys,82.1,6,Brady Henslee,Celeste,81.01,181.44,108.86,181.44,471.74,Single-ply,SBD,M
Boys,82.1,7,Matthew Shankles,Longview Spring Hill,80.56,158.76,122.47,181.44,462.66,Single-ply,SBD,M
Boys,82.1,8,Kaiden Roden,Quinlan Ford,80.38,142.88,108.86,158.76,410.5,Single-ply,SBD,M
Boys,82.1,DQ,Keaton Decker,Mount Vernon,77.84,,,,,Single-ply,SBD,M
Boys,89.81,1,Caden Davis,Sulphur Springs,83.46,219.99,142.88,204.12,566.99,Single-ply,SBD,M
Boys,89.81,2,Jonathan Woods #1,Mount Pleasant,87.82,213.19,124.74,199.58,537.51,Single-ply,SBD,M
Boys,89.81,3,Coby Barnes,Wolfe City,83.91,217.72,131.54,185.97,535.24,Single-ply,SBD,M
Boys,89.81,4,Arie Love,De Kalb,84.28,215.46,106.59,208.65,530.7,Single-ply,SBD,M
Boys,89.81,5,Carter Renfro,Paris North Lamar,88.9,197.31,117.93,210.92,526.17,Single-ply,SBD,M
Boys,89.81,6,Dylan Bell,Gladewater Union Grove,89.45,190.51,129.27,204.12,523.9,Single-ply,SBD,M
Boys,89.81,7,Seth Brower,Maud,88.09,181.44,113.4,181.44,476.27,Single-ply,SBD,M
Boys,89.81,8,Brian Chavez,Clarksville,84.28,158.76,86.18,176.9,421.84,Single-ply,SBD,M
Boys,89.81,DQ,Andrew Fowler,Clarksville,82.83,142.88,,,,Single-ply,SBD,M
Boys,89.81,DQ,Jamar Person,Honey Grove,89.63,,,,,Single-ply,SBD,M
Boys,89.81,DQ,Dylan Perkins,New Boston,86.64,,,,,Single-ply,SBD,M
Boys,89.81,DQ,Kee'Untray Hawkins,Omaha Pewitt,83.55,181.44,,,,Single-ply,SBD,M
Boys,99.79,1,Trestin Whitehead,Texarkana Texas,98.79,254.01,138.35,240.4,632.76,Single-ply,SBD,M
Boys,99.79,2,Casey Breece,Honey Grove,95.53,244.94,115.67,215.46,576.06,Single-ply,SBD,M
Boys,99.79,3,Aaron Hill,New Boston,99.61,215.46,113.4,231.33,560.19,Single-ply,SBD,M
Boys,99.79,4,Jeremy Peek,Quitman,93.44,210.92,129.27,210.92,551.11,Single-ply,SBD,M
Boys,99.79,5,Ayden Price,Honey Grove,98.7,213.19,129.27,197.31,539.77,Single-ply,SBD,M
Boys,99.79,6,Londell Howard,De Kalb,93.08,192.78,111.13,217.72,521.63,Single-ply,SBD,M
Boys,99.79,7,Blake Mabry,Texarkana Texas,99.34,183.7,122.47,208.65,514.83,Single-ply,SBD,M
Boys,99.79,8,Terrell Hobbs,Clarksville,94.26,181.44,113.4,208.65,503.49,Single-ply,SBD,M
Boys,99.79,9,Jaylen Green,Texarkana Texas,99.61,174.63,113.4,208.65,496.68,Single-ply,SBD,M
Boys,99.79,10,Chad Manard,Sulphur Springs,97.25,204.12,102.06,181.44,487.61,Single-ply,SBD,M
Boys,99.79,11,Justin Lance,Queen City,99.7,192.78,102.06,179.17,474,Single-ply,SBD,M
Boys,99.79,12,Ty Blizzard,Atlanta,91.08,165.56,120.2,181.44,467.2,Single-ply,SBD,M
Boys,99.79,13,Bradley Futch,Sulphur Springs,96.8,176.9,115.67,158.76,451.32,Single-ply,SBD,M
Boys,99.79,DQ,Thadeus Clark,Celeste,95.25,208.65,,,,Single-ply,SBD,M
Boys,99.79,DQ,Mark Wheeler,Clarksville,96.52,124.74,,,,Single-ply,SBD,M
Boys,99.79,DQ,Joel Martinez,Mount Vernon,94.98,,,,,Single-ply,SBD,M
Boys,99.79,DQ,Jeremiah Corley,Fruitvale,92.08,,,,,Single-ply,SBD,M
Boys,109.77,1,Joel Guerrero,Mount Pleasant,106.78,263.08,142.88,197.31,603.28,Single-ply,SBD,M
Boys,109.77,2,Quran Anglin,Paris North Lamar,108.23,226.8,147.42,226.8,601.01,Single-ply,SBD,M
Boys,109.77,3,Jashon Pogue,Mount Pleasant,109.5,204.12,127.01,256.28,587.4,Single-ply,SBD,M
Boys,109.77,4,Nathan Ferrell,Gladewater Union Grove,107.23,215.46,156.49,204.12,576.06,Single-ply,SBD,M
Boys,109.77,5,Anthony Peak,Commerce,106.96,233.6,138.35,199.58,571.53,Single-ply,SBD,M
Boys,109.77,6,Ian Lail,Mount Pleasant Chapel Hill,108.77,233.6,117.93,219.99,571.53,Single-ply,SBD,M
Boys,109.77,7,Tanner Smith,Celeste,106.32,222.26,145.15,201.85,569.26,Single-ply,SBD,M
Boys,109.77,8,Chance Hicks,Maud,107.59,204.12,136.08,204.12,544.31,Single-ply,SBD,M
Boys,109.77,9,Brandon Krenek,Longview Spring Hill,104.69,213.19,131.54,197.31,542.04,Single-ply,SBD,M
Boys,109.77,10,Undra Bates,Pittsburg,103.69,183.7,122.47,226.8,532.97,Single-ply,SBD,M
Boys,109.77,11,Dillan Arden,Gladewater Union Grove,102.15,190.51,127.01,174.63,492.15,Single-ply,SBD,M
Boys,109.77,12,Anthony Jones,Pittsburg,102.06,117.93,86.18,158.76,362.87,Single-ply,SBD,M
Boys,109.77,DQ,Devaughante Jack,Texarkana Texas,104.14,192.78,138.35,,,Single-ply,SBD,M
Boys,124.74,1,Anthony Cork,Commerce,124.28,249.48,154.22,226.8,630.49,Single-ply,SBD,M
Boys,124.74,2,Justin Blalock,Quitman,110.86,240.4,124.74,215.46,580.6,Single-ply,SBD,M
Boys,124.74,3,Brock Foster,Maud,111.22,181.44,145.15,208.65,535.24,Single-ply,SBD,M
Boys,124.74,4,Ivan Elizando,Mount Pleasant,113.04,215.46,111.13,199.58,526.17,Single-ply,SBD,M
Boys,124.74,5,Ian Stewart,Simms Bowie,120.38,226.8,108.86,185.97,521.63,Single-ply,SBD,M
Boys,124.74,6,Christopher McDaniel,De Kalb,123.1,181.44,115.67,204.12,501.22,Single-ply,SBD,M
Boys,124.74,DQ,Joshua Barton,Clarksville,111.31,113.4,88.45,,,Single-ply,SBD,M
Boys,124.74,DQ,Jett Morris,Omaha Pewitt,118.02,219.99,117.93,,,Single-ply,SBD,M
Boys,124.74+,1,David Williams #9,Omaha Pewitt,152.59,249.48,142.88,226.8,619.15,Single-ply,SBD,M
Boys,124.74+,2,Tristan Green,Gladewater Sabine,139.25,226.8,163.29,215.46,605.55,Single-ply,SBD,M
Boys,124.74+,3,Cj Hubbard,Lone Oak,129.46,231.33,190.51,181.44,603.28,Single-ply,SBD,M
Boys,124.74+,4,Thomas Harris,Clarksville,135.17,233.6,136.08,199.58,569.26,Single-ply,SBD,M
Boys,124.74+,5,Trace Reynolds,Pittsburg,128.19,226.8,136.08,204.12,566.99,Single-ply,SBD,M
Boys,124.74+,6,Quinton Johnson,Mount Vernon,131.18,204.12,113.4,210.92,528.44,Single-ply,SBD,M
Boys,124.74+,DQ,Alfredo Olivade,Sulphur Springs,142.61,,,,,Single-ply,SBD,M
Boys,124.74+,DQ,Houston Jonaitis,Sulphur Springs,165.2,299.37,,,,Single-ply,SBD,M
Boys,124.74+,DQ,Cody Rutherford,New Boston,132.63,226.8,136.08,,,Single-ply,SBD,M
