[api-updater (non-obsolete-error-filter)] 3/14/2022 3:14:16 PM : Starting D:/Program Files/2020.3.30f1/Editor/Data/Tools/ScriptUpdater/APIUpdater.NonObsoleteApiUpdaterDetector.exe
[api-updater (non-obsolete-error-filter)] 
----------------------------------
jit/startup time      : 1105.5161ms
moved types parse time: 73ms
candidates parse time : 1ms
C# parse time         : 782ms
candidates check time : 56ms
console write time    : 1ms

[api-updater (non-obsolete-error-filter)] 3/14/2022 3:14:21 PM : Starting D:/Program Files/2020.3.30f1/Editor/Data/Tools/ScriptUpdater/APIUpdater.NonObsoleteApiUpdaterDetector.exe
[api-updater (non-obsolete-error-filter)] 
----------------------------------
jit/startup time      : 103.499ms
moved types parse time: 64ms
candidates parse time : 1ms
C# parse time         : 249ms
candidates check time : 62ms
console write time    : 0ms

[api-updater (non-obsolete-error-filter)] 3/15/2022 1:53:38 PM : Starting D:/Program Files/2020.3.30f1/Editor/Data/Tools/ScriptUpdater/APIUpdater.NonObsoleteApiUpdaterDetector.exe
[api-updater (non-obsolete-error-filter)] 
----------------------------------
jit/startup time      : 1241.5001ms
moved types parse time: 65ms
candidates parse time : 1ms
C# parse time         : 809ms
candidates check time : 54ms
console write time    : 0ms

