{
	"info": {
		"_postman_id": "9086913a-4c75-4029-a5b8-bba2ddd923ff",
		"name": "batch127_bookingSystem",
		"schema": "https://schema.getpostman.com/json/collection/v2.1.0/collection.json"
	},
	"item": [
		{
			"name": "Users",
			"item": [
				{
					"name": "check duplicate email",
					"request": {
						"method": "POST",
						"header": [],
						"body": {
							"mode": "raw",
							"raw": "{\r\n    \"email\":\"wolfcry@mail.com\"\r\n}",
							"options": {
								"raw": {
									"language": "json"
								}
							}
						},
						"url": {
							"raw": "http://localhost:4000/users/checkEmail",
							"protocol": "http",
							"host": [
								"localhost"
							],
							"port": "4000",
							"path": [
								"users",
								"checkEmail"
							]
						}
					},
					"response": []
				},
				{
					"name": "register a user",
					"request": {
						"method": "POST",
						"header": [],
						"body": {
							"mode": "raw",
							"raw": "{\r\n    \"firstName\":\"admin3\",\r\n    \"lastName\":\"admin3\",\r\n    \"email\":\"admin3@mail.com\",\r\n    \"mobileNo\":\"123\",\r\n    \"password\":\"admin3\"\r\n}",
							"options": {
								"raw": {
									"language": "json"
								}
							}
						},
						"url": {
							"raw": "http://localhost:4000/users/register",
							"protocol": "http",
							"host": [
								"localhost"
							],
							"port": "4000",
							"path": [
								"users",
								"register"
							]
						}
					},
					"response": []
				},
				{
					"name": "login a user",
					"request": {
						"method": "POST",
						"header": [],
						"body": {
							"mode": "raw",
							"raw": "{\r\n    \"email\":\"admin3@mail.com\",\r\n    \"password\":\"admin3\"\r\n}",
							"options": {
								"raw": {
									"language": "json"
								}
							}
						},
						"url": {
							"raw": "http://localhost:4000/users/login",
							"protocol": "http",
							"host": [
								"localhost"
							],
							"port": "4000",
							"path": [
								"users",
								"login"
							]
						}
					},
					"response": []
				},
				{
					"name": "get profile",
					"request": {
						"auth": {
							"type": "bearer",
							"bearer": [
								{
									"key": "token",
									"value": "eyJhbGciOiJIUzI1NiIsInR5cCI6IkpXVCJ9.eyJpZCI6IjYxNDllMWY0ZWUyMTQzNTYxMDM2ODhmYiIsImVtYWlsIjoidHJlZTJAbWFpbC5jb20iLCJpc2RBZG1pbiI6ZmFsc2UsImlhdCI6MTYzMjMxNTMzMH0.iv7w_tZ_cE9ZTHoVBPCY5eJoGVTMzF1UrmJQum11PXA",
									"type": "string"
								}
							]
						},
						"method": "GET",
						"header": [],
						"url": {
							"raw": "http://localhost:4000/users/details",
							"protocol": "http",
							"host": [
								"localhost"
							],
							"port": "4000",
							"path": [
								"users",
								"details"
							]
						}
					},
					"response": []
				}
			]
		},
		{
			"name": "Courses",
			"item": [
				{
					"name": "add a course",
					"request": {
						"auth": {
							"type": "bearer",
							"bearer": [
								{
									"key": "token",
									"value": "eyJhbGciOiJIUzI1NiIsInR5cCI6IkpXVCJ9.eyJpZCI6IjYxNGM5MTRjMTE2N2NiYmNmNmMzNmM1OCIsImVtYWlsIjoiYWRtaW4zQG1haWwuY29tIiwiaXNBZG1pbiI6dHJ1ZSwiaWF0IjoxNjMyNDA3OTIzfQ.q79QfiaMwfu_UHJZnV4uGxr1fXDZATT0ejMIMoIDLbs",
									"type": "string"
								}
							]
						},
						"method": "POST",
						"header": [],
						"body": {
							"mode": "raw",
							"raw": "{\r\n    \"name\":\"HTML2\",\r\n    \"description\":\"A basic markup language\",\r\n    \"price\": 5000\r\n}",
							"options": {
								"raw": {
									"language": "json"
								}
							}
						},
						"url": {
							"raw": "http://localhost:4000/courses/",
							"protocol": "http",
							"host": [
								"localhost"
							],
							"port": "4000",
							"path": [
								"courses",
								""
							]
						}
					},
					"response": []
				},
				{
					"name": "get ALL courses",
					"request": {
						"method": "GET",
						"header": [],
						"url": {
							"raw": "http://localhost:4000/courses/all",
							"protocol": "http",
							"host": [
								"localhost"
							],
							"port": "4000",
							"path": [
								"courses",
								"all"
							]
						}
					},
					"response": []
				},
				{
					"name": "get ACTIVE courses",
					"request": {
						"method": "GET",
						"header": [],
						"url": {
							"raw": "http://localhost:4000/courses/",
							"protocol": "http",
							"host": [
								"localhost"
							],
							"port": "4000",
							"path": [
								"courses",
								""
							]
						}
					},
					"response": []
				},
				{
					"name": "Get SPECIFIC course",
					"protocolProfileBehavior": {
						"disableBodyPruning": true
					},
					"request": {
						"method": "GET",
						"header": [],
						"body": {
							"mode": "raw",
							"raw": "{\r\n    \"name\":\"HTML\"\r\n}",
							"options": {
								"raw": {
									"language": "json"
								}
							}
						},
						"url": {
							"raw": "http://localhost:4000/courses/one",
							"protocol": "http",
							"host": [
								"localhost"
							],
							"port": "4000",
							"path": [
								"courses",
								"one"
							]
						}
					},
					"response": []
				},
				{
					"name": "Update a Course and Get Unli Supply of Support",
					"request": {
						"auth": {
							"type": "bearer",
							"bearer": [
								{
									"key": "token",
									"value": "eyJhbGciOiJIUzI1NiIsInR5cCI6IkpXVCJ9.eyJpZCI6IjYxNGM5MTRjMTE2N2NiYmNmNmMzNmM1OCIsImVtYWlsIjoiYWRtaW4zQG1haWwuY29tIiwiaXNBZG1pbiI6dHJ1ZSwiaWF0IjoxNjMyNDA3OTIzfQ.q79QfiaMwfu_UHJZnV4uGxr1fXDZATT0ejMIMoIDLbs",
									"type": "string"
								}
							]
						},
						"method": "PUT",
						"header": [],
						"body": {
							"mode": "raw",
							"raw": "{\r\n    \"name\":\"gumana\",\r\n    \"description\":\"ka please\",\r\n    \"price\":6000,\r\n    \"isActive\":false,\r\n    \"enrollees\":{\r\n        \"name\":\"Josh\",\r\n        \r\n    }\r\n}",
							"options": {
								"raw": {
									"language": "json"
								}
							}
						},
						"url": {
							"raw": "http://localhost:4000/courses/614c92337b2a1b5523de17e6",
							"protocol": "http",
							"host": [
								"localhost"
							],
							"port": "4000",
							"path": [
								"courses",
								"614c92337b2a1b5523de17e6"
							]
						}
					},
					"response": []
				}
			]
		}
	]
}