{
	"info": {
		"_postman_id": "ebea79e5-55d0-475f-a551-ed11509a64de",
		"name": "Capstone2",
		"schema": "https://schema.getpostman.com/json/collection/v2.1.0/collection.json"
	},
	"item": [
		{
			"name": "Users",
			"item": [
				{
					"name": "Register a User",
					"request": {
						"method": "POST",
						"header": [],
						"body": {
							"mode": "raw",
							"raw": "{\r\n    \"email\":\"user5@mail.com\",\r\n    \"mobileNo\":\"101010\",\r\n    \"password\":\"user5\"\r\n}",
							"options": {
								"raw": {
									"language": "json"
								}
							}
						},
						"url": {
							"raw": "http://localhost:4001/users/register",
							"protocol": "http",
							"host": [
								"localhost"
							],
							"port": "4001",
							"path": [
								"users",
								"register"
							]
						}
					},
					"response": []
				},
				{
					"name": "Login",
					"request": {
						"method": "POST",
						"header": [],
						"body": {
							"mode": "raw",
							"raw": "{\r\n    \"email\":\"user4@mail.com\",\r\n    \"password\":\"user4\"\r\n}",
							"options": {
								"raw": {
									"language": "json"
								}
							}
						},
						"url": {
							"raw": "http://localhost:4001/users/login",
							"protocol": "http",
							"host": [
								"localhost"
							],
							"port": "4001",
							"path": [
								"users",
								"login"
							]
						}
					},
					"response": []
				},
				{
					"name": "Promote to Admin",
					"request": {
						"auth": {
							"type": "bearer",
							"bearer": [
								{
									"key": "token",
									"value": "eyJhbGciOiJIUzI1NiIsInR5cCI6IkpXVCJ9.eyJpZCI6ImFkbWluQG1haWwuY29tIiwiaXNBZG1pbiI6dHJ1ZSwiaWF0IjoxNjMyNzQxMDUwfQ.58fHk5DTl-Cskh2ML8y6KenIay4sy817-B6JRaXbJKU",
									"type": "string"
								}
							]
						},
						"method": "PUT",
						"header": [],
						"url": {
							"raw": "http://localhost:4001/users/admin2@mail.com",
							"protocol": "http",
							"host": [
								"localhost"
							],
							"port": "4001",
							"path": [
								"users",
								"admin2@mail.com"
							]
						}
					},
					"response": []
				}
			]
		},
		{
			"name": "Products",
			"item": [
				{
					"name": "Add a Product",
					"request": {
						"auth": {
							"type": "bearer",
							"bearer": [
								{
									"key": "token",
									"value": "eyJhbGciOiJIUzI1NiIsInR5cCI6IkpXVCJ9.eyJpZCI6ImFkbWluQG1haWwuY29tIiwiaXNBZG1pbiI6dHJ1ZSwiaWF0IjoxNjMyNzQxMDUwfQ.58fHk5DTl-Cskh2ML8y6KenIay4sy817-B6JRaXbJKU",
									"type": "string"
								}
							]
						},
						"method": "POST",
						"header": [],
						"body": {
							"mode": "raw",
							"raw": "{\r\n\"name\":\"Chippy Purple\",\r\n\"brand\":\"Jack N Jill\",\r\n\"category\":\"Snacks\",\r\n\"description\":\"As salty as my Axies' win rate\",\r\n\"price\":16\r\n}",
							"options": {
								"raw": {
									"language": "json"
								}
							}
						},
						"url": {
							"raw": "http://localhost:4001/products/add",
							"protocol": "http",
							"host": [
								"localhost"
							],
							"port": "4001",
							"path": [
								"products",
								"add"
							]
						}
					},
					"response": []
				},
				{
					"name": "Update a Product",
					"request": {
						"auth": {
							"type": "bearer",
							"bearer": [
								{
									"key": "token",
									"value": "eyJhbGciOiJIUzI1NiIsInR5cCI6IkpXVCJ9.eyJpZCI6ImFkbWluQG1haWwuY29tIiwiaXNBZG1pbiI6dHJ1ZSwiaWF0IjoxNjMyODExOTE3fQ.Q_BEzjyqW0EiepbnQ3S08Uq3LKPPp8OQ8eBRL_KdA1I",
									"type": "string"
								}
							]
						},
						"method": "PUT",
						"header": [],
						"body": {
							"mode": "raw",
							"raw": "{\r\n\"name\":\"Chippy Pinkyoh\",\r\n\"brand\":\"Jack N Jill\",\r\n\"category\":\"Snacks\",\r\n\"description\":\"As salty as my Axies' win rate\",\r\n\"price\":16\r\n}",
							"options": {
								"raw": {
									"language": "json"
								}
							}
						},
						"url": {
							"raw": "http://localhost:4001/products/6152b1d145b2464217c61c13",
							"protocol": "http",
							"host": [
								"localhost"
							],
							"port": "4001",
							"path": [
								"products",
								"6152b1d145b2464217c61c13"
							]
						}
					},
					"response": []
				},
				{
					"name": "Archive a Product",
					"request": {
						"auth": {
							"type": "bearer",
							"bearer": [
								{
									"key": "token",
									"value": "eyJhbGciOiJIUzI1NiIsInR5cCI6IkpXVCJ9.eyJpZCI6ImFkbWluQG1haWwuY29tIiwiaXNBZG1pbiI6dHJ1ZSwiaWF0IjoxNjMyNzQxMDUwfQ.58fHk5DTl-Cskh2ML8y6KenIay4sy817-B6JRaXbJKU",
									"type": "string"
								}
							]
						},
						"method": "PUT",
						"header": [],
						"body": {
							"mode": "raw",
							"raw": "",
							"options": {
								"raw": {
									"language": "json"
								}
							}
						},
						"url": {
							"raw": "http://localhost:4001/products/6152b1d145b2464217c61c13/archive",
							"protocol": "http",
							"host": [
								"localhost"
							],
							"port": "4001",
							"path": [
								"products",
								"6152b1d145b2464217c61c13",
								"archive"
							]
						}
					},
					"response": []
				},
				{
					"name": "Retrieve all Active Products",
					"request": {
						"method": "GET",
						"header": [],
						"url": {
							"raw": "http://localhost:4001/products/",
							"protocol": "http",
							"host": [
								"localhost"
							],
							"port": "4001",
							"path": [
								"products",
								""
							]
						}
					},
					"response": []
				},
				{
					"name": "Retrieve Single Product",
					"protocolProfileBehavior": {
						"disableBodyPruning": true
					},
					"request": {
						"method": "GET",
						"header": [],
						"body": {
							"mode": "raw",
							"raw": "{\r\n    \"name\":\"Chippy Red\"\r\n}",
							"options": {
								"raw": {
									"language": "json"
								}
							}
						},
						"url": {
							"raw": "http://localhost:4001/products/find",
							"protocol": "http",
							"host": [
								"localhost"
							],
							"port": "4001",
							"path": [
								"products",
								"find"
							]
						}
					},
					"response": []
				}
			]
		},
		{
			"name": "Orders",
			"item": [
				{
					"name": "Add to Cart",
					"request": {
						"auth": {
							"type": "bearer",
							"bearer": [
								{
									"key": "token",
									"value": "eyJhbGciOiJIUzI1NiIsInR5cCI6IkpXVCJ9.eyJpZCI6InVzZXI0QG1haWwuY29tIiwiaXNBZG1pbiI6ZmFsc2UsImlhdCI6MTYzMzA1NzcxNX0.-PDuGiA4bhT-s1bUp_FMybO5zslt1K5nmlFxbBEGtpU",
									"type": "string"
								}
							]
						},
						"method": "PUT",
						"header": [],
						"url": {
							"raw": "http://localhost:4001/orders/6152b1d145b2464217c61c13/cart",
							"protocol": "http",
							"host": [
								"localhost"
							],
							"port": "4001",
							"path": [
								"orders",
								"6152b1d145b2464217c61c13",
								"cart"
							]
						}
					},
					"response": []
				},
				{
					"name": "Checkout",
					"request": {
						"auth": {
							"type": "bearer",
							"bearer": [
								{
									"key": "token",
									"value": "eyJhbGciOiJIUzI1NiIsInR5cCI6IkpXVCJ9.eyJpZCI6InVzZXI0QG1haWwuY29tIiwiaXNBZG1pbiI6ZmFsc2UsImlhdCI6MTYzMzAwMzk2NX0.RvZ5v5SqS9iMMlna8_G08Jty3qUndikt4WC42M3RdGU",
									"type": "string"
								}
							]
						},
						"method": "PUT",
						"header": [],
						"url": {
							"raw": "http://localhost:4001/orders/checkout",
							"protocol": "http",
							"host": [
								"localhost"
							],
							"port": "4001",
							"path": [
								"orders",
								"checkout"
							]
						}
					},
					"response": []
				},
				{
					"name": "Retrieve All Orders",
					"request": {
						"auth": {
							"type": "bearer",
							"bearer": [
								{
									"key": "token",
									"value": "eyJhbGciOiJIUzI1NiIsInR5cCI6IkpXVCJ9.eyJpZCI6ImFkbWluQG1haWwuY29tIiwiaXNBZG1pbiI6dHJ1ZSwiaWF0IjoxNjMzMDAwMzE1fQ.z-32Y7dYnWXDy2qzk97KeP9iGVPYMRgsi6IudVR4Rs8",
									"type": "string"
								}
							]
						},
						"method": "GET",
						"header": [],
						"url": {
							"raw": "http://localhost:4001/orders/",
							"protocol": "http",
							"host": [
								"localhost"
							],
							"port": "4001",
							"path": [
								"orders",
								""
							]
						}
					},
					"response": []
				},
				{
					"name": "Retrieve All User's Orders",
					"request": {
						"auth": {
							"type": "bearer",
							"bearer": [
								{
									"key": "token",
									"value": "eyJhbGciOiJIUzI1NiIsInR5cCI6IkpXVCJ9.eyJpZCI6InVzZXI0QG1haWwuY29tIiwiaXNBZG1pbiI6ZmFsc2UsImlhdCI6MTYzMzAwMzk2NX0.RvZ5v5SqS9iMMlna8_G08Jty3qUndikt4WC42M3RdGU",
									"type": "string"
								}
							]
						},
						"method": "GET",
						"header": [],
						"url": {
							"raw": "http://localhost:4001/orders/history",
							"protocol": "http",
							"host": [
								"localhost"
							],
							"port": "4001",
							"path": [
								"orders",
								"history"
							]
						}
					},
					"response": []
				}
			]
		}
	]
}