%YAML 1.1
%TAG !u! tag:unity3d.com,2011:
--- !u!1 &5516593683084484
GameObject:
  m_ObjectHideFlags: 0
  m_CorrespondingSourceObject: {fileID: 0}
  m_PrefabInstance: {fileID: 0}
  m_PrefabAsset: {fileID: 0}
  serializedVersion: 6
  m_Component:
  - component: {fileID: 7093228262044453087}
  - component: {fileID: 5273172189767721054}
  - component: {fileID: 7614778366633943118}
  m_Layer: 31
  m_Name: Layer1
  m_TagString: Untagged
  m_Icon: {fileID: 0}
  m_NavMeshLayer: 0
  m_StaticEditorFlags: 0
  m_IsActive: 1
--- !u!4 &7093228262044453087
Transform:
  m_ObjectHideFlags: 0
  m_CorrespondingSourceObject: {fileID: 0}
  m_PrefabInstance: {fileID: 0}
  m_PrefabAsset: {fileID: 0}
  m_GameObject: {fileID: 5516593683084484}
  m_LocalRotation: {x: -0, y: -0, z: -0, w: 1}
  m_LocalPosition: {x: 0, y: 0, z: 0}
  m_LocalScale: {x: 1, y: 1, z: 1}
  m_Children: []
  m_Father: {fileID: 2747391777123795439}
  m_RootOrder: 0
  m_LocalEulerAnglesHint: {x: 0, y: 0, z: 0}
--- !u!1839735485 &5273172189767721054
Tilemap:
  m_ObjectHideFlags: 0
  m_CorrespondingSourceObject: {fileID: 0}
  m_PrefabInstance: {fileID: 0}
  m_PrefabAsset: {fileID: 0}
  m_GameObject: {fileID: 5516593683084484}
  m_Enabled: 1
  m_Tiles:
  - first: {x: -2, y: -14, z: 0}
    second:
      serializedVersion: 2
      m_TileIndex: 125
      m_TileSpriteIndex: 125
      m_TileMatrixIndex: 0
      m_TileColorIndex: 0
      m_TileObjectToInstantiateIndex: 65535
      m_AllTileFlags: 1073741825
  - first: {x: 2, y: -14, z: 0}
    second:
      serializedVersion: 2
      m_TileIndex: 126
      m_TileSpriteIndex: 126
      m_TileMatrixIndex: 0
      m_TileColorIndex: 0
      m_TileObjectToInstantiateIndex: 65535
      m_AllTileFlags: 1073741825
  - first: {x: -2, y: -13, z: 0}
    second:
      serializedVersion: 2
      m_TileIndex: 115
      m_TileSpriteIndex: 115
      m_TileMatrixIndex: 0
      m_TileColorIndex: 0
      m_TileObjectToInstantiateIndex: 65535
      m_AllTileFlags: 1073741825
  - first: {x: -1, y: -13, z: 0}
    second:
      serializedVersion: 2
      m_TileIndex: 116
      m_TileSpriteIndex: 116
      m_TileMatrixIndex: 0
      m_TileColorIndex: 0
      m_TileObjectToInstantiateIndex: 65535
      m_AllTileFlags: 1073741825
  - first: {x: 0, y: -13, z: 0}
    second:
      serializedVersion: 2
      m_TileIndex: 117
      m_TileSpriteIndex: 117
      m_TileMatrixIndex: 0
      m_TileColorIndex: 0
      m_TileObjectToInstantiateIndex: 65535
      m_AllTileFlags: 1073741825
  - first: {x: 1, y: -13, z: 0}
    second:
      serializedVersion: 2
      m_TileIndex: 118
      m_TileSpriteIndex: 118
      m_TileMatrixIndex: 0
      m_TileColorIndex: 0
      m_TileObjectToInstantiateIndex: 65535
      m_AllTileFlags: 1073741825
  - first: {x: 2, y: -13, z: 0}
    second:
      serializedVersion: 2
      m_TileIndex: 119
      m_TileSpriteIndex: 119
      m_TileMatrixIndex: 0
      m_TileColorIndex: 0
      m_TileObjectToInstantiateIndex: 65535
      m_AllTileFlags: 1073741825
  - first: {x: 3, y: -13, z: 0}
    second:
      serializedVersion: 2
      m_TileIndex: 120
      m_TileSpriteIndex: 120
      m_TileMatrixIndex: 0
      m_TileColorIndex: 0
      m_TileObjectToInstantiateIndex: 65535
      m_AllTileFlags: 1073741825
  - first: {x: 4, y: -13, z: 0}
    second:
      serializedVersion: 2
      m_TileIndex: 121
      m_TileSpriteIndex: 121
      m_TileMatrixIndex: 0
      m_TileColorIndex: 0
      m_TileObjectToInstantiateIndex: 65535
      m_AllTileFlags: 1073741825
  - first: {x: 5, y: -13, z: 0}
    second:
      serializedVersion: 2
      m_TileIndex: 122
      m_TileSpriteIndex: 122
      m_TileMatrixIndex: 0
      m_TileColorIndex: 0
      m_TileObjectToInstantiateIndex: 65535
      m_AllTileFlags: 1073741825
  - first: {x: 6, y: -13, z: 0}
    second:
      serializedVersion: 2
      m_TileIndex: 123
      m_TileSpriteIndex: 123
      m_TileMatrixIndex: 0
      m_TileColorIndex: 0
      m_TileObjectToInstantiateIndex: 65535
      m_AllTileFlags: 1073741825
  - first: {x: 7, y: -13, z: 0}
    second:
      serializedVersion: 2
      m_TileIndex: 124
      m_TileSpriteIndex: 124
      m_TileMatrixIndex: 0
      m_TileColorIndex: 0
      m_TileObjectToInstantiateIndex: 65535
      m_AllTileFlags: 1073741825
  - first: {x: 0, y: -12, z: 0}
    second:
      serializedVersion: 2
      m_TileIndex: 107
      m_TileSpriteIndex: 107
      m_TileMatrixIndex: 0
      m_TileColorIndex: 0
      m_TileObjectToInstantiateIndex: 65535
      m_AllTileFlags: 1073741825
  - first: {x: 1, y: -12, z: 0}
    second:
      serializedVersion: 2
      m_TileIndex: 108
      m_TileSpriteIndex: 108
      m_TileMatrixIndex: 0
      m_TileColorIndex: 0
      m_TileObjectToInstantiateIndex: 65535
      m_AllTileFlags: 1073741825
  - first: {x: 2, y: -12, z: 0}
    second:
      serializedVersion: 2
      m_TileIndex: 109
      m_TileSpriteIndex: 109
      m_TileMatrixIndex: 0
      m_TileColorIndex: 0
      m_TileObjectToInstantiateIndex: 65535
      m_AllTileFlags: 1073741825
  - first: {x: 3, y: -12, z: 0}
    second:
      serializedVersion: 2
      m_TileIndex: 110
      m_TileSpriteIndex: 110
      m_TileMatrixIndex: 0
      m_TileColorIndex: 0
      m_TileObjectToInstantiateIndex: 65535
      m_AllTileFlags: 1073741825
  - first: {x: 4, y: -12, z: 0}
    second:
      serializedVersion: 2
      m_TileIndex: 111
      m_TileSpriteIndex: 111
      m_TileMatrixIndex: 0
      m_TileColorIndex: 0
      m_TileObjectToInstantiateIndex: 65535
      m_AllTileFlags: 1073741825
  - first: {x: 5, y: -12, z: 0}
    second:
      serializedVersion: 2
      m_TileIndex: 112
      m_TileSpriteIndex: 112
      m_TileMatrixIndex: 0
      m_TileColorIndex: 0
      m_TileObjectToInstantiateIndex: 65535
      m_AllTileFlags: 1073741825
  - first: {x: 6, y: -12, z: 0}
    second:
      serializedVersion: 2
      m_TileIndex: 113
      m_TileSpriteIndex: 113
      m_TileMatrixIndex: 0
      m_TileColorIndex: 0
      m_TileObjectToInstantiateIndex: 65535
      m_AllTileFlags: 1073741825
  - first: {x: 7, y: -12, z: 0}
    second:
      serializedVersion: 2
      m_TileIndex: 114
      m_TileSpriteIndex: 114
      m_TileMatrixIndex: 0
      m_TileColorIndex: 0
      m_TileObjectToInstantiateIndex: 65535
      m_AllTileFlags: 1073741825
  - first: {x: 0, y: -11, z: 0}
    second:
      serializedVersion: 2
      m_TileIndex: 98
      m_TileSpriteIndex: 98
      m_TileMatrixIndex: 0
      m_TileColorIndex: 0
      m_TileObjectToInstantiateIndex: 65535
      m_AllTileFlags: 1073741825
  - first: {x: 1, y: -11, z: 0}
    second:
      serializedVersion: 2
      m_TileIndex: 99
      m_TileSpriteIndex: 99
      m_TileMatrixIndex: 0
      m_TileColorIndex: 0
      m_TileObjectToInstantiateIndex: 65535
      m_AllTileFlags: 1073741825
  - first: {x: 2, y: -11, z: 0}
    second:
      serializedVersion: 2
      m_TileIndex: 100
      m_TileSpriteIndex: 100
      m_TileMatrixIndex: 0
      m_TileColorIndex: 0
      m_TileObjectToInstantiateIndex: 65535
      m_AllTileFlags: 1073741825
  - first: {x: 3, y: -11, z: 0}
    second:
      serializedVersion: 2
      m_TileIndex: 101
      m_TileSpriteIndex: 101
      m_TileMatrixIndex: 0
      m_TileColorIndex: 0
      m_TileObjectToInstantiateIndex: 65535
      m_AllTileFlags: 1073741825
  - first: {x: 4, y: -11, z: 0}
    second:
      serializedVersion: 2
      m_TileIndex: 102
      m_TileSpriteIndex: 102
      m_TileMatrixIndex: 0
      m_TileColorIndex: 0
      m_TileObjectToInstantiateIndex: 65535
      m_AllTileFlags: 1073741825
  - first: {x: 5, y: -11, z: 0}
    second:
      serializedVersion: 2
      m_TileIndex: 103
      m_TileSpriteIndex: 103
      m_TileMatrixIndex: 0
      m_TileColorIndex: 0
      m_TileObjectToInstantiateIndex: 65535
      m_AllTileFlags: 1073741825
  - first: {x: 6, y: -11, z: 0}
    second:
      serializedVersion: 2
      m_TileIndex: 104
      m_TileSpriteIndex: 104
      m_TileMatrixIndex: 0
      m_TileColorIndex: 0
      m_TileObjectToInstantiateIndex: 65535
      m_AllTileFlags: 1073741825
  - first: {x: 7, y: -11, z: 0}
    second:
      serializedVersion: 2
      m_TileIndex: 105
      m_TileSpriteIndex: 105
      m_TileMatrixIndex: 0
      m_TileColorIndex: 0
      m_TileObjectToInstantiateIndex: 65535
      m_AllTileFlags: 1073741825
  - first: {x: 8, y: -11, z: 0}
    second:
      serializedVersion: 2
      m_TileIndex: 106
      m_TileSpriteIndex: 106
      m_TileMatrixIndex: 0
      m_TileColorIndex: 0
      m_TileObjectToInstantiateIndex: 65535
      m_AllTileFlags: 1073741825
  - first: {x: -2, y: -10, z: 0}
    second:
      serializedVersion: 2
      m_TileIndex: 90
      m_TileSpriteIndex: 90
      m_TileMatrixIndex: 0
      m_TileColorIndex: 0
      m_TileObjectToInstantiateIndex: 65535
      m_AllTileFlags: 1073741825
  - first: {x: -1, y: -10, z: 0}
    second:
      serializedVersion: 2
      m_TileIndex: 91
      m_TileSpriteIndex: 91
      m_TileMatrixIndex: 0
      m_TileColorIndex: 0
      m_TileObjectToInstantiateIndex: 65535
      m_AllTileFlags: 1073741825
  - first: {x: 1, y: -10, z: 0}
    second:
      serializedVersion: 2
      m_TileIndex: 92
      m_TileSpriteIndex: 92
      m_TileMatrixIndex: 0
      m_TileColorIndex: 0
      m_TileObjectToInstantiateIndex: 65535
      m_AllTileFlags: 1073741825
  - first: {x: 2, y: -10, z: 0}
    second:
      serializedVersion: 2
      m_TileIndex: 93
      m_TileSpriteIndex: 93
      m_TileMatrixIndex: 0
      m_TileColorIndex: 0
      m_TileObjectToInstantiateIndex: 65535
      m_AllTileFlags: 1073741825
  - first: {x: 3, y: -10, z: 0}
    second:
      serializedVersion: 2
      m_TileIndex: 94
      m_TileSpriteIndex: 94
      m_TileMatrixIndex: 0
      m_TileColorIndex: 0
      m_TileObjectToInstantiateIndex: 65535
      m_AllTileFlags: 1073741825
  - first: {x: 4, y: -10, z: 0}
    second:
      serializedVersion: 2
      m_TileIndex: 95
      m_TileSpriteIndex: 95
      m_TileMatrixIndex: 0
      m_TileColorIndex: 0
      m_TileObjectToInstantiateIndex: 65535
      m_AllTileFlags: 1073741825
  - first: {x: 5, y: -10, z: 0}
    second:
      serializedVersion: 2
      m_TileIndex: 96
      m_TileSpriteIndex: 96
      m_TileMatrixIndex: 0
      m_TileColorIndex: 0
      m_TileObjectToInstantiateIndex: 65535
      m_AllTileFlags: 1073741825
  - first: {x: 6, y: -10, z: 0}
    second:
      serializedVersion: 2
      m_TileIndex: 97
      m_TileSpriteIndex: 97
      m_TileMatrixIndex: 0
      m_TileColorIndex: 0
      m_TileObjectToInstantiateIndex: 65535
      m_AllTileFlags: 1073741825
  - first: {x: -2, y: -9, z: 0}
    second:
      serializedVersion: 2
      m_TileIndex: 80
      m_TileSpriteIndex: 80
      m_TileMatrixIndex: 0
      m_TileColorIndex: 0
      m_TileObjectToInstantiateIndex: 65535
      m_AllTileFlags: 1073741825
  - first: {x: -1, y: -9, z: 0}
    second:
      serializedVersion: 2
      m_TileIndex: 81
      m_TileSpriteIndex: 81
      m_TileMatrixIndex: 0
      m_TileColorIndex: 0
      m_TileObjectToInstantiateIndex: 65535
      m_AllTileFlags: 1073741825
  - first: {x: 0, y: -9, z: 0}
    second:
      serializedVersion: 2
      m_TileIndex: 82
      m_TileSpriteIndex: 82
      m_TileMatrixIndex: 0
      m_TileColorIndex: 0
      m_TileObjectToInstantiateIndex: 65535
      m_AllTileFlags: 1073741825
  - first: {x: 1, y: -9, z: 0}
    second:
      serializedVersion: 2
      m_TileIndex: 83
      m_TileSpriteIndex: 83
      m_TileMatrixIndex: 0
      m_TileColorIndex: 0
      m_TileObjectToInstantiateIndex: 65535
      m_AllTileFlags: 1073741825
  - first: {x: 2, y: -9, z: 0}
    second:
      serializedVersion: 2
      m_TileIndex: 84
      m_TileSpriteIndex: 84
      m_TileMatrixIndex: 0
      m_TileColorIndex: 0
      m_TileObjectToInstantiateIndex: 65535
      m_AllTileFlags: 1073741825
  - first: {x: 3, y: -9, z: 0}
    second:
      serializedVersion: 2
      m_TileIndex: 85
      m_TileSpriteIndex: 85
      m_TileMatrixIndex: 0
      m_TileColorIndex: 0
      m_TileObjectToInstantiateIndex: 65535
      m_AllTileFlags: 1073741825
  - first: {x: 4, y: -9, z: 0}
    second:
      serializedVersion: 2
      m_TileIndex: 86
      m_TileSpriteIndex: 86
      m_TileMatrixIndex: 0
      m_TileColorIndex: 0
      m_TileObjectToInstantiateIndex: 65535
      m_AllTileFlags: 1073741825
  - first: {x: 5, y: -9, z: 0}
    second:
      serializedVersion: 2
      m_TileIndex: 87
      m_TileSpriteIndex: 87
      m_TileMatrixIndex: 0
      m_TileColorIndex: 0
      m_TileObjectToInstantiateIndex: 65535
      m_AllTileFlags: 1073741825
  - first: {x: 6, y: -9, z: 0}
    second:
      serializedVersion: 2
      m_TileIndex: 88
      m_TileSpriteIndex: 88
      m_TileMatrixIndex: 0
      m_TileColorIndex: 0
      m_TileObjectToInstantiateIndex: 65535
      m_AllTileFlags: 1073741825
  - first: {x: 7, y: -9, z: 0}
    second:
      serializedVersion: 2
      m_TileIndex: 89
      m_TileSpriteIndex: 89
      m_TileMatrixIndex: 0
      m_TileColorIndex: 0
      m_TileObjectToInstantiateIndex: 65535
      m_AllTileFlags: 1073741825
  - first: {x: 9, y: -9, z: 0}
    second:
      serializedVersion: 2
      m_TileIndex: 127
      m_TileSpriteIndex: 127
      m_TileMatrixIndex: 0
      m_TileColorIndex: 0
      m_TileObjectToInstantiateIndex: 65535
      m_AllTileFlags: 1073741825
  - first: {x: -2, y: -8, z: 0}
    second:
      serializedVersion: 2
      m_TileIndex: 70
      m_TileSpriteIndex: 70
      m_TileMatrixIndex: 0
      m_TileColorIndex: 0
      m_TileObjectToInstantiateIndex: 65535
      m_AllTileFlags: 1073741825
  - first: {x: -1, y: -8, z: 0}
    second:
      serializedVersion: 2
      m_TileIndex: 71
      m_TileSpriteIndex: 71
      m_TileMatrixIndex: 0
      m_TileColorIndex: 0
      m_TileObjectToInstantiateIndex: 65535
      m_AllTileFlags: 1073741825
  - first: {x: 0, y: -8, z: 0}
    second:
      serializedVersion: 2
      m_TileIndex: 72
      m_TileSpriteIndex: 72
      m_TileMatrixIndex: 0
      m_TileColorIndex: 0
      m_TileObjectToInstantiateIndex: 65535
      m_AllTileFlags: 1073741825
  - first: {x: 1, y: -8, z: 0}
    second:
      serializedVersion: 2
      m_TileIndex: 73
      m_TileSpriteIndex: 73
      m_TileMatrixIndex: 0
      m_TileColorIndex: 0
      m_TileObjectToInstantiateIndex: 65535
      m_AllTileFlags: 1073741825
  - first: {x: 2, y: -8, z: 0}
    second:
      serializedVersion: 2
      m_TileIndex: 74
      m_TileSpriteIndex: 74
      m_TileMatrixIndex: 0
      m_TileColorIndex: 0
      m_TileObjectToInstantiateIndex: 65535
      m_AllTileFlags: 1073741825
  - first: {x: 3, y: -8, z: 0}
    second:
      serializedVersion: 2
      m_TileIndex: 75
      m_TileSpriteIndex: 75
      m_TileMatrixIndex: 0
      m_TileColorIndex: 0
      m_TileObjectToInstantiateIndex: 65535
      m_AllTileFlags: 1073741825
  - first: {x: 4, y: -8, z: 0}
    second:
      serializedVersion: 2
      m_TileIndex: 76
      m_TileSpriteIndex: 76
      m_TileMatrixIndex: 0
      m_TileColorIndex: 0
      m_TileObjectToInstantiateIndex: 65535
      m_AllTileFlags: 1073741825
  - first: {x: 5, y: -8, z: 0}
    second:
      serializedVersion: 2
      m_TileIndex: 77
      m_TileSpriteIndex: 77
      m_TileMatrixIndex: 0
      m_TileColorIndex: 0
      m_TileObjectToInstantiateIndex: 65535
      m_AllTileFlags: 1073741825
  - first: {x: 6, y: -8, z: 0}
    second:
      serializedVersion: 2
      m_TileIndex: 78
      m_TileSpriteIndex: 78
      m_TileMatrixIndex: 0
      m_TileColorIndex: 0
      m_TileObjectToInstantiateIndex: 65535
      m_AllTileFlags: 1073741825
  - first: {x: 8, y: -8, z: 0}
    second:
      serializedVersion: 2
      m_TileIndex: 79
      m_TileSpriteIndex: 79
      m_TileMatrixIndex: 0
      m_TileColorIndex: 0
      m_TileObjectToInstantiateIndex: 65535
      m_AllTileFlags: 1073741825
  - first: {x: -2, y: -7, z: 0}
    second:
      serializedVersion: 2
      m_TileIndex: 58
      m_TileSpriteIndex: 58
      m_TileMatrixIndex: 0
      m_TileColorIndex: 0
      m_TileObjectToInstantiateIndex: 65535
      m_AllTileFlags: 1073741825
  - first: {x: -1, y: -7, z: 0}
    second:
      serializedVersion: 2
      m_TileIndex: 59
      m_TileSpriteIndex: 59
      m_TileMatrixIndex: 0
      m_TileColorIndex: 0
      m_TileObjectToInstantiateIndex: 65535
      m_AllTileFlags: 1073741825
  - first: {x: 0, y: -7, z: 0}
    second:
      serializedVersion: 2
      m_TileIndex: 60
      m_TileSpriteIndex: 60
      m_TileMatrixIndex: 0
      m_TileColorIndex: 0
      m_TileObjectToInstantiateIndex: 65535
      m_AllTileFlags: 1073741825
  - first: {x: 1, y: -7, z: 0}
    second:
      serializedVersion: 2
      m_TileIndex: 61
      m_TileSpriteIndex: 61
      m_TileMatrixIndex: 0
      m_TileColorIndex: 0
      m_TileObjectToInstantiateIndex: 65535
      m_AllTileFlags: 1073741825
  - first: {x: 2, y: -7, z: 0}
    second:
      serializedVersion: 2
      m_TileIndex: 62
      m_TileSpriteIndex: 62
      m_TileMatrixIndex: 0
      m_TileColorIndex: 0
      m_TileObjectToInstantiateIndex: 65535
      m_AllTileFlags: 1073741825
  - first: {x: 3, y: -7, z: 0}
    second:
      serializedVersion: 2
      m_TileIndex: 63
      m_TileSpriteIndex: 63
      m_TileMatrixIndex: 0
      m_TileColorIndex: 0
      m_TileObjectToInstantiateIndex: 65535
      m_AllTileFlags: 1073741825
  - first: {x: 4, y: -7, z: 0}
    second:
      serializedVersion: 2
      m_TileIndex: 64
      m_TileSpriteIndex: 64
      m_TileMatrixIndex: 0
      m_TileColorIndex: 0
      m_TileObjectToInstantiateIndex: 65535
      m_AllTileFlags: 1073741825
  - first: {x: 5, y: -7, z: 0}
    second:
      serializedVersion: 2
      m_TileIndex: 65
      m_TileSpriteIndex: 65
      m_TileMatrixIndex: 0
      m_TileColorIndex: 0
      m_TileObjectToInstantiateIndex: 65535
      m_AllTileFlags: 1073741825
  - first: {x: 6, y: -7, z: 0}
    second:
      serializedVersion: 2
      m_TileIndex: 66
      m_TileSpriteIndex: 66
      m_TileMatrixIndex: 0
      m_TileColorIndex: 0
      m_TileObjectToInstantiateIndex: 65535
      m_AllTileFlags: 1073741825
  - first: {x: 7, y: -7, z: 0}
    second:
      serializedVersion: 2
      m_TileIndex: 67
      m_TileSpriteIndex: 67
      m_TileMatrixIndex: 0
      m_TileColorIndex: 0
      m_TileObjectToInstantiateIndex: 65535
      m_AllTileFlags: 1073741825
  - first: {x: 8, y: -7, z: 0}
    second:
      serializedVersion: 2
      m_TileIndex: 68
      m_TileSpriteIndex: 68
      m_TileMatrixIndex: 0
      m_TileColorIndex: 0
      m_TileObjectToInstantiateIndex: 65535
      m_AllTileFlags: 1073741825
  - first: {x: 9, y: -7, z: 0}
    second:
      serializedVersion: 2
      m_TileIndex: 69
      m_TileSpriteIndex: 69
      m_TileMatrixIndex: 0
      m_TileColorIndex: 0
      m_TileObjectToInstantiateIndex: 65535
      m_AllTileFlags: 1073741825
  - first: {x: -2, y: -6, z: 0}
    second:
      serializedVersion: 2
      m_TileIndex: 47
      m_TileSpriteIndex: 47
      m_TileMatrixIndex: 0
      m_TileColorIndex: 0
      m_TileObjectToInstantiateIndex: 65535
      m_AllTileFlags: 1073741825
  - first: {x: -1, y: -6, z: 0}
    second:
      serializedVersion: 2
      m_TileIndex: 48
      m_TileSpriteIndex: 48
      m_TileMatrixIndex: 0
      m_TileColorIndex: 0
      m_TileObjectToInstantiateIndex: 65535
      m_AllTileFlags: 1073741825
  - first: {x: 0, y: -6, z: 0}
    second:
      serializedVersion: 2
      m_TileIndex: 49
      m_TileSpriteIndex: 49
      m_TileMatrixIndex: 0
      m_TileColorIndex: 0
      m_TileObjectToInstantiateIndex: 65535
      m_AllTileFlags: 1073741825
  - first: {x: 2, y: -6, z: 0}
    second:
      serializedVersion: 2
      m_TileIndex: 50
      m_TileSpriteIndex: 50
      m_TileMatrixIndex: 0
      m_TileColorIndex: 0
      m_TileObjectToInstantiateIndex: 65535
      m_AllTileFlags: 1073741825
  - first: {x: 3, y: -6, z: 0}
    second:
      serializedVersion: 2
      m_TileIndex: 51
      m_TileSpriteIndex: 51
      m_TileMatrixIndex: 0
      m_TileColorIndex: 0
      m_TileObjectToInstantiateIndex: 65535
      m_AllTileFlags: 1073741825
  - first: {x: 4, y: -6, z: 0}
    second:
      serializedVersion: 2
      m_TileIndex: 52
      m_TileSpriteIndex: 52
      m_TileMatrixIndex: 0
      m_TileColorIndex: 0
      m_TileObjectToInstantiateIndex: 65535
      m_AllTileFlags: 1073741825
  - first: {x: 5, y: -6, z: 0}
    second:
      serializedVersion: 2
      m_TileIndex: 53
      m_TileSpriteIndex: 53
      m_TileMatrixIndex: 0
      m_TileColorIndex: 0
      m_TileObjectToInstantiateIndex: 65535
      m_AllTileFlags: 1073741825
  - first: {x: 6, y: -6, z: 0}
    second:
      serializedVersion: 2
      m_TileIndex: 54
      m_TileSpriteIndex: 54
      m_TileMatrixIndex: 0
      m_TileColorIndex: 0
      m_TileObjectToInstantiateIndex: 65535
      m_AllTileFlags: 1073741825
  - first: {x: 7, y: -6, z: 0}
    second:
      serializedVersion: 2
      m_TileIndex: 55
      m_TileSpriteIndex: 55
      m_TileMatrixIndex: 0
      m_TileColorIndex: 0
      m_TileObjectToInstantiateIndex: 65535
      m_AllTileFlags: 1073741825
  - first: {x: 8, y: -6, z: 0}
    second:
      serializedVersion: 2
      m_TileIndex: 56
      m_TileSpriteIndex: 56
      m_TileMatrixIndex: 0
      m_TileColorIndex: 0
      m_TileObjectToInstantiateIndex: 65535
      m_AllTileFlags: 1073741825
  - first: {x: 9, y: -6, z: 0}
    second:
      serializedVersion: 2
      m_TileIndex: 57
      m_TileSpriteIndex: 57
      m_TileMatrixIndex: 0
      m_TileColorIndex: 0
      m_TileObjectToInstantiateIndex: 65535
      m_AllTileFlags: 1073741825
  - first: {x: -2, y: -5, z: 0}
    second:
      serializedVersion: 2
      m_TileIndex: 38
      m_TileSpriteIndex: 38
      m_TileMatrixIndex: 0
      m_TileColorIndex: 0
      m_TileObjectToInstantiateIndex: 65535
      m_AllTileFlags: 1073741825
  - first: {x: 2, y: -5, z: 0}
    second:
      serializedVersion: 2
      m_TileIndex: 39
      m_TileSpriteIndex: 39
      m_TileMatrixIndex: 0
      m_TileColorIndex: 0
      m_TileObjectToInstantiateIndex: 65535
      m_AllTileFlags: 1073741825
  - first: {x: 3, y: -5, z: 0}
    second:
      serializedVersion: 2
      m_TileIndex: 40
      m_TileSpriteIndex: 40
      m_TileMatrixIndex: 0
      m_TileColorIndex: 0
      m_TileObjectToInstantiateIndex: 65535
      m_AllTileFlags: 1073741825
  - first: {x: 4, y: -5, z: 0}
    second:
      serializedVersion: 2
      m_TileIndex: 41
      m_TileSpriteIndex: 41
      m_TileMatrixIndex: 0
      m_TileColorIndex: 0
      m_TileObjectToInstantiateIndex: 65535
      m_AllTileFlags: 1073741825
  - first: {x: 5, y: -5, z: 0}
    second:
      serializedVersion: 2
      m_TileIndex: 42
      m_TileSpriteIndex: 42
      m_TileMatrixIndex: 0
      m_TileColorIndex: 0
      m_TileObjectToInstantiateIndex: 65535
      m_AllTileFlags: 1073741825
  - first: {x: 6, y: -5, z: 0}
    second:
      serializedVersion: 2
      m_TileIndex: 43
      m_TileSpriteIndex: 43
      m_TileMatrixIndex: 0
      m_TileColorIndex: 0
      m_TileObjectToInstantiateIndex: 65535
      m_AllTileFlags: 1073741825
  - first: {x: 7, y: -5, z: 0}
    second:
      serializedVersion: 2
      m_TileIndex: 44
      m_TileSpriteIndex: 44
      m_TileMatrixIndex: 0
      m_TileColorIndex: 0
      m_TileObjectToInstantiateIndex: 65535
      m_AllTileFlags: 1073741825
  - first: {x: 8, y: -5, z: 0}
    second:
      serializedVersion: 2
      m_TileIndex: 45
      m_TileSpriteIndex: 45
      m_TileMatrixIndex: 0
      m_TileColorIndex: 0
      m_TileObjectToInstantiateIndex: 65535
      m_AllTileFlags: 1073741825
  - first: {x: 9, y: -5, z: 0}
    second:
      serializedVersion: 2
      m_TileIndex: 46
      m_TileSpriteIndex: 46
      m_TileMatrixIndex: 0
      m_TileColorIndex: 0
      m_TileObjectToInstantiateIndex: 65535
      m_AllTileFlags: 1073741825
  - first: {x: -3, y: -4, z: 0}
    second:
      serializedVersion: 2
      m_TileIndex: 26
      m_TileSpriteIndex: 26
      m_TileMatrixIndex: 0
      m_TileColorIndex: 0
      m_TileObjectToInstantiateIndex: 65535
      m_AllTileFlags: 1073741825
  - first: {x: -2, y: -4, z: 0}
    second:
      serializedVersion: 2
      m_TileIndex: 27
      m_TileSpriteIndex: 27
      m_TileMatrixIndex: 0
      m_TileColorIndex: 0
      m_TileObjectToInstantiateIndex: 65535
      m_AllTileFlags: 1073741825
  - first: {x: -1, y: -4, z: 0}
    second:
      serializedVersion: 2
      m_TileIndex: 28
      m_TileSpriteIndex: 28
      m_TileMatrixIndex: 0
      m_TileColorIndex: 0
      m_TileObjectToInstantiateIndex: 65535
      m_AllTileFlags: 1073741825
  - first: {x: 0, y: -4, z: 0}
    second:
      serializedVersion: 2
      m_TileIndex: 29
      m_TileSpriteIndex: 29
      m_TileMatrixIndex: 0
      m_TileColorIndex: 0
      m_TileObjectToInstantiateIndex: 65535
      m_AllTileFlags: 1073741825
  - first: {x: 2, y: -4, z: 0}
    second:
      serializedVersion: 2
      m_TileIndex: 30
      m_TileSpriteIndex: 30
      m_TileMatrixIndex: 0
      m_TileColorIndex: 0
      m_TileObjectToInstantiateIndex: 65535
      m_AllTileFlags: 1073741825
  - first: {x: 3, y: -4, z: 0}
    second:
      serializedVersion: 2
      m_TileIndex: 31
      m_TileSpriteIndex: 31
      m_TileMatrixIndex: 0
      m_TileColorIndex: 0
      m_TileObjectToInstantiateIndex: 65535
      m_AllTileFlags: 1073741825
  - first: {x: 4, y: -4, z: 0}
    second:
      serializedVersion: 2
      m_TileIndex: 32
      m_TileSpriteIndex: 32
      m_TileMatrixIndex: 0
      m_TileColorIndex: 0
      m_TileObjectToInstantiateIndex: 65535
      m_AllTileFlags: 1073741825
  - first: {x: 5, y: -4, z: 0}
    second:
      serializedVersion: 2
      m_TileIndex: 33
      m_TileSpriteIndex: 33
      m_TileMatrixIndex: 0
      m_TileColorIndex: 0
      m_TileObjectToInstantiateIndex: 65535
      m_AllTileFlags: 1073741825
  - first: {x: 6, y: -4, z: 0}
    second:
      serializedVersion: 2
      m_TileIndex: 34
      m_TileSpriteIndex: 34
      m_TileMatrixIndex: 0
      m_TileColorIndex: 0
      m_TileObjectToInstantiateIndex: 65535
      m_AllTileFlags: 1073741825
  - first: {x: 7, y: -4, z: 0}
    second:
      serializedVersion: 2
      m_TileIndex: 35
      m_TileSpriteIndex: 35
      m_TileMatrixIndex: 0
      m_TileColorIndex: 0
      m_TileObjectToInstantiateIndex: 65535
      m_AllTileFlags: 1073741825
  - first: {x: 8, y: -4, z: 0}
    second:
      serializedVersion: 2
      m_TileIndex: 36
      m_TileSpriteIndex: 36
      m_TileMatrixIndex: 0
      m_TileColorIndex: 0
      m_TileObjectToInstantiateIndex: 65535
      m_AllTileFlags: 1073741825
  - first: {x: 9, y: -4, z: 0}
    second:
      serializedVersion: 2
      m_TileIndex: 37
      m_TileSpriteIndex: 37
      m_TileMatrixIndex: 0
      m_TileColorIndex: 0
      m_TileObjectToInstantiateIndex: 65535
      m_AllTileFlags: 1073741825
  - first: {x: -3, y: -3, z: 0}
    second:
      serializedVersion: 2
      m_TileIndex: 13
      m_TileSpriteIndex: 13
      m_TileMatrixIndex: 0
      m_TileColorIndex: 0
      m_TileObjectToInstantiateIndex: 65535
      m_AllTileFlags: 1073741825
  - first: {x: -2, y: -3, z: 0}
    second:
      serializedVersion: 2
      m_TileIndex: 14
      m_TileSpriteIndex: 14
      m_TileMatrixIndex: 0
      m_TileColorIndex: 0
      m_TileObjectToInstantiateIndex: 65535
      m_AllTileFlags: 1073741825
  - first: {x: -1, y: -3, z: 0}
    second:
      serializedVersion: 2
      m_TileIndex: 15
      m_TileSpriteIndex: 15
      m_TileMatrixIndex: 0
      m_TileColorIndex: 0
      m_TileObjectToInstantiateIndex: 65535
      m_AllTileFlags: 1073741825
  - first: {x: 0, y: -3, z: 0}
    second:
      serializedVersion: 2
      m_TileIndex: 16
      m_TileSpriteIndex: 16
      m_TileMatrixIndex: 0
      m_TileColorIndex: 0
      m_TileObjectToInstantiateIndex: 65535
      m_AllTileFlags: 1073741825
  - first: {x: 1, y: -3, z: 0}
    second:
      serializedVersion: 2
      m_TileIndex: 17
      m_TileSpriteIndex: 17
      m_TileMatrixIndex: 0
      m_TileColorIndex: 0
      m_TileObjectToInstantiateIndex: 65535
      m_AllTileFlags: 1073741825
  - first: {x: 2, y: -3, z: 0}
    second:
      serializedVersion: 2
      m_TileIndex: 18
      m_TileSpriteIndex: 18
      m_TileMatrixIndex: 0
      m_TileColorIndex: 0
      m_TileObjectToInstantiateIndex: 65535
      m_AllTileFlags: 1073741825
  - first: {x: 3, y: -3, z: 0}
    second:
      serializedVersion: 2
      m_TileIndex: 19
      m_TileSpriteIndex: 19
      m_TileMatrixIndex: 0
      m_TileColorIndex: 0
      m_TileObjectToInstantiateIndex: 65535
      m_AllTileFlags: 1073741825
  - first: {x: 4, y: -3, z: 0}
    second:
      serializedVersion: 2
      m_TileIndex: 20
      m_TileSpriteIndex: 20
      m_TileMatrixIndex: 0
      m_TileColorIndex: 0
      m_TileObjectToInstantiateIndex: 65535
      m_AllTileFlags: 1073741825
  - first: {x: 5, y: -3, z: 0}
    second:
      serializedVersion: 2
      m_TileIndex: 21
      m_TileSpriteIndex: 21
      m_TileMatrixIndex: 0
      m_TileColorIndex: 0
      m_TileObjectToInstantiateIndex: 65535
      m_AllTileFlags: 1073741825
  - first: {x: 6, y: -3, z: 0}
    second:
      serializedVersion: 2
      m_TileIndex: 22
      m_TileSpriteIndex: 22
      m_TileMatrixIndex: 0
      m_TileColorIndex: 0
      m_TileObjectToInstantiateIndex: 65535
      m_AllTileFlags: 1073741825
  - first: {x: 7, y: -3, z: 0}
    second:
      serializedVersion: 2
      m_TileIndex: 23
      m_TileSpriteIndex: 23
      m_TileMatrixIndex: 0
      m_TileColorIndex: 0
      m_TileObjectToInstantiateIndex: 65535
      m_AllTileFlags: 1073741825
  - first: {x: 8, y: -3, z: 0}
    second:
      serializedVersion: 2
      m_TileIndex: 24
      m_TileSpriteIndex: 24
      m_TileMatrixIndex: 0
      m_TileColorIndex: 0
      m_TileObjectToInstantiateIndex: 65535
      m_AllTileFlags: 1073741825
  - first: {x: 9, y: -3, z: 0}
    second:
      serializedVersion: 2
      m_TileIndex: 25
      m_TileSpriteIndex: 25
      m_TileMatrixIndex: 0
      m_TileColorIndex: 0
      m_TileObjectToInstantiateIndex: 65535
      m_AllTileFlags: 1073741825
  - first: {x: -3, y: -2, z: 0}
    second:
      serializedVersion: 2
      m_TileIndex: 0
      m_TileSpriteIndex: 0
      m_TileMatrixIndex: 0
      m_TileColorIndex: 0
      m_TileObjectToInstantiateIndex: 65535
      m_AllTileFlags: 1073741825
  - first: {x: -2, y: -2, z: 0}
    second:
      serializedVersion: 2
      m_TileIndex: 1
      m_TileSpriteIndex: 1
      m_TileMatrixIndex: 0
      m_TileColorIndex: 0
      m_TileObjectToInstantiateIndex: 65535
      m_AllTileFlags: 1073741825
  - first: {x: -1, y: -2, z: 0}
    second:
      serializedVersion: 2
      m_TileIndex: 2
      m_TileSpriteIndex: 2
      m_TileMatrixIndex: 0
      m_TileColorIndex: 0
      m_TileObjectToInstantiateIndex: 65535
      m_AllTileFlags: 1073741825
  - first: {x: 0, y: -2, z: 0}
    second:
      serializedVersion: 2
      m_TileIndex: 3
      m_TileSpriteIndex: 3
      m_TileMatrixIndex: 0
      m_TileColorIndex: 0
      m_TileObjectToInstantiateIndex: 65535
      m_AllTileFlags: 1073741825
  - first: {x: 1, y: -2, z: 0}
    second:
      serializedVersion: 2
      m_TileIndex: 4
      m_TileSpriteIndex: 4
      m_TileMatrixIndex: 0
      m_TileColorIndex: 0
      m_TileObjectToInstantiateIndex: 65535
      m_AllTileFlags: 1073741825
  - first: {x: 2, y: -2, z: 0}
    second:
      serializedVersion: 2
      m_TileIndex: 5
      m_TileSpriteIndex: 5
      m_TileMatrixIndex: 0
      m_TileColorIndex: 0
      m_TileObjectToInstantiateIndex: 65535
      m_AllTileFlags: 1073741825
  - first: {x: 3, y: -2, z: 0}
    second:
      serializedVersion: 2
      m_TileIndex: 6
      m_TileSpriteIndex: 6
      m_TileMatrixIndex: 0
      m_TileColorIndex: 0
      m_TileObjectToInstantiateIndex: 65535
      m_AllTileFlags: 1073741825
  - first: {x: 4, y: -2, z: 0}
    second:
      serializedVersion: 2
      m_TileIndex: 7
      m_TileSpriteIndex: 7
      m_TileMatrixIndex: 0
      m_TileColorIndex: 0
      m_TileObjectToInstantiateIndex: 65535
      m_AllTileFlags: 1073741825
  - first: {x: 5, y: -2, z: 0}
    second:
      serializedVersion: 2
      m_TileIndex: 8
      m_TileSpriteIndex: 8
      m_TileMatrixIndex: 0
      m_TileColorIndex: 0
      m_TileObjectToInstantiateIndex: 65535
      m_AllTileFlags: 1073741825
  - first: {x: 6, y: -2, z: 0}
    second:
      serializedVersion: 2
      m_TileIndex: 9
      m_TileSpriteIndex: 9
      m_TileMatrixIndex: 0
      m_TileColorIndex: 0
      m_TileObjectToInstantiateIndex: 65535
      m_AllTileFlags: 1073741825
  - first: {x: 7, y: -2, z: 0}
    second:
      serializedVersion: 2
      m_TileIndex: 10
      m_TileSpriteIndex: 10
      m_TileMatrixIndex: 0
      m_TileColorIndex: 0
      m_TileObjectToInstantiateIndex: 65535
      m_AllTileFlags: 1073741825
  - first: {x: 8, y: -2, z: 0}
    second:
      serializedVersion: 2
      m_TileIndex: 11
      m_TileSpriteIndex: 11
      m_TileMatrixIndex: 0
      m_TileColorIndex: 0
      m_TileObjectToInstantiateIndex: 65535
      m_AllTileFlags: 1073741825
  - first: {x: 9, y: -2, z: 0}
    second:
      serializedVersion: 2
      m_TileIndex: 12
      m_TileSpriteIndex: 12
      m_TileMatrixIndex: 0
      m_TileColorIndex: 0
      m_TileObjectToInstantiateIndex: 65535
      m_AllTileFlags: 1073741825
  m_AnimatedTiles: {}
  m_TileAssetArray:
  - m_RefCount: 1
    m_Data: {fileID: 11400000, guid: 73d02f2daacb9114e8c7ae603d3db406, type: 2}
  - m_RefCount: 1
    m_Data: {fileID: 11400000, guid: 65628695463660644a1d49f85dc0fd19, type: 2}
  - m_RefCount: 1
    m_Data: {fileID: 11400000, guid: 4975ca630d5a88b4885bcc4355b5bf2a, type: 2}
  - m_RefCount: 1
    m_Data: {fileID: 11400000, guid: ed9953cdc2f67ed4c8f9c3df1f347ed2, type: 2}
  - m_RefCount: 1
    m_Data: {fileID: 11400000, guid: 9be7ed86a66b4044181b60bf7e7b23b6, type: 2}
  - m_RefCount: 1
    m_Data: {fileID: 11400000, guid: 532c74667aee92a42afc4263afcd80d2, type: 2}
  - m_RefCount: 1
    m_Data: {fileID: 11400000, guid: e4a5a39e895112b42a3ce2ecb8d50750, type: 2}
  - m_RefCount: 1
    m_Data: {fileID: 11400000, guid: f4df4e5387e5a4d438bbba0922387b9a, type: 2}
  - m_RefCount: 1
    m_Data: {fileID: 11400000, guid: 734069e02f3175d4ea13f2ee0ddb5233, type: 2}
  - m_RefCount: 1
    m_Data: {fileID: 11400000, guid: c2f05fc33d832e545b485399844a4b99, type: 2}
  - m_RefCount: 1
    m_Data: {fileID: 11400000, guid: 82e8a32f90d6e0042a1642fa707691d7, type: 2}
  - m_RefCount: 1
    m_Data: {fileID: 11400000, guid: 52220e4dfda04e64cbb64240d4ab1ec7, type: 2}
  - m_RefCount: 1
    m_Data: {fileID: 11400000, guid: 245221f957e8b3a40a9442314e64bc81, type: 2}
  - m_RefCount: 1
    m_Data: {fileID: 11400000, guid: 7f0b1a52fe09b3441a6e9e3dffd2b2c1, type: 2}
  - m_RefCount: 1
    m_Data: {fileID: 11400000, guid: 01f7f8cc4c3ee0d46870a62de0fad092, type: 2}
  - m_RefCount: 1
    m_Data: {fileID: 11400000, guid: a2b0c6b2ddf50d846853dec8b7288f76, type: 2}
  - m_RefCount: 1
    m_Data: {fileID: 11400000, guid: df6c1696e4ffd5845b796cd69981ddd5, type: 2}
  - m_RefCount: 1
    m_Data: {fileID: 11400000, guid: 81e63f3e563009e42a48dac91114458a, type: 2}
  - m_RefCount: 1
    m_Data: {fileID: 11400000, guid: 8e24e5e28803df444a44b1cca2540d5a, type: 2}
  - m_RefCount: 1
    m_Data: {fileID: 11400000, guid: 7283b3a4acca16e438fc95eb3a638e68, type: 2}
  - m_RefCount: 1
    m_Data: {fileID: 11400000, guid: a20a30906c6734146ba10a3bd7ac82b1, type: 2}
  - m_RefCount: 1
    m_Data: {fileID: 11400000, guid: 755e81dcd127a9a40b453a19fc1a7714, type: 2}
  - m_RefCount: 1
    m_Data: {fileID: 11400000, guid: 6ad9bdd057811fa4883a64065c74e18c, type: 2}
  - m_RefCount: 1
    m_Data: {fileID: 11400000, guid: 5f9e1b75f5b8ee04081e318247bd81bd, type: 2}
  - m_RefCount: 1
    m_Data: {fileID: 11400000, guid: 27273a9a5be9e8d48b7f80c25cf0b8a0, type: 2}
  - m_RefCount: 1
    m_Data: {fileID: 11400000, guid: cb686e218f516c141971f4231831a97e, type: 2}
  - m_RefCount: 1
    m_Data: {fileID: 11400000, guid: e00a9b1f9c1437a4b9746e208eae20f2, type: 2}
  - m_RefCount: 1
    m_Data: {fileID: 11400000, guid: f54aa39917b33fb41a993c6825f486ad, type: 2}
  - m_RefCount: 1
    m_Data: {fileID: 11400000, guid: 7b021544139f17b48b496e4420228677, type: 2}
  - m_RefCount: 1
    m_Data: {fileID: 11400000, guid: f40d9a0b4452ff34787afd693e1af230, type: 2}
  - m_RefCount: 1
    m_Data: {fileID: 11400000, guid: 96776838c4ba3534ba94583faccc6632, type: 2}
  - m_RefCount: 1
    m_Data: {fileID: 11400000, guid: 571905100931f4b48af5024cc0f95ad4, type: 2}
  - m_RefCount: 1
    m_Data: {fileID: 11400000, guid: fda993a0b78c236448655bda4c6ee00f, type: 2}
  - m_RefCount: 1
    m_Data: {fileID: 11400000, guid: abc4567a471df39439120a60bc271b73, type: 2}
  - m_RefCount: 1
    m_Data: {fileID: 11400000, guid: 6e26bd6fa38b3d142bc553335d4d3a3f, type: 2}
  - m_RefCount: 1
    m_Data: {fileID: 11400000, guid: cbec83277c562bc4199565f3ec3872f9, type: 2}
  - m_RefCount: 1
    m_Data: {fileID: 11400000, guid: 22dc03299191ba243b414dd459fec6d5, type: 2}
  - m_RefCount: 1
    m_Data: {fileID: 11400000, guid: 9d9f0ad836ca5ce48a72e60bf6d830bc, type: 2}
  - m_RefCount: 1
    m_Data: {fileID: 11400000, guid: 6c6f733967114054c85b1ffadc123106, type: 2}
  - m_RefCount: 1
    m_Data: {fileID: 11400000, guid: fbf452c359fa4f0448abbb8cf7e29472, type: 2}
  - m_RefCount: 1
    m_Data: {fileID: 11400000, guid: 07a62fd34ff6ec14196621e05840c295, type: 2}
  - m_RefCount: 1
    m_Data: {fileID: 11400000, guid: 3f32104c0aa07e64ba16c0e25938ee74, type: 2}
  - m_RefCount: 1
    m_Data: {fileID: 11400000, guid: f01244dbace3df84ea2d3df5ebe4715c, type: 2}
  - m_RefCount: 1
    m_Data: {fileID: 11400000, guid: f3b34bac64849744f8c5b2f8f4447e39, type: 2}
  - m_RefCount: 1
    m_Data: {fileID: 11400000, guid: 8fe7254165df56647ae30e39730d2296, type: 2}
  - m_RefCount: 1
    m_Data: {fileID: 11400000, guid: e43ea2c9b0e109f49b972660b631c2aa, type: 2}
  - m_RefCount: 1
    m_Data: {fileID: 11400000, guid: 259b475fd9b5f514f818426031ee102d, type: 2}
  - m_RefCount: 1
    m_Data: {fileID: 11400000, guid: 2e285489ce0bd2f418cf2734fb0a7fa7, type: 2}
  - m_RefCount: 1
    m_Data: {fileID: 11400000, guid: 1f6d73cf3626b66419ef8b6f17d0e512, type: 2}
  - m_RefCount: 1
    m_Data: {fileID: 11400000, guid: fabc904eebb277d4bad8e1efd1a6ab19, type: 2}
  - m_RefCount: 1
    m_Data: {fileID: 11400000, guid: 7b757f52fa27835498de59e0eec447d1, type: 2}
  - m_RefCount: 1
    m_Data: {fileID: 11400000, guid: eee075b90d8b07443a7e3b563c617341, type: 2}
  - m_RefCount: 1
    m_Data: {fileID: 11400000, guid: 6a55b5c01b234c7479c9003ed6351f43, type: 2}
  - m_RefCount: 1
    m_Data: {fileID: 11400000, guid: 614829a8659e8c243b2ed226b7f1ca88, type: 2}
  - m_RefCount: 1
    m_Data: {fileID: 11400000, guid: 79f6e08add75fa640af7e389f529f7b3, type: 2}
  - m_RefCount: 1
    m_Data: {fileID: 11400000, guid: 8fb5f6d2d2081024eb284a5f7e971ed9, type: 2}
  - m_RefCount: 1
    m_Data: {fileID: 11400000, guid: d0edc1ea7e6708942a2c56fb84167388, type: 2}
  - m_RefCount: 1
    m_Data: {fileID: 11400000, guid: d898ffa79ad4b2745a1dd84fc9618ff5, type: 2}
  - m_RefCount: 1
    m_Data: {fileID: 11400000, guid: 328031fbc0694b843a61a5341783514b, type: 2}
  - m_RefCount: 1
    m_Data: {fileID: 11400000, guid: a619563ad89daeb49a1f0228899235f5, type: 2}
  - m_RefCount: 1
    m_Data: {fileID: 11400000, guid: 8d9778ee45f024f4b93bcd0d2996181c, type: 2}
  - m_RefCount: 1
    m_Data: {fileID: 11400000, guid: 69adaf7a22191bc4e9e4fd6421aa7271, type: 2}
  - m_RefCount: 1
    m_Data: {fileID: 11400000, guid: 3ce32ecbf73b97d40b342391430f33ed, type: 2}
  - m_RefCount: 1
    m_Data: {fileID: 11400000, guid: b123b120caa90f244a30d42ee79af4df, type: 2}
  - m_RefCount: 1
    m_Data: {fileID: 11400000, guid: a83ee23c28fcea04b85ab32bfdaf8b7e, type: 2}
  - m_RefCount: 1
    m_Data: {fileID: 11400000, guid: 60a9e1b4506421a48aea70dac2fa35f1, type: 2}
  - m_RefCount: 1
    m_Data: {fileID: 11400000, guid: 653e1d5c49f16cf4eb4c37dcaaf4366d, type: 2}
  - m_RefCount: 1
    m_Data: {fileID: 11400000, guid: a6c9c09dd6deb98449e1521506b3bd5a, type: 2}
  - m_RefCount: 1
    m_Data: {fileID: 11400000, guid: 83794ab1656461843873f93bbf315c14, type: 2}
  - m_RefCount: 1
    m_Data: {fileID: 11400000, guid: 6c0cc98ba8aca034482ad1934a97a729, type: 2}
  - m_RefCount: 1
    m_Data: {fileID: 11400000, guid: 30269ed9e3810904d9032d9033320467, type: 2}
  - m_RefCount: 1
    m_Data: {fileID: 11400000, guid: 057b6719cf2624e48a91c3b6ebeb90d2, type: 2}
  - m_RefCount: 1
    m_Data: {fileID: 11400000, guid: 6b0585c981a1fd948ab36a195360c6ab, type: 2}
  - m_RefCount: 1
    m_Data: {fileID: 11400000, guid: a3203c4fd8cc5364a9e11cb7673785c3, type: 2}
  - m_RefCount: 1
    m_Data: {fileID: 11400000, guid: 4f0c4e6338bc7a544985e7cdc4af0c65, type: 2}
  - m_RefCount: 1
    m_Data: {fileID: 11400000, guid: 648a28f199bb3e243b47ebc639f2b96b, type: 2}
  - m_RefCount: 1
    m_Data: {fileID: 11400000, guid: 5db90ae6b0e881742bc72ab3ca165d31, type: 2}
  - m_RefCount: 1
    m_Data: {fileID: 11400000, guid: 77dbc31828e8af0469fc4b21ceb2cdf4, type: 2}
  - m_RefCount: 1
    m_Data: {fileID: 11400000, guid: c3d05316574f82749928e0a4b21a9de4, type: 2}
  - m_RefCount: 1
    m_Data: {fileID: 11400000, guid: a9cd5e6e3c4eb9f4d8fbb725cc17673f, type: 2}
  - m_RefCount: 1
    m_Data: {fileID: 11400000, guid: 7a8047e612d99224985a12926e03ea63, type: 2}
  - m_RefCount: 1
    m_Data: {fileID: 11400000, guid: c18392be95708a54ca240fed22991119, type: 2}
  - m_RefCount: 1
    m_Data: {fileID: 11400000, guid: 37dc05cb8eabd714da50da14798c4d31, type: 2}
  - m_RefCount: 1
    m_Data: {fileID: 11400000, guid: 70f50673e80e6f7489e4b266c1a2de76, type: 2}
  - m_RefCount: 1
    m_Data: {fileID: 11400000, guid: 742d11200b50abf4ca7426d8c34f9d3d, type: 2}
  - m_RefCount: 1
    m_Data: {fileID: 11400000, guid: 8386c8a14e8293440b73a07967046915, type: 2}
  - m_RefCount: 1
    m_Data: {fileID: 11400000, guid: 8d361382f6c77dd4f9bfab5abf35ab2a, type: 2}
  - m_RefCount: 1
    m_Data: {fileID: 11400000, guid: 20a8b8e3a873ac64ab1bfe8b2285732f, type: 2}
  - m_RefCount: 1
    m_Data: {fileID: 11400000, guid: 549503cc3a2e830458f26d0dfc36b707, type: 2}
  - m_RefCount: 1
    m_Data: {fileID: 11400000, guid: 92889ef2f6bfd344f864119af713e572, type: 2}
  - m_RefCount: 1
    m_Data: {fileID: 11400000, guid: 2e878cd4ad1b95343b062cd148739634, type: 2}
  - m_RefCount: 1
    m_Data: {fileID: 11400000, guid: e572e7666774f3d4ebe1ec10e512468c, type: 2}
  - m_RefCount: 1
    m_Data: {fileID: 11400000, guid: 60777dc1b04d96242a3a78b13687bab2, type: 2}
  - m_RefCount: 1
    m_Data: {fileID: 11400000, guid: 044fbf6f5c964d846a1a97c07f241b79, type: 2}
  - m_RefCount: 1
    m_Data: {fileID: 11400000, guid: 60d150c983730634fafeb412ff6e9f99, type: 2}
  - m_RefCount: 1
    m_Data: {fileID: 11400000, guid: 2f547738724831d41926077c29b32593, type: 2}
  - m_RefCount: 1
    m_Data: {fileID: 11400000, guid: 94d90055159c3db40beae97c7f7fa8e6, type: 2}
  - m_RefCount: 1
    m_Data: {fileID: 11400000, guid: fa674b34406e15246be6ab9e56b5309d, type: 2}
  - m_RefCount: 1
    m_Data: {fileID: 11400000, guid: 09b71e19e0609b14ba8521f33c9a9eee, type: 2}
  - m_RefCount: 1
    m_Data: {fileID: 11400000, guid: 3fcd51c44b875f1499792da5e7e50226, type: 2}
  - m_RefCount: 1
    m_Data: {fileID: 11400000, guid: 06acf2bd8c014c847ac4f6e8f1ab1937, type: 2}
  - m_RefCount: 1
    m_Data: {fileID: 11400000, guid: 1c8ace56c8344854c96c089634471292, type: 2}
  - m_RefCount: 1
    m_Data: {fileID: 11400000, guid: 54a6ada12c989714aae0a726c9a4d04e, type: 2}
  - m_RefCount: 1
    m_Data: {fileID: 11400000, guid: 0a31edbd9f3cb9f4fb7f982f89c73a54, type: 2}
  - m_RefCount: 1
    m_Data: {fileID: 11400000, guid: 6398bc92857617347b8578093fec31cd, type: 2}
  - m_RefCount: 1
    m_Data: {fileID: 11400000, guid: 7c4fb210b4255a84aad85ede115fa2e5, type: 2}
  - m_RefCount: 1
    m_Data: {fileID: 11400000, guid: cd6ef89bb009b0c4a9184db9f3a17edc, type: 2}
  - m_RefCount: 1
    m_Data: {fileID: 11400000, guid: b4235b58cef00a0459210eaecbda2ddc, type: 2}
  - m_RefCount: 1
    m_Data: {fileID: 11400000, guid: 158e17547fac76b46aa22b296e3de900, type: 2}
  - m_RefCount: 1
    m_Data: {fileID: 11400000, guid: d3e053f30df366645a0f69be1800eccb, type: 2}
  - m_RefCount: 1
    m_Data: {fileID: 11400000, guid: 3c1fda7846984d74dbcefca7f730ee8b, type: 2}
  - m_RefCount: 1
    m_Data: {fileID: 11400000, guid: ff440c75f905e8440a79e31b8f6def45, type: 2}
  - m_RefCount: 1
    m_Data: {fileID: 11400000, guid: f2690bb1bde89f04096a2baea590a753, type: 2}
  - m_RefCount: 1
    m_Data: {fileID: 11400000, guid: 4b6ff91426906a04d8165a8672b45c92, type: 2}
  - m_RefCount: 1
    m_Data: {fileID: 11400000, guid: b3a53c27539bf3b4b87d3c12fff726ca, type: 2}
  - m_RefCount: 1
    m_Data: {fileID: 11400000, guid: 9d246f52b3c122e47ae2519b54502eaa, type: 2}
  - m_RefCount: 1
    m_Data: {fileID: 11400000, guid: f18d232130b57bb4db2c7efae1ee5fe7, type: 2}
  - m_RefCount: 1
    m_Data: {fileID: 11400000, guid: c62029734e5091345aa951d3d73a92b5, type: 2}
  - m_RefCount: 1
    m_Data: {fileID: 11400000, guid: a7d7d833c2712b44b97829969bc3c7a8, type: 2}
  - m_RefCount: 1
    m_Data: {fileID: 11400000, guid: 6e1d59feb9205614b8cb171576f85390, type: 2}
  - m_RefCount: 1
    m_Data: {fileID: 11400000, guid: 8da02641fe8497e4ca5155d9c4e1eb6e, type: 2}
  - m_RefCount: 1
    m_Data: {fileID: 11400000, guid: a51e911c4a70c664784ced704250d3c8, type: 2}
  - m_RefCount: 1
    m_Data: {fileID: 11400000, guid: daa720682d2457842a7fbfade25c0a58, type: 2}
  - m_RefCount: 1
    m_Data: {fileID: 11400000, guid: 8b3ade7f33047ce4d95f289120337359, type: 2}
  - m_RefCount: 1
    m_Data: {fileID: 11400000, guid: ac924b5f3bb1ab742a6033c928e5956d, type: 2}
  - m_RefCount: 1
    m_Data: {fileID: 11400000, guid: 09a80551835f6544faf77d2cdcddc101, type: 2}
  - m_RefCount: 1
    m_Data: {fileID: 11400000, guid: 5dfb2bbcf518e9648bf8f705eb3e3cce, type: 2}
  - m_RefCount: 1
    m_Data: {fileID: 11400000, guid: 18d6f8f10c2ea0345af3fca998287b3a, type: 2}
  m_TileSpriteArray:
  - m_RefCount: 1
    m_Data: {fileID: 8490642196906846815, guid: 62a04e1d034978741904f47502cecfc0,
      type: 3}
  - m_RefCount: 1
    m_Data: {fileID: 7988907048659085410, guid: 62a04e1d034978741904f47502cecfc0,
      type: 3}
  - m_RefCount: 1
    m_Data: {fileID: 1873917168148291061, guid: 62a04e1d034978741904f47502cecfc0,
      type: 3}
  - m_RefCount: 1
    m_Data: {fileID: 4035501790466999928, guid: 62a04e1d034978741904f47502cecfc0,
      type: 3}
  - m_RefCount: 1
    m_Data: {fileID: -8717017754119436831, guid: 62a04e1d034978741904f47502cecfc0,
      type: 3}
  - m_RefCount: 1
    m_Data: {fileID: -8420670720628680731, guid: 62a04e1d034978741904f47502cecfc0,
      type: 3}
  - m_RefCount: 1
    m_Data: {fileID: 8266258911003420344, guid: 62a04e1d034978741904f47502cecfc0,
      type: 3}
  - m_RefCount: 1
    m_Data: {fileID: 4755373664117421245, guid: 62a04e1d034978741904f47502cecfc0,
      type: 3}
  - m_RefCount: 1
    m_Data: {fileID: 778136270091268006, guid: 62a04e1d034978741904f47502cecfc0, type: 3}
  - m_RefCount: 1
    m_Data: {fileID: 3400160013776356846, guid: 62a04e1d034978741904f47502cecfc0,
      type: 3}
  - m_RefCount: 1
    m_Data: {fileID: -8435285650344880516, guid: 62a04e1d034978741904f47502cecfc0,
      type: 3}
  - m_RefCount: 1
    m_Data: {fileID: 2376107565742220442, guid: 62a04e1d034978741904f47502cecfc0,
      type: 3}
  - m_RefCount: 1
    m_Data: {fileID: 1761957491966546689, guid: 62a04e1d034978741904f47502cecfc0,
      type: 3}
  - m_RefCount: 1
    m_Data: {fileID: -2455287069041890485, guid: 62a04e1d034978741904f47502cecfc0,
      type: 3}
  - m_RefCount: 1
    m_Data: {fileID: -702408572997326234, guid: 62a04e1d034978741904f47502cecfc0,
      type: 3}
  - m_RefCount: 1
    m_Data: {fileID: -4080137071908401649, guid: 62a04e1d034978741904f47502cecfc0,
      type: 3}
  - m_RefCount: 1
    m_Data: {fileID: 2311664880600967918, guid: 62a04e1d034978741904f47502cecfc0,
      type: 3}
  - m_RefCount: 1
    m_Data: {fileID: -3772098893637499282, guid: 62a04e1d034978741904f47502cecfc0,
      type: 3}
  - m_RefCount: 1
    m_Data: {fileID: -6813189574185817458, guid: 62a04e1d034978741904f47502cecfc0,
      type: 3}
  - m_RefCount: 1
    m_Data: {fileID: 7179352014698049699, guid: 62a04e1d034978741904f47502cecfc0,
      type: 3}
  - m_RefCount: 1
    m_Data: {fileID: -3639016157858113680, guid: 62a04e1d034978741904f47502cecfc0,
      type: 3}
  - m_RefCount: 1
    m_Data: {fileID: 5645451735475491846, guid: 62a04e1d034978741904f47502cecfc0,
      type: 3}
  - m_RefCount: 1
    m_Data: {fileID: 1432774421400288080, guid: 62a04e1d034978741904f47502cecfc0,
      type: 3}
  - m_RefCount: 1
    m_Data: {fileID: 4865326696082551069, guid: 62a04e1d034978741904f47502cecfc0,
      type: 3}
  - m_RefCount: 1
    m_Data: {fileID: -3787535494737378260, guid: 62a04e1d034978741904f47502cecfc0,
      type: 3}
  - m_RefCount: 1
    m_Data: {fileID: -7087341192871969019, guid: 62a04e1d034978741904f47502cecfc0,
      type: 3}
  - m_RefCount: 1
    m_Data: {fileID: -1825608592083352178, guid: 62a04e1d034978741904f47502cecfc0,
      type: 3}
  - m_RefCount: 1
    m_Data: {fileID: -4683339530408089196, guid: 62a04e1d034978741904f47502cecfc0,
      type: 3}
  - m_RefCount: 1
    m_Data: {fileID: 7979362951490992292, guid: 62a04e1d034978741904f47502cecfc0,
      type: 3}
  - m_RefCount: 1
    m_Data: {fileID: -6264777607469435119, guid: 62a04e1d034978741904f47502cecfc0,
      type: 3}
  - m_RefCount: 1
    m_Data: {fileID: -298017716872398204, guid: 62a04e1d034978741904f47502cecfc0,
      type: 3}
  - m_RefCount: 1
    m_Data: {fileID: 361865038524173698, guid: 62a04e1d034978741904f47502cecfc0, type: 3}
  - m_RefCount: 1
    m_Data: {fileID: -4326689981271417894, guid: 62a04e1d034978741904f47502cecfc0,
      type: 3}
  - m_RefCount: 1
    m_Data: {fileID: -8003906554491563137, guid: 62a04e1d034978741904f47502cecfc0,
      type: 3}
  - m_RefCount: 1
    m_Data: {fileID: 1522158807346708707, guid: 62a04e1d034978741904f47502cecfc0,
      type: 3}
  - m_RefCount: 1
    m_Data: {fileID: 1618129922804063390, guid: 62a04e1d034978741904f47502cecfc0,
      type: 3}
  - m_RefCount: 1
    m_Data: {fileID: 4544353558242898176, guid: 62a04e1d034978741904f47502cecfc0,
      type: 3}
  - m_RefCount: 1
    m_Data: {fileID: 6803150025632533582, guid: 62a04e1d034978741904f47502cecfc0,
      type: 3}
  - m_RefCount: 1
    m_Data: {fileID: 4152910327465251759, guid: 62a04e1d034978741904f47502cecfc0,
      type: 3}
  - m_RefCount: 1
    m_Data: {fileID: -6171851250645186540, guid: 62a04e1d034978741904f47502cecfc0,
      type: 3}
  - m_RefCount: 1
    m_Data: {fileID: -6416789122189490246, guid: 62a04e1d034978741904f47502cecfc0,
      type: 3}
  - m_RefCount: 1
    m_Data: {fileID: 1148596048466274273, guid: 62a04e1d034978741904f47502cecfc0,
      type: 3}
  - m_RefCount: 1
    m_Data: {fileID: -7195449788458874145, guid: 62a04e1d034978741904f47502cecfc0,
      type: 3}
  - m_RefCount: 1
    m_Data: {fileID: 6296137254373669167, guid: 62a04e1d034978741904f47502cecfc0,
      type: 3}
  - m_RefCount: 1
    m_Data: {fileID: -251864790952300765, guid: 62a04e1d034978741904f47502cecfc0,
      type: 3}
  - m_RefCount: 1
    m_Data: {fileID: -1052767623090001999, guid: 62a04e1d034978741904f47502cecfc0,
      type: 3}
  - m_RefCount: 1
    m_Data: {fileID: 7969752024136316262, guid: 62a04e1d034978741904f47502cecfc0,
      type: 3}
  - m_RefCount: 1
    m_Data: {fileID: 8934909955309115845, guid: 62a04e1d034978741904f47502cecfc0,
      type: 3}
  - m_RefCount: 1
    m_Data: {fileID: 5997434355426740714, guid: 62a04e1d034978741904f47502cecfc0,
      type: 3}
  - m_RefCount: 1
    m_Data: {fileID: 3212541487564439254, guid: 62a04e1d034978741904f47502cecfc0,
      type: 3}
  - m_RefCount: 1
    m_Data: {fileID: -6140826305895023941, guid: 62a04e1d034978741904f47502cecfc0,
      type: 3}
  - m_RefCount: 1
    m_Data: {fileID: -190942367214245151, guid: 62a04e1d034978741904f47502cecfc0,
      type: 3}
  - m_RefCount: 1
    m_Data: {fileID: -6361271296530862326, guid: 62a04e1d034978741904f47502cecfc0,
      type: 3}
  - m_RefCount: 1
    m_Data: {fileID: 403813026361821555, guid: 62a04e1d034978741904f47502cecfc0, type: 3}
  - m_RefCount: 1
    m_Data: {fileID: -979089462801025887, guid: 62a04e1d034978741904f47502cecfc0,
      type: 3}
  - m_RefCount: 1
    m_Data: {fileID: -5780151342473224253, guid: 62a04e1d034978741904f47502cecfc0,
      type: 3}
  - m_RefCount: 1
    m_Data: {fileID: -2890417086725145291, guid: 62a04e1d034978741904f47502cecfc0,
      type: 3}
  - m_RefCount: 1
    m_Data: {fileID: 2537453318863259956, guid: 62a04e1d034978741904f47502cecfc0,
      type: 3}
  - m_RefCount: 1
    m_Data: {fileID: -1400832232712754758, guid: 62a04e1d034978741904f47502cecfc0,
      type: 3}
  - m_RefCount: 1
    m_Data: {fileID: -1530432162528392, guid: 62a04e1d034978741904f47502cecfc0, type: 3}
  - m_RefCount: 1
    m_Data: {fileID: -2994928844648702356, guid: 62a04e1d034978741904f47502cecfc0,
      type: 3}
  - m_RefCount: 1
    m_Data: {fileID: -3576083122866698956, guid: 62a04e1d034978741904f47502cecfc0,
      type: 3}
  - m_RefCount: 1
    m_Data: {fileID: 9180185122099951743, guid: 62a04e1d034978741904f47502cecfc0,
      type: 3}
  - m_RefCount: 1
    m_Data: {fileID: 5584533179027898419, guid: 62a04e1d034978741904f47502cecfc0,
      type: 3}
  - m_RefCount: 1
    m_Data: {fileID: -8664873945852756419, guid: 62a04e1d034978741904f47502cecfc0,
      type: 3}
  - m_RefCount: 1
    m_Data: {fileID: -8129655836590701982, guid: 62a04e1d034978741904f47502cecfc0,
      type: 3}
  - m_RefCount: 1
    m_Data: {fileID: 2628091620012382583, guid: 62a04e1d034978741904f47502cecfc0,
      type: 3}
  - m_RefCount: 1
    m_Data: {fileID: 8876887957534861168, guid: 62a04e1d034978741904f47502cecfc0,
      type: 3}
  - m_RefCount: 1
    m_Data: {fileID: -6201439586384320899, guid: 62a04e1d034978741904f47502cecfc0,
      type: 3}
  - m_RefCount: 1
    m_Data: {fileID: 3113743566345720758, guid: 62a04e1d034978741904f47502cecfc0,
      type: 3}
  - m_RefCount: 1
    m_Data: {fileID: 3242445901158374030, guid: 62a04e1d034978741904f47502cecfc0,
      type: 3}
  - m_RefCount: 1
    m_Data: {fileID: 8388207307120750826, guid: 62a04e1d034978741904f47502cecfc0,
      type: 3}
  - m_RefCount: 1
    m_Data: {fileID: 749326418515318850, guid: 62a04e1d034978741904f47502cecfc0, type: 3}
  - m_RefCount: 1
    m_Data: {fileID: 9478795197586167, guid: 62a04e1d034978741904f47502cecfc0, type: 3}
  - m_RefCount: 1
    m_Data: {fileID: 4182479260922306610, guid: 62a04e1d034978741904f47502cecfc0,
      type: 3}
  - m_RefCount: 1
    m_Data: {fileID: -5047225978721033957, guid: 62a04e1d034978741904f47502cecfc0,
      type: 3}
  - m_RefCount: 1
    m_Data: {fileID: 590150312393183423, guid: 62a04e1d034978741904f47502cecfc0, type: 3}
  - m_RefCount: 1
    m_Data: {fileID: 4928565880463290548, guid: 62a04e1d034978741904f47502cecfc0,
      type: 3}
  - m_RefCount: 1
    m_Data: {fileID: -2996584346089854527, guid: 62a04e1d034978741904f47502cecfc0,
      type: 3}
  - m_RefCount: 1
    m_Data: {fileID: 4760556609404049016, guid: 62a04e1d034978741904f47502cecfc0,
      type: 3}
  - m_RefCount: 1
    m_Data: {fileID: -185618232069188130, guid: 62a04e1d034978741904f47502cecfc0,
      type: 3}
  - m_RefCount: 1
    m_Data: {fileID: -6457282284672588498, guid: 62a04e1d034978741904f47502cecfc0,
      type: 3}
  - m_RefCount: 1
    m_Data: {fileID: 666134904684700971, guid: 62a04e1d034978741904f47502cecfc0, type: 3}
  - m_RefCount: 1
    m_Data: {fileID: -3131756468849351659, guid: 62a04e1d034978741904f47502cecfc0,
      type: 3}
  - m_RefCount: 1
    m_Data: {fileID: 5424348670514132440, guid: 62a04e1d034978741904f47502cecfc0,
      type: 3}
  - m_RefCount: 1
    m_Data: {fileID: 2229891254195283420, guid: 62a04e1d034978741904f47502cecfc0,
      type: 3}
  - m_RefCount: 1
    m_Data: {fileID: 8571027462325331655, guid: 62a04e1d034978741904f47502cecfc0,
      type: 3}
  - m_RefCount: 1
    m_Data: {fileID: -2988324970441796947, guid: 62a04e1d034978741904f47502cecfc0,
      type: 3}
  - m_RefCount: 1
    m_Data: {fileID: 3421245086849777472, guid: 62a04e1d034978741904f47502cecfc0,
      type: 3}
  - m_RefCount: 1
    m_Data: {fileID: 2955584848549355173, guid: 62a04e1d034978741904f47502cecfc0,
      type: 3}
  - m_RefCount: 1
    m_Data: {fileID: 6992147927975329872, guid: 62a04e1d034978741904f47502cecfc0,
      type: 3}
  - m_RefCount: 1
    m_Data: {fileID: 2316366620572707740, guid: 62a04e1d034978741904f47502cecfc0,
      type: 3}
  - m_RefCount: 1
    m_Data: {fileID: -3246565788825186472, guid: 62a04e1d034978741904f47502cecfc0,
      type: 3}
  - m_RefCount: 1
    m_Data: {fileID: 7711548466176394848, guid: 62a04e1d034978741904f47502cecfc0,
      type: 3}
  - m_RefCount: 1
    m_Data: {fileID: -5619116058742842555, guid: 62a04e1d034978741904f47502cecfc0,
      type: 3}
  - m_RefCount: 1
    m_Data: {fileID: 6149306957867261499, guid: 62a04e1d034978741904f47502cecfc0,
      type: 3}
  - m_RefCount: 1
    m_Data: {fileID: -2419274715696069116, guid: 62a04e1d034978741904f47502cecfc0,
      type: 3}
  - m_RefCount: 1
    m_Data: {fileID: -1542962388774721918, guid: 62a04e1d034978741904f47502cecfc0,
      type: 3}
  - m_RefCount: 1
    m_Data: {fileID: -3846989261494495056, guid: 62a04e1d034978741904f47502cecfc0,
      type: 3}
  - m_RefCount: 1
    m_Data: {fileID: -7673242495530757358, guid: 62a04e1d034978741904f47502cecfc0,
      type: 3}
  - m_RefCount: 1
    m_Data: {fileID: -8592424096107761443, guid: 62a04e1d034978741904f47502cecfc0,
      type: 3}
  - m_RefCount: 1
    m_Data: {fileID: -4146658962222183008, guid: 62a04e1d034978741904f47502cecfc0,
      type: 3}
  - m_RefCount: 1
    m_Data: {fileID: -1553117273407126458, guid: 62a04e1d034978741904f47502cecfc0,
      type: 3}
  - m_RefCount: 1
    m_Data: {fileID: -4716602535706096335, guid: 62a04e1d034978741904f47502cecfc0,
      type: 3}
  - m_RefCount: 1
    m_Data: {fileID: -2402063034215647507, guid: 62a04e1d034978741904f47502cecfc0,
      type: 3}
  - m_RefCount: 1
    m_Data: {fileID: 1731697443031409149, guid: 62a04e1d034978741904f47502cecfc0,
      type: 3}
  - m_RefCount: 1
    m_Data: {fileID: 6295474923448991246, guid: 62a04e1d034978741904f47502cecfc0,
      type: 3}
  - m_RefCount: 1
    m_Data: {fileID: -3642419863204866038, guid: 62a04e1d034978741904f47502cecfc0,
      type: 3}
  - m_RefCount: 1
    m_Data: {fileID: -5664050802494629814, guid: 62a04e1d034978741904f47502cecfc0,
      type: 3}
  - m_RefCount: 1
    m_Data: {fileID: 8913244904277133699, guid: 62a04e1d034978741904f47502cecfc0,
      type: 3}
  - m_RefCount: 1
    m_Data: {fileID: 7620405453212275206, guid: 62a04e1d034978741904f47502cecfc0,
      type: 3}
  - m_RefCount: 1
    m_Data: {fileID: 2702405904602438015, guid: 62a04e1d034978741904f47502cecfc0,
      type: 3}
  - m_RefCount: 1
    m_Data: {fileID: -529817384411311156, guid: 62a04e1d034978741904f47502cecfc0,
      type: 3}
  - m_RefCount: 1
    m_Data: {fileID: 7421218225407433232, guid: 62a04e1d034978741904f47502cecfc0,
      type: 3}
  - m_RefCount: 1
    m_Data: {fileID: 7121432322982252667, guid: 62a04e1d034978741904f47502cecfc0,
      type: 3}
  - m_RefCount: 1
    m_Data: {fileID: -8558721662302090408, guid: 62a04e1d034978741904f47502cecfc0,
      type: 3}
  - m_RefCount: 1
    m_Data: {fileID: -8887993299131670151, guid: 62a04e1d034978741904f47502cecfc0,
      type: 3}
  - m_RefCount: 1
    m_Data: {fileID: -3393311792599043978, guid: 62a04e1d034978741904f47502cecfc0,
      type: 3}
  - m_RefCount: 1
    m_Data: {fileID: 6063359866685732961, guid: 62a04e1d034978741904f47502cecfc0,
      type: 3}
  - m_RefCount: 1
    m_Data: {fileID: -7914336775405316606, guid: 62a04e1d034978741904f47502cecfc0,
      type: 3}
  - m_RefCount: 1
    m_Data: {fileID: -7945353237565122060, guid: 62a04e1d034978741904f47502cecfc0,
      type: 3}
  - m_RefCount: 1
    m_Data: {fileID: 7829212896737242494, guid: 62a04e1d034978741904f47502cecfc0,
      type: 3}
  - m_RefCount: 1
    m_Data: {fileID: -3402451715102035049, guid: 62a04e1d034978741904f47502cecfc0,
      type: 3}
  - m_RefCount: 1
    m_Data: {fileID: 902773042312827701, guid: 62a04e1d034978741904f47502cecfc0, type: 3}
  - m_RefCount: 1
    m_Data: {fileID: 202502852184435092, guid: 62a04e1d034978741904f47502cecfc0, type: 3}
  - m_RefCount: 1
    m_Data: {fileID: -5094075432592294927, guid: 62a04e1d034978741904f47502cecfc0,
      type: 3}
  - m_RefCount: 1
    m_Data: {fileID: 8486786076564984107, guid: 62a04e1d034978741904f47502cecfc0,
      type: 3}
  - m_RefCount: 1
    m_Data: {fileID: 21300000, guid: f21444b4ec1f22c4db70ce653ef24913, type: 3}
  m_TileMatrixArray:
  - m_RefCount: 128
    m_Data:
      e00: 1
      e01: 0
      e02: 0
      e03: 0
      e10: 0
      e11: 1
      e12: 0
      e13: 0
      e20: 0
      e21: 0
      e22: 1
      e23: 0
      e30: 0
      e31: 0
      e32: 0
      e33: 1
  m_TileColorArray:
  - m_RefCount: 128
    m_Data: {r: 1, g: 1, b: 1, a: 1}
  m_TileObjectToInstantiateArray: []
  m_AnimationFrameRate: 1
  m_Color: {r: 1, g: 1, b: 1, a: 1}
  m_Origin: {x: -3, y: -14, z: 0}
  m_Size: {x: 13, y: 14, z: 1}
  m_TileAnchor: {x: 0.5, y: 0.5, z: 0}
  m_TileOrientation: 0
  m_TileOrientationMatrix:
    e00: 1
    e01: 0
    e02: 0
    e03: 0
    e10: 0
    e11: 1
    e12: 0
    e13: 0
    e20: 0
    e21: 0
    e22: 1
    e23: 0
    e30: 0
    e31: 0
    e32: 0
    e33: 1
--- !u!483693784 &7614778366633943118
TilemapRenderer:
  m_ObjectHideFlags: 0
  m_CorrespondingSourceObject: {fileID: 0}
  m_PrefabInstance: {fileID: 0}
  m_PrefabAsset: {fileID: 0}
  m_GameObject: {fileID: 5516593683084484}
  m_Enabled: 0
  m_CastShadows: 0
  m_ReceiveShadows: 0
  m_DynamicOccludee: 0
  m_MotionVectors: 1
  m_LightProbeUsage: 0
  m_ReflectionProbeUsage: 0
  m_RayTracingMode: 0
  m_RenderingLayerMask: 1
  m_RendererPriority: 0
  m_Materials:
  - {fileID: 10754, guid: 0000000000000000f000000000000000, type: 0}
  m_StaticBatchInfo:
    firstSubMesh: 0
    subMeshCount: 0
  m_StaticBatchRoot: {fileID: 0}
  m_ProbeAnchor: {fileID: 0}
  m_LightProbeVolumeOverride: {fileID: 0}
  m_ScaleInLightmap: 1
  m_ReceiveGI: 1
  m_PreserveUVs: 0
  m_IgnoreNormalsForChartDetection: 0
  m_ImportantGI: 0
  m_StitchLightmapSeams: 1
  m_SelectedEditorRenderState: 0
  m_MinimumChartSize: 4
  m_AutoUVMaxDistance: 0.5
  m_AutoUVMaxAngle: 89
  m_LightmapParameters: {fileID: 0}
  m_SortingLayerID: 0
  m_SortingLayer: 0
  m_SortingOrder: 0
  m_ChunkSize: {x: 32, y: 32, z: 32}
  m_ChunkCullingBounds: {x: 0, y: 0, z: 0}
  m_MaxChunkCount: 16
  m_MaxFrameAge: 16
  m_SortOrder: 0
  m_Mode: 0
  m_DetectChunkCullingBounds: 0
  m_MaskInteraction: 0
--- !u!1 &2921114151207183654
GameObject:
  m_ObjectHideFlags: 0
  m_CorrespondingSourceObject: {fileID: 0}
  m_PrefabInstance: {fileID: 0}
  m_PrefabAsset: {fileID: 0}
  serializedVersion: 6
  m_Component:
  - component: {fileID: 2747391777123795439}
  - component: {fileID: 3543134300075627977}
  m_Layer: 31
  m_Name: level1
  m_TagString: Untagged
  m_Icon: {fileID: 0}
  m_NavMeshLayer: 0
  m_StaticEditorFlags: 0
  m_IsActive: 1
--- !u!4 &2747391777123795439
Transform:
  m_ObjectHideFlags: 0
  m_CorrespondingSourceObject: {fileID: 0}
  m_PrefabInstance: {fileID: 0}
  m_PrefabAsset: {fileID: 0}
  m_GameObject: {fileID: 2921114151207183654}
  m_LocalRotation: {x: 0, y: 0, z: 0, w: 1}
  m_LocalPosition: {x: 0, y: 0, z: 0}
  m_LocalScale: {x: 1, y: 1, z: 1}
  m_Children:
  - {fileID: 7093228262044453087}
  m_Father: {fileID: 0}
  m_RootOrder: 0
  m_LocalEulerAnglesHint: {x: 0, y: 0, z: 0}
--- !u!156049354 &3543134300075627977
Grid:
  m_ObjectHideFlags: 0
  m_CorrespondingSourceObject: {fileID: 0}
  m_PrefabInstance: {fileID: 0}
  m_PrefabAsset: {fileID: 0}
  m_GameObject: {fileID: 2921114151207183654}
  m_Enabled: 1
  m_CellSize: {x: 1, y: 1, z: 0}
  m_CellGap: {x: 0, y: 0, z: 0}
  m_CellLayout: 0
  m_CellSwizzle: 0
--- !u!114 &5789814721469746681
MonoBehaviour:
  m_ObjectHideFlags: 0
  m_CorrespondingSourceObject: {fileID: 0}
  m_PrefabInstance: {fileID: 0}
  m_PrefabAsset: {fileID: 0}
  m_GameObject: {fileID: 0}
  m_Enabled: 1
  m_EditorHideFlags: 0
  m_Script: {fileID: 12395, guid: 0000000000000000e000000000000000, type: 0}
  m_Name: Palette Settings
  m_EditorClassIdentifier: 
  cellSizing: 0
