%YAML 1.1
%TAG !u! tag:unity3d.com,2011:
--- !u!74 &7400000
AnimationClip:
  m_ObjectHideFlags: 0
  m_CorrespondingSourceObject: {fileID: 0}
  m_PrefabInstance: {fileID: 0}
  m_PrefabAsset: {fileID: 0}
  m_Name: Player_rolling
  serializedVersion: 6
  m_Legacy: 0
  m_Compressed: 0
  m_UseHighQualityCurve: 1
  m_RotationCurves: []
  m_CompressedRotationCurves: []
  m_EulerCurves: []
  m_PositionCurves: []
  m_ScaleCurves: []
  m_FloatCurves: []
  m_PPtrCurves:
  - curve:
    - time: 0
      value: {fileID: 21300000, guid: 7e67c7f388c86804eb701ca7158e3b99, type: 3}
    - time: 0.04
      value: {fileID: 21300000, guid: 12c6754d8edb5af4499a6e15cd2b56b0, type: 3}
    - time: 0.08
      value: {fileID: 21300000, guid: fe965d0bee7b0d740ad4278258ff71bf, type: 3}
    - time: 0.12
      value: {fileID: 21300000, guid: 5e5c0b83db91eb54eb0225bbf50411b7, type: 3}
    - time: 0.16
      value: {fileID: 21300000, guid: a30a6f9607e13a346a354d3fa1f3057f, type: 3}
    - time: 0.2
      value: {fileID: 21300000, guid: 57894508174d0b24c800176111445996, type: 3}
    attribute: m_Sprite
    path: 
    classID: 212
    script: {fileID: 0}
  m_SampleRate: 25
  m_WrapMode: 0
  m_Bounds:
    m_Center: {x: 0, y: 0, z: 0}
    m_Extent: {x: 0, y: 0, z: 0}
  m_ClipBindingConstant:
    genericBindings:
    - serializedVersion: 2
      path: 0
      attribute: 0
      script: {fileID: 0}
      typeID: 212
      customType: 23
      isPPtrCurve: 1
    pptrCurveMapping:
    - {fileID: 21300000, guid: 7e67c7f388c86804eb701ca7158e3b99, type: 3}
    - {fileID: 21300000, guid: 12c6754d8edb5af4499a6e15cd2b56b0, type: 3}
    - {fileID: 21300000, guid: fe965d0bee7b0d740ad4278258ff71bf, type: 3}
    - {fileID: 21300000, guid: 5e5c0b83db91eb54eb0225bbf50411b7, type: 3}
    - {fileID: 21300000, guid: a30a6f9607e13a346a354d3fa1f3057f, type: 3}
    - {fileID: 21300000, guid: 57894508174d0b24c800176111445996, type: 3}
  m_AnimationClipSettings:
    serializedVersion: 2
    m_AdditiveReferencePoseClip: {fileID: 0}
    m_AdditiveReferencePoseTime: 0
    m_StartTime: 0
    m_StopTime: 0.24000001
    m_OrientationOffsetY: 0
    m_Level: 0
    m_CycleOffset: 0
    m_HasAdditiveReferencePose: 0
    m_LoopTime: 1
    m_LoopBlend: 0
    m_LoopBlendOrientation: 0
    m_LoopBlendPositionY: 0
    m_LoopBlendPositionXZ: 0
    m_KeepOriginalOrientation: 0
    m_KeepOriginalPositionY: 1
    m_KeepOriginalPositionXZ: 0
    m_HeightFromFeet: 0
    m_Mirror: 0
  m_EditorCurves: []
  m_EulerEditorCurves: []
  m_HasGenericRootTransform: 0
  m_HasMotionFloatCurves: 0
  m_Events: []
