%YAML 1.1
%TAG !u! tag:unity3d.com,2011:
--- !u!74 &7400000
AnimationClip:
  m_ObjectHideFlags: 0
  m_CorrespondingSourceObject: {fileID: 0}
  m_PrefabInstance: {fileID: 0}
  m_PrefabAsset: {fileID: 0}
  m_Name: attack_joe
  serializedVersion: 6
  m_Legacy: 0
  m_Compressed: 0
  m_UseHighQualityCurve: 1
  m_RotationCurves: []
  m_CompressedRotationCurves: []
  m_EulerCurves: []
  m_PositionCurves: []
  m_ScaleCurves: []
  m_FloatCurves: []
  m_PPtrCurves:
  - curve:
    - time: 0
      value: {fileID: 21300000, guid: 41c96af330978964aa7b7d872af58f3e, type: 3}
    - time: 0.055555556
      value: {fileID: 21300000, guid: 01eb8b3939b0b4449a48d8eb47fdb25e, type: 3}
    - time: 0.11111111
      value: {fileID: 21300000, guid: 92192b58c43d2d74aad2834175b4d2ac, type: 3}
    - time: 0.16666667
      value: {fileID: 21300000, guid: ca13a5200d1ec544cb7967f774c97ac6, type: 3}
    - time: 0.22222222
      value: {fileID: 21300000, guid: 1e37a91a1bc723f40bb3e9bb89148ee2, type: 3}
    - time: 0.2777778
      value: {fileID: 21300000, guid: eb4da74f1bbcee9488597bd2fd6a2779, type: 3}
    attribute: m_Sprite
    path: 
    classID: 212
    script: {fileID: 0}
  m_SampleRate: 18
  m_WrapMode: 0
  m_Bounds:
    m_Center: {x: 0, y: 0, z: 0}
    m_Extent: {x: 0, y: 0, z: 0}
  m_ClipBindingConstant:
    genericBindings:
    - serializedVersion: 2
      path: 0
      attribute: 0
      script: {fileID: 0}
      typeID: 212
      customType: 23
      isPPtrCurve: 1
    pptrCurveMapping:
    - {fileID: 21300000, guid: 41c96af330978964aa7b7d872af58f3e, type: 3}
    - {fileID: 21300000, guid: 01eb8b3939b0b4449a48d8eb47fdb25e, type: 3}
    - {fileID: 21300000, guid: 92192b58c43d2d74aad2834175b4d2ac, type: 3}
    - {fileID: 21300000, guid: ca13a5200d1ec544cb7967f774c97ac6, type: 3}
    - {fileID: 21300000, guid: 1e37a91a1bc723f40bb3e9bb89148ee2, type: 3}
    - {fileID: 21300000, guid: eb4da74f1bbcee9488597bd2fd6a2779, type: 3}
  m_AnimationClipSettings:
    serializedVersion: 2
    m_AdditiveReferencePoseClip: {fileID: 0}
    m_AdditiveReferencePoseTime: 0
    m_StartTime: 0
    m_StopTime: 0.33333334
    m_OrientationOffsetY: 0
    m_Level: 0
    m_CycleOffset: 0
    m_HasAdditiveReferencePose: 0
    m_LoopTime: 1
    m_LoopBlend: 0
    m_LoopBlendOrientation: 0
    m_LoopBlendPositionY: 0
    m_LoopBlendPositionXZ: 0
    m_KeepOriginalOrientation: 0
    m_KeepOriginalPositionY: 1
    m_KeepOriginalPositionXZ: 0
    m_HeightFromFeet: 0
    m_Mirror: 0
  m_EditorCurves: []
  m_EulerEditorCurves: []
  m_HasGenericRootTransform: 0
  m_HasMotionFloatCurves: 0
  m_Events: []
