,train,test,distance
0,33,6103,20.140193939208984
1,96,6103,20.37238121032715
2,367,6103,20.10707664489746
3,428,6103,20.317306518554688
4,790,6103,20.17213249206543
5,1133,6103,20.375125885009766
6,1210,6103,20.202566146850586
7,1291,6103,20.57072639465332
8,1308,6103,20.268325805664062
9,1602,6103,20.50492286682129
10,1699,6103,20.294668197631836
11,1780,6103,20.13559913635254
12,1820,6103,19.960580825805664
13,1821,6103,20.11737823486328
14,1971,6103,20.339563369750977
15,2181,6103,20.53773307800293
16,2195,6103,20.30729103088379
17,2317,6103,20.214529037475586
18,2321,6103,20.591955184936523
19,2596,6103,20.5968017578125
20,2729,6103,20.420679092407227
21,2991,6103,20.589658737182617
22,2999,6103,20.601919174194336
23,3032,6103,20.443674087524414
24,3358,6103,20.526325225830078
25,3370,6103,20.525251388549805
26,3415,6103,20.01974105834961
27,3711,6103,20.598520278930664
28,3785,6103,20.37621307373047
29,3876,6103,20.333415985107422
30,4240,6103,20.362016677856445
31,4338,6103,20.48069190979004
32,4476,6103,20.55143928527832
33,4676,6103,20.333419799804688
34,4978,6103,20.49349594116211
35,5026,6103,20.585525512695312
36,5132,6103,19.92270851135254
37,5137,6103,20.538408279418945
38,5404,6103,20.04692268371582
39,5564,6103,20.523069381713867
40,5821,6103,20.56393814086914
41,5885,6103,20.54530143737793
42,5968,6103,20.082015991210938
43,5997,6103,20.51844596862793
44,6052,6103,20.138715744018555
45,6069,6103,20.39969253540039
46,6093,6103,20.393577575683594
47,6128,6103,20.394617080688477
48,6299,6103,20.39932632446289
49,6361,6103,20.476381301879883
50,6372,6103,20.30742073059082
51,6572,6103,20.527620315551758
52,6816,6103,19.811262130737305
53,6847,6103,20.5681209564209
54,7344,6103,20.5583438873291
55,7389,6103,20.355491638183594
56,7527,6103,20.570032119750977
57,7588,6103,20.526302337646484
58,7653,6103,20.529523849487305
59,7732,6103,20.481508255004883
60,7828,6103,20.532196044921875
61,7861,6103,20.38117218017578
62,7865,6103,20.14642333984375
63,7882,6103,20.34445571899414
64,7994,6103,20.23075294494629
65,8031,6103,20.171497344970703
66,8184,6103,20.23876953125
67,8201,6103,20.5803165435791
68,8226,6103,20.100088119506836
69,8339,6103,20.437217712402344
70,8380,6103,20.549196243286133
71,8477,6103,20.367597579956055
72,8510,6103,20.60822105407715
73,8542,6103,20.282001495361328
74,8578,6103,20.408811569213867
75,8639,6103,20.46373176574707
76,8642,6103,20.442150115966797
77,8658,6103,20.34151840209961
78,8668,6103,20.5598201751709
79,8879,6103,20.37628936767578
80,8884,6103,20.400049209594727
81,8981,6103,20.452289581298828
82,9016,6103,20.44011688232422
83,9034,6103,20.426048278808594
84,9046,6103,20.4703369140625
85,9129,6103,20.2983341217041
86,9218,6103,20.523937225341797
87,9396,6103,20.5948429107666
88,9490,6103,20.557899475097656
89,9525,6103,20.415794372558594
90,9659,6103,20.36060905456543
91,9900,6103,20.24574089050293
92,10065,6103,20.509235382080078
93,10176,6103,20.394977569580078
94,10262,6103,20.45012664794922
95,10307,6103,20.606660842895508
96,10406,6103,20.528209686279297
97,10776,6103,20.370237350463867
98,10850,6103,20.520050048828125
99,10908,6103,20.10302734375
100,10944,6103,20.108383178710938
101,11135,6103,20.436853408813477
102,11220,6103,20.58037757873535
103,11512,6103,20.40839385986328
104,11535,6103,20.554473876953125
105,11644,6103,20.25406837463379
106,11813,6103,20.23650550842285
107,11870,6103,20.5600643157959
108,11893,6103,20.04286003112793
109,12009,6103,20.56830596923828
110,12016,6103,20.070960998535156
111,12052,6103,20.265607833862305
112,12146,6103,20.54003143310547
113,12154,6103,20.366788864135742
114,12192,6103,20.569347381591797
115,12342,6103,20.54405403137207
116,12483,6103,20.387874603271484
117,12693,6103,20.505786895751953
118,12870,6103,20.136638641357422
119,12946,6103,20.395689010620117
120,13163,6103,20.515216827392578
121,13301,6103,20.591472625732422
122,13346,6103,20.493648529052734
123,13422,6103,20.522003173828125
124,13437,6103,20.267824172973633
125,13454,6103,20.35715103149414
126,13456,6103,20.291086196899414
127,13529,6103,20.405561447143555
128,13542,6103,20.130998611450195
129,13545,6103,20.59156608581543
130,13765,6103,20.445114135742188
131,13786,6103,20.52773666381836
132,13881,6103,19.885663986206055
133,13958,6103,20.38170051574707
134,14070,6103,20.429855346679688
135,14089,6103,20.270774841308594
136,14112,6103,20.569841384887695
137,14160,6103,20.529146194458008
138,14161,6103,20.3970947265625
139,14204,6103,20.345211029052734
140,14286,6103,19.917285919189453
141,14287,6103,20.57788848876953
142,14334,6103,20.51001739501953
143,14636,6103,20.55644416809082
144,14689,6103,20.49090576171875
145,14941,6103,20.580747604370117
146,15109,6103,20.31644630432129
147,15112,6103,20.312028884887695
148,15476,6103,20.13860511779785
149,15582,6103,20.532217025756836
150,16278,6103,20.544692993164062
151,16607,6103,20.541728973388672
152,16704,6103,20.301109313964844
153,16835,6103,20.044836044311523
154,16933,6103,20.57390594482422
155,17046,6103,20.065120697021484
156,17154,6103,20.599870681762695
157,17203,6103,20.551387786865234
158,17242,6103,20.544389724731445
159,17293,6103,20.05912971496582
160,17348,6103,20.199846267700195
161,17488,6103,20.509958267211914
162,17519,6103,20.511245727539062
163,17571,6103,20.587963104248047
164,17636,6103,20.554391860961914
165,17738,6103,20.34401512145996
166,17770,6103,20.544761657714844
167,17798,6103,20.538557052612305
168,17894,6103,20.45406723022461
169,18006,6103,20.568761825561523
170,18047,6103,20.088964462280273
171,18079,6103,20.557287216186523
172,18092,6103,20.313154220581055
173,18155,6103,20.418180465698242
174,18217,6103,20.54692840576172
175,18443,6103,20.507835388183594
176,18461,6103,20.465652465820312
177,18564,6103,20.56400489807129
178,18609,6103,20.183422088623047
179,18621,6103,20.48059844970703
180,18637,6103,20.16828155517578
181,18723,6103,20.36033821105957
182,18778,6103,20.573389053344727
183,18840,6103,20.504642486572266
184,18860,6103,20.300487518310547
185,18926,6103,20.20834732055664
186,18943,6103,20.571319580078125
187,18959,6103,20.528884887695312
188,18968,6103,20.554697036743164
189,18995,6103,20.417922973632812
190,19001,6103,20.552217483520508
191,19169,6103,20.52935028076172
192,19175,6103,20.434724807739258
193,19238,6103,20.248212814331055
194,19257,6103,20.597959518432617
195,19261,6103,20.07176399230957
196,19510,6103,20.48006820678711
197,19538,6103,20.498023986816406
198,19605,6103,20.51171875
199,19718,6103,20.441709518432617
200,19793,6103,20.50701904296875
201,19824,6103,20.59109115600586
202,19903,6103,20.53441047668457
203,20093,6103,20.337791442871094
204,20183,6103,20.498432159423828
205,20296,6103,20.478073120117188
206,20305,6103,20.602073669433594
207,20374,6103,20.443918228149414
208,20376,6103,20.479585647583008
209,20394,6103,20.434492111206055
210,20503,6103,20.19344711303711
211,20530,6103,20.568395614624023
212,20561,6103,20.568519592285156
213,20740,6103,20.29169464111328
214,20757,6103,20.466997146606445
215,20772,6103,20.582067489624023
216,20966,6103,20.444889068603516
217,20986,6103,20.595930099487305
218,21104,6103,20.509023666381836
219,21280,6103,20.596717834472656
220,21328,6103,20.264371871948242
221,21333,6103,20.354679107666016
222,21546,6103,19.986541748046875
223,21820,6103,20.341333389282227
224,21980,6103,20.59792709350586
225,22024,6103,20.58439826965332
226,22139,6103,20.457551956176758
227,22308,6103,20.41210174560547
228,22432,6103,20.540943145751953
229,22458,6103,20.28639793395996
230,22465,6103,20.5981502532959
231,22624,6103,20.292531967163086
232,22712,6103,20.34759521484375
233,22790,6103,20.484926223754883
234,22923,6103,20.296594619750977
235,23003,6103,20.31966209411621
236,23049,6103,20.241605758666992
237,23050,6103,20.451513290405273
238,23138,6103,20.46404266357422
239,23186,6103,20.474855422973633
240,23246,6103,20.17499351501465
241,23344,6103,20.44178581237793
242,23359,6103,20.438798904418945
243,23414,6103,20.147411346435547
244,23488,6103,20.502620697021484
245,23707,6103,20.39845085144043
246,23839,6103,20.243988037109375
247,23877,6103,20.479576110839844
248,24063,6103,20.42182159423828
249,24202,6103,20.521873474121094
250,24370,6103,20.40787124633789
251,24883,6103,20.490520477294922
252,25140,6103,20.593833923339844
253,25142,6103,20.244140625
254,25568,6103,20.231246948242188
255,25827,6103,19.835521697998047
256,25895,6103,20.13962745666504
257,25937,6103,20.46651840209961
258,26042,6103,20.405521392822266
259,26045,6103,20.316869735717773
260,26113,6103,20.389816284179688
261,26124,6103,20.361665725708008
262,26126,6103,20.203651428222656
263,26279,6103,20.502500534057617
264,26285,6103,20.49724769592285
265,26307,6103,20.508607864379883
266,26546,6103,20.526138305664062
267,26657,6103,20.44141960144043
268,26712,6103,20.53223419189453
269,26956,6103,20.546995162963867
270,27205,6103,20.367233276367188
271,27215,6103,20.573204040527344
272,27245,6103,20.565677642822266
273,27255,6103,20.369461059570312
274,27292,6103,20.140953063964844
275,27329,6103,20.379470825195312
276,27494,6103,20.599937438964844
277,27582,6103,20.507888793945312
278,27604,6103,20.491500854492188
279,27906,6103,20.546476364135742
280,27919,6103,20.58047866821289
281,27995,6103,20.171566009521484
282,28158,6103,20.12569236755371
283,28159,6103,20.109954833984375
284,28173,6103,20.343883514404297
285,28287,6103,20.430234909057617
286,28303,6103,20.595247268676758
287,28632,6103,20.4464054107666
288,28737,6103,20.5079402923584
289,28824,6103,20.211729049682617
290,28932,6103,20.571792602539062
291,29195,6103,20.351511001586914
292,29290,6103,20.481853485107422
293,29514,6103,20.57278823852539
294,29541,6103,20.57672691345215
295,29542,6103,20.144336700439453
296,29629,6103,20.48801040649414
297,29981,6103,19.978269577026367
298,30104,6103,20.384313583374023
299,30227,6103,20.284618377685547
300,30296,6103,20.4392032623291
301,30492,6103,20.467761993408203
302,30676,6103,20.427114486694336
303,30872,6103,20.57307243347168
304,31102,6103,20.57088279724121
305,31135,6103,20.239839553833008
306,31266,6103,20.523609161376953
307,31413,6103,20.52937126159668
308,31518,6103,20.351160049438477
309,31532,6103,20.059993743896484
310,31568,6103,20.361066818237305
311,31912,6103,20.362546920776367
312,32076,6103,20.01396942138672
313,32084,6103,20.480985641479492
314,32142,6103,20.404064178466797
315,32349,6103,20.073057174682617
316,32442,6103,20.428390502929688
317,32458,6103,20.300077438354492
318,32462,6103,20.466032028198242
319,32493,6103,20.412248611450195
320,32749,6103,20.5513973236084
321,32830,6103,20.48184585571289
322,32909,6103,20.066991806030273
323,33032,6103,20.197351455688477
324,33033,6103,20.58310890197754
325,33038,6103,20.49728775024414
326,33105,6103,20.58956527709961
327,33415,6103,20.40595817565918
328,33430,6103,20.454519271850586
329,33432,6103,20.403614044189453
330,33435,6103,20.5170955657959
331,33540,6103,20.602209091186523
332,33578,6103,20.572071075439453
333,33806,6103,20.563756942749023
334,33870,6103,20.402250289916992
335,34005,6103,20.16330337524414
336,34042,6103,20.083236694335938
337,34068,6103,20.589101791381836
338,34314,6103,20.068517684936523
339,34389,6103,20.432857513427734
340,34703,6103,20.539644241333008
341,34777,6103,20.307296752929688
342,35091,6103,20.450523376464844
343,35108,6103,20.591337203979492
344,35200,6103,20.272937774658203
345,35314,6103,20.465843200683594
346,35398,6103,20.469205856323242
347,35460,6103,20.25560760498047
348,35572,6103,20.14126205444336
349,35619,6103,20.529253005981445
350,35910,6103,20.608657836914062
351,35947,6103,20.558412551879883
352,35971,6103,20.451494216918945
353,36045,6103,19.99848175048828
354,36332,6103,20.468862533569336
355,36463,6103,20.587799072265625
356,36606,6103,20.51150894165039
357,36679,6103,20.019533157348633
358,36788,6103,20.318571090698242
359,36810,6103,20.48179817199707
360,37051,6103,20.00162696838379
361,37133,6103,20.500551223754883
362,37152,6103,20.599069595336914
363,37228,6103,20.473295211791992
364,37275,6103,20.283794403076172
365,37329,6103,20.45747184753418
366,37497,6103,20.410675048828125
367,37504,6103,20.601282119750977
368,37802,6103,20.576648712158203
369,38003,6103,20.108882904052734
370,38014,6103,20.266843795776367
371,38086,6103,20.485498428344727
372,38139,6103,20.441566467285156
373,38180,6103,20.42413330078125
374,38304,6103,20.210447311401367
375,38323,6103,20.49279022216797
376,38342,6103,20.230796813964844
377,38390,6103,20.190074920654297
378,38418,6103,20.314590454101562
379,38424,6103,20.589475631713867
380,38450,6103,20.589637756347656
381,38572,6103,20.490095138549805
382,38573,6103,20.084400177001953
383,38581,6103,20.401935577392578
384,38675,6103,20.431224822998047
385,38978,6103,20.070711135864258
386,39050,6103,20.251970291137695
387,39111,6103,20.146053314208984
388,39156,6103,20.244558334350586
389,39187,6103,20.531631469726562
390,39190,6103,20.598180770874023
391,39250,6103,20.571327209472656
392,39264,6103,20.27048683166504
393,39268,6103,20.106595993041992
394,39283,6103,20.52060317993164
395,39309,6103,20.272045135498047
396,39354,6103,20.429380416870117
397,39499,6103,20.488061904907227
398,39616,6103,20.34174919128418
399,39733,6103,20.445480346679688
400,40139,6103,20.45077133178711
401,40252,6103,19.996843338012695
402,40528,6103,20.332754135131836
403,40603,6103,20.349302291870117
404,40637,6103,20.37784767150879
405,40715,6103,20.24704933166504
406,40884,6103,20.314495086669922
407,40960,6103,20.06538200378418
408,41067,6103,20.204097747802734
409,41259,6103,20.293354034423828
410,41365,6103,20.402978897094727
411,41427,6103,20.58610725402832
412,41482,6103,20.47838592529297
413,41510,6103,20.453142166137695
414,41681,6103,20.30029296875
415,42008,6103,20.34127426147461
416,42043,6103,19.73467445373535
417,42065,6103,20.589405059814453
418,42141,6103,20.528039932250977
419,42173,6103,20.486982345581055
420,42316,6103,20.469223022460938
421,42397,6103,20.38959312438965
422,42480,6103,20.552152633666992
423,42576,6103,20.249874114990234
424,42587,6103,20.340835571289062
425,42799,6103,20.423734664916992
426,42885,6103,20.280548095703125
427,42970,6103,20.46731185913086
428,42982,6103,20.362760543823242
429,42992,6103,20.575023651123047
430,43021,6103,20.5078182220459
431,43037,6103,20.405696868896484
432,43049,6103,20.344337463378906
433,43055,6103,20.323471069335938
434,43237,6103,20.36688995361328
435,43385,6103,20.490013122558594
436,43442,6103,20.340435028076172
437,43728,6103,20.59286880493164
438,43751,6103,20.279109954833984
439,43970,6103,20.38166618347168
440,44011,6103,19.996906280517578
441,44097,6103,20.468305587768555
442,44115,6103,20.115135192871094
443,44348,6103,20.043006896972656
444,44552,6103,20.3250789642334
445,44592,6103,20.362207412719727
446,44842,6103,20.140884399414062
447,44957,6103,20.477642059326172
448,45073,6103,20.25607681274414
449,45167,6103,20.490215301513672
450,45239,6103,19.9188175201416
451,45326,6103,20.30989646911621
452,45393,6103,20.274211883544922
453,45470,6103,20.480297088623047
454,45497,6103,20.33176612854004
455,45619,6103,20.150300979614258
456,45694,6103,20.57542610168457
457,45753,6103,20.346460342407227
458,45904,6103,20.24873161315918
459,45933,6103,20.29410743713379
460,45978,6103,20.24973487854004
461,46001,6103,20.014591217041016
462,46004,6103,20.555065155029297
463,46237,6103,19.95606803894043
464,46307,6103,20.322111129760742
465,46326,6103,20.422584533691406
466,46377,6103,20.50334930419922
467,46414,6103,20.546253204345703
468,46459,6103,20.583091735839844
469,46501,6103,20.54561424255371
470,46616,6103,20.59508514404297
471,46801,6103,20.017391204833984
472,47191,6103,20.60736846923828
473,47196,6103,20.552370071411133
474,47490,6103,20.406261444091797
475,47794,6103,20.254430770874023
476,47829,6103,20.605018615722656
477,47868,6103,20.112215042114258
478,48336,6103,20.592899322509766
479,48519,6103,20.438138961791992
480,48523,6103,20.43618392944336
481,48628,6103,20.02051544189453
482,48651,6103,20.485742568969727
483,48780,6103,20.307170867919922
484,48887,6103,20.284574508666992
485,48910,6103,20.241783142089844
486,49008,6103,20.598976135253906
487,49440,6103,20.405027389526367
488,49673,6103,20.573654174804688
489,49679,6103,20.380708694458008
490,49698,6103,20.034351348876953
491,49930,6103,20.442140579223633
492,49976,6103,19.97249984741211
493,50062,6103,20.547224044799805
494,50146,6103,20.484827041625977
495,50147,6103,20.045621871948242
496,50238,6103,20.24722671508789
497,50306,6103,20.563152313232422
498,50518,6103,20.603031158447266
499,50525,6103,20.24835968017578
500,50604,6103,20.55338478088379
501,50859,6103,20.447301864624023
502,50900,6103,20.5124568939209
503,51014,6103,20.600278854370117
504,51133,6103,20.581707000732422
505,51153,6103,20.405059814453125
506,51172,6103,20.538249969482422
507,51328,6103,20.33041763305664
508,51477,6103,20.49571418762207
509,51661,6103,20.60671043395996
510,51680,6103,20.573400497436523
511,51887,6103,20.59129524230957
512,52020,6103,20.485958099365234
513,52023,6103,20.419506072998047
514,52065,6103,20.39970588684082
515,52070,6103,20.185300827026367
516,52242,6103,20.58318328857422
517,52363,6103,20.449289321899414
518,52678,6103,20.554391860961914
519,52706,6103,20.429370880126953
520,52777,6103,20.34865379333496
521,52781,6103,20.11052894592285
522,53098,6103,20.23282241821289
523,53312,6103,20.578125
524,53430,6103,20.560583114624023
525,53436,6103,20.466318130493164
526,53557,6103,20.473079681396484
527,53785,6103,20.53407859802246
528,53860,6103,20.3075008392334
529,54044,6103,20.490121841430664
530,54053,6103,20.543956756591797
531,54055,6103,20.510665893554688
532,54130,6103,20.35462760925293
533,54137,6103,20.410655975341797
534,54234,6103,20.584308624267578
535,54314,6103,20.451805114746094
536,54423,6103,20.256162643432617
537,54425,6103,20.21547508239746
538,54544,6103,20.56689453125
539,54589,6103,20.397647857666016
540,54655,6103,20.56587791442871
541,54866,6103,20.49087905883789
542,55003,6103,20.597558975219727
543,55121,6103,20.5205078125
544,55157,6103,20.167871475219727
545,55294,6103,20.551362991333008
546,55350,6103,20.36048698425293
547,55368,6103,20.58049201965332
548,55442,6103,20.540618896484375
549,55656,6103,20.083614349365234
550,55672,6103,20.571897506713867
551,55741,6103,20.599742889404297
552,55765,6103,20.33592414855957
553,55999,6103,20.407684326171875
554,56014,6103,20.521841049194336
555,56045,6103,20.493518829345703
556,56055,6103,20.57630729675293
557,56153,6103,20.302227020263672
558,56200,6103,20.43868637084961
559,56332,6103,20.583702087402344
560,56461,6103,20.301815032958984
561,56591,6103,20.46046257019043
562,56684,6103,20.388545989990234
563,56699,6103,19.837255477905273
564,56845,6103,20.16765594482422
565,56929,6103,20.349328994750977
566,57000,6103,20.015512466430664
567,57001,6103,20.374074935913086
568,57278,6103,20.5035400390625
569,57285,6103,20.269784927368164
570,57295,6103,20.365997314453125
571,57315,6103,20.381717681884766
572,57377,6103,20.23699378967285
573,57570,6103,20.597898483276367
574,57628,6103,20.576522827148438
575,57649,6103,20.326208114624023
576,57875,6103,20.519283294677734
577,57876,6103,20.337936401367188
578,58110,6103,20.39261817932129
579,58130,6103,19.820791244506836
580,58195,6103,20.327232360839844
581,58418,6103,20.511693954467773
582,58556,6103,20.562477111816406
583,58637,6103,20.25639533996582
584,58751,6103,20.541967391967773
585,58759,6103,20.556232452392578
586,58873,6103,20.499340057373047
587,58878,6103,20.41938591003418
588,59007,6103,20.4460506439209
589,59324,6103,20.407669067382812
590,59356,6103,20.591205596923828
591,59395,6103,20.470796585083008
592,59796,6103,20.597537994384766
593,59812,6103,20.344127655029297
594,59910,6103,20.519981384277344
